{
  "project_info": {
    "project_number": "337123643128",
    "project_id": "isic-3rd-party-sdk-demo",
    "storage_bucket": "isic-3rd-party-sdk-demo.appspot.com"
  },
  "client": [
    {
      "client_info": {
        "mobilesdk_app_id": "1:337123643128:android:7f325fbe64c9095dac350d",
        "android_client_info": {
          "package_name": "org.isic.sdk.demo"
        }
      },
      "oauth_client": [
        {
          "client_id": "337123643128-shuj3onarrg018ihsjpbqbft73oi515g.apps.googleusercontent.com",
          "client_type": 3
        }
      ],
      "api_key": [
        {
          "current_key": "AIzaSyBUiHBn7VBI2IkGluOYY9RyvqaIrWQ8Ghk"
        }
      ],
      "services": {
        "appinvite_service": {
          "other_platform_oauth_client": [
            {
              "client_id": "337123643128-shuj3onarrg018ihsjpbqbft73oi515g.apps.googleusercontent.com",
              "client_type": 3
            },
            {
              "client_id": "337123643128-2b4f7nrnt24sd749sau6v3b8ttfmf2pr.apps.googleusercontent.com",
              "client_type": 2,
              "ios_info": {
                "bundle_id": "iOS"
              }
            }
          ]
        }
      }
    },
    {
      "client_info": {
        "mobilesdk_app_id": "1:337123643128:android:70c84865994a5f43ac350d",
        "android_client_info": {
          "package_name": "org.isic.sdk.demo.dev"
        }
      },
      "oauth_client": [
        {
          "client_id": "337123643128-shuj3onarrg018ihsjpbqbft73oi515g.apps.googleusercontent.com",
          "client_type": 3
        }
      ],
      "api_key": [
        {
          "current_key": "AIzaSyBUiHBn7VBI2IkGluOYY9RyvqaIrWQ8Ghk"
        }
      ],
      "services": {
        "appinvite_service": {
          "other_platform_oauth_client": [
            {
              "client_id": "337123643128-shuj3onarrg018ihsjpbqbft73oi515g.apps.googleusercontent.com",
              "client_type": 3
            },
            {
              "client_id": "337123643128-2b4f7nrnt24sd749sau6v3b8ttfmf2pr.apps.googleusercontent.com",
              "client_type": 2,
              "ios_info": {
                "bundle_id": "iOS"
              }
            }
          ]
        }
      }
    },
    {
      "client_info": {
        "mobilesdk_app_id": "1:337123643128:android:bb85787290d3c5ebac350d",
        "android_client_info": {
          "package_name": "org.isic.sdk.demo.stage"
        }
      },
      "oauth_client": [
        {
          "client_id": "337123643128-shuj3onarrg018ihsjpbqbft73oi515g.apps.googleusercontent.com",
          "client_type": 3
        }
      ],
      "api_key": [
        {
          "current_key": "AIzaSyBUiHBn7VBI2IkGluOYY9RyvqaIrWQ8Ghk"
        }
      ],
      "services": {
        "appinvite_service": {
          "other_platform_oauth_client": [
            {
              "client_id": "337123643128-shuj3onarrg018ihsjpbqbft73oi515g.apps.googleusercontent.com",
              "client_type": 3
            },
            {
              "client_id": "337123643128-2b4f7nrnt24sd749sau6v3b8ttfmf2pr.apps.googleusercontent.com",
              "client_type": 2,
              "ios_info": {
                "bundle_id": "iOS"
              }
            }
          ]
        }
      }
    }
  ],
  "configuration_version": "1"
}