{
    "actionOnStepFail": null, 
    "enabled": true, 
    "externalUuid4": "b15007d8-7515-4549-a642-c1c044a7bbda", 
    "interpreter": 1, 
    "key": "spsamcheckpgdata12existsonmaster", 
    "name": "SPSAM Check /pgdata/12 Exists on Master", 
    "osCredKey": "linuxrootuser", 
    "serverKey": "peekmasterserver", 
    "successExitCode": 0, 
    "type": "com.servertribe.attune.tuples.StepSshTuple"
}