{
    "actionOnStepFail": null, 
    "enabled": true, 
    "externalUuid4": "9a4af1d2-e876-4055-ac22-2ba3ec7083ae", 
    "interpreter": 1, 
    "key": "peekv3lintpdofficeteststart", 
    "name": "Peek v3 LIN TPD OFFICE Test Start", 
    "osCredKey": "linuxpeekuser", 
    "serverKey": "peekserver", 
    "successExitCode": 0, 
    "type": "com.servertribe.attune.tuples.StepSshTuple"
}