{
    "actionOnStepFail": null, 
    "concurrency": 1, 
    "enabled": true, 
    "externalUuid4": "0567be2a-0a14-48e8-b155-0ecaee615a8a", 
    "isBlueprint": false, 
    "key": "stlscreateemptytestdatabaseonmaster", 
    "links": [
        {
            "order": 0, 
            "stepKey": "stlsdroptestdatabaseonmaster"
        }, 
        {
            "order": 50, 
            "stepKey": "scetdomcreatetestdatabase"
        }, 
        {
            "order": 100, 
            "stepKey": "scetdomcreatetesttable"
        }
    ], 
    "name": "STLS Create Empty Test Database on Master", 
    "type": "com.servertribe.attune.tuples.StepGroupTuple"
}