{
    "concurrency": 1, 
    "enabled": true, 
    "externalUuid4": "5684ff8c-e45c-40fd-be5f-ebe85673bcdc", 
    "isBlueprint": false, 
    "key": "spsmresiliencetest", 
    "links": [
        {
            "order": 0, 
            "stepKey": "srttestsshfsmounted"
        }, 
        {
            "order": 50, 
            "stepKey": "srtlinstandbyreboot"
        }, 
        {
            "order": 100, 
            "stepKey": "srtlinstandbyrebootwait"
        }, 
        {
            "order": 150, 
            "stepKey": "srttestsshfsmounted"
        }, 
        {
            "order": 200, 
            "stepKey": "linreboot"
        }, 
        {
            "order": 250, 
            "stepKey": "linrebootwait"
        }, 
        {
            "order": 300, 
            "stepKey": "srttestsshfsmounted"
        }
    ], 
    "name": "SPSM Resilience Test", 
    "type": "com.servertribe.attune.tuples.StepGroupTuple"
}