{
    "actionOnStepFail": null, 
    "enabled": true, 
    "externalUuid4": "c606d6ba-5ff4-422e-ae18-82e55d89b200", 
    "interpreter": 1, 
    "key": "sssdeletepostgresqldirectorylogfiles", 
    "name": "SSS Delete PostgreSQL Directory Log Files", 
    "osCredKey": "linuxstandbypeekuser", 
    "serverKey": "peekstandbyserver", 
    "successExitCode": 0, 
    "type": "com.servertribe.attune.tuples.StepSshTuple"
}