{
    "actionOnStepFail": null, 
    "enabled": true, 
    "externalUuid4": "9b8f4136-85d2-46f3-8ed5-ea637d62fecb", 
    "interpreter": 1, 
    "key": "sssrestartpostgresql12onstandby", 
    "name": "SSS Restart postgresql-12 on Standby", 
    "osCredKey": "linuxrootuser", 
    "serverKey": "peekstandbyserver", 
    "successExitCode": 0, 
    "type": "com.servertribe.attune.tuples.StepSshTuple"
}