{
    "actionOnStepFail": null, 
    "enabled": true, 
    "externalUuid4": "91b550a9-8a25-4b11-8ba9-f54e91623b43", 
    "interpreter": 1, 
    "key": "sssdeletepostgresqldirectoryfilesonstandby", 
    "name": "SSS Delete PostgreSQL Directory Files on Standby", 
    "osCredKey": "linuxstandbypeekuser", 
    "serverKey": "peekstandbyserver", 
    "successExitCode": 0, 
    "type": "com.servertribe.attune.tuples.StepSshTuple"
}