{
    "actionOnStepFail": null, 
    "concurrency": 1, 
    "enabled": true, 
    "externalUuid4": "2e3aa392-31f8-4700-ab59-9fe3e926c1e5", 
    "isBlueprint": false, 
    "key": "spsmtestwriteandread", 
    "links": [
        {
            "order": 50, 
            "stepKey": "stwarwritefiletostandbyfrommaster"
        }, 
        {
            "order": 150, 
            "stepKey": "stwardeletefileonstandby"
        }
    ], 
    "name": "SPSM Test Write and Read", 
    "type": "com.servertribe.attune.tuples.StepGroupTuple"
}