{
    "enabled": true, 
    "externalUuid4": "e75ed45e-b37d-46a0-9886-4aa0b61aaf63", 
    "interpreter": 1, 
    "key": "cdpafcheckifwrittenonmaster", 
    "name": "CDPAF Check if Written on Master", 
    "osCredKey": "linuxmasterpeekuser", 
    "serverKey": "peekmasterserver", 
    "successExitCode": 0, 
    "type": "com.servertribe.attune.tuples.StepSshTuple"
}