{
    "enabled": true, 
    "externalUuid4": "13a466c3-cf29-4d79-b53c-b80aff4f6c55", 
    "interpreter": 1, 
    "key": "sctfdomcreatetestfailovertable", 
    "name": "SCTFDOM Create Test Failover Table", 
    "osCredKey": "linuxmasterpeekuser", 
    "serverKey": "peekmasterserver", 
    "successExitCode": 0, 
    "type": "com.servertribe.attune.tuples.StepSshTuple"
}