{
    "concurrency": 1, 
    "enabled": true, 
    "externalUuid4": "3452ac3c-29fb-4e94-8b18-de4f8dcbe35e", 
    "isBlueprint": true, 
    "key": "sdttfcreatetestfailoverdatabaseonmaster", 
    "links": [
        {
            "order": 0, 
            "stepKey": "sctfdomdroptestfailoverdatabaseonmaster"
        }, 
        {
            "order": 50, 
            "stepKey": "sctfdomcreatetestfailoverdatabase"
        }, 
        {
            "order": 100, 
            "stepKey": "sctfdomcreatetestfailovertable"
        }
    ], 
    "name": "SDTTF Create Test Failover Database on Master", 
    "type": "com.servertribe.attune.tuples.StepGroupTuple"
}