{
    "actionOnStepFail": null, 
    "concurrency": 1, 
    "enabled": true, 
    "externalUuid4": "74a5c109-d1c8-4806-bc8d-ef501a301146", 
    "isBlueprint": true, 
    "key": "setuppeekserverasmaster", 
    "links": [
        {
            "order": 250, 
            "stepKey": "spsamcheckpgdata12existsonmaster"
        }, 
        {
            "order": 300, 
            "stepKey": "spsampushpostgresqlconftomaster"
        }, 
        {
            "order": 400, 
            "stepKey": "ssmremovestandbyfilesonmaster"
        }, 
        {
            "order": 500, 
            "stepKey": "spsamrestartpostgresql12master"
        }, 
        {
            "order": 550, 
            "stepKey": "spsamcheckpostgresql12onmaster"
        }, 
        {
            "order": 600, 
            "stepKey": "spsamenablepeekservicesonmaster"
        }, 
        {
            "order": 650, 
            "stepKey": "peekv3linpdredeleteoldlogs"
        }, 
        {
            "order": 700, 
            "stepKey": "spsasrestartpeekonmaster"
        }, 
        {
            "order": 750, 
            "stepKey": "spsamcheckpeekserviceshavestartedonmaster"
        }, 
        {
            "order": 800, 
            "stepKey": "peekv3lintestpeekdeployment"
        }
    ], 
    "name": "Setup  Peek Server as Master", 
    "type": "com.servertribe.attune.tuples.StepGroupTuple"
}