{
    "enabled": true, 
    "externalUuid4": "429830f9-4ca9-4393-bfb4-4cb8d2b6f765", 
    "interpreter": 1, 
    "key": "spsasstartpeekonstandby", 
    "name": "SPSAS Start Peek on Standby", 
    "osCredKey": "linuxstandbypeekuser", 
    "serverKey": "peekstandbyserver", 
    "successExitCode": 0, 
    "type": "com.servertribe.attune.tuples.StepSshTuple"
}