{
    "actionOnStepFail": null, 
    "enabled": true, 
    "externalUuid4": "5894f340-dbae-4495-a186-02610caca2df", 
    "interpreter": 1, 
    "key": "peekv3lintpdfieldteststart", 
    "name": "Peek v3 LIN TPD FIELD Test Start", 
    "osCredKey": "linuxpeekuser", 
    "serverKey": "peekserver", 
    "successExitCode": 0, 
    "type": "com.servertribe.attune.tuples.StepSshTuple"
}