{
    "enabled": true, 
    "externalUuid4": "6c8c8e2a-8a80-4254-8ed9-d1217c5df66f", 
    "interpreter": 1, 
    "key": "spsmeditetcfstab", 
    "name": "SPSM Edit /etc/fstab", 
    "osCredKey": "linuxrootuser", 
    "serverKey": "peekmasterserver", 
    "successExitCode": 0, 
    "type": "com.servertribe.attune.tuples.StepSshTuple"
}