{
    "enabled": true, 
    "externalUuid4": "329bbafd-af79-4c3a-b568-c6a543ccd935", 
    "interpreter": 1, 
    "key": "spsmcreatepgwalarchiveremote", 
    "name": "SPSM Create /pgwal_archive/ Remote", 
    "osCredKey": "linuxrootuser", 
    "serverKey": "peekstandbyserver", 
    "successExitCode": 0, 
    "type": "com.servertribe.attune.tuples.StepSshTuple"
}