{
    "actionOnStepFail": null, 
    "enabled": true, 
    "externalUuid4": "3c79aaa2-a985-45e1-bb95-cf7fba18d749", 
    "interpreter": 1, 
    "key": "sssuntarmasterpostgresqdirectoryonstandby", 
    "name": "SSS Untar Master PostgreSQ Directory on Standby", 
    "osCredKey": "linuxstandbypeekuser", 
    "serverKey": "peekstandbyserver", 
    "successExitCode": 0, 
    "type": "com.servertribe.attune.tuples.StepSshTuple"
}