{
    "actionOnStepFail": null, 
    "enabled": true, 
    "externalUuid4": "5be06c66-1ecf-40e0-b8c5-f785d67b48f3", 
    "interpreter": 1, 
    "key": "sspstoppeekonstandby", 
    "name": "SSP Stop Peek on Standby", 
    "osCredKey": "linuxstandbypeekuser", 
    "serverKey": "peekstandbyserver", 
    "successExitCode": 0, 
    "type": "com.servertribe.attune.tuples.StepSshTuple"
}