{
    "actionOnStepFail": null, 
    "enabled": true, 
    "externalUuid4": "cb34aafa-6434-45dd-804b-9cefffcbf862", 
    "interpreter": 1, 
    "key": "stlsdroptestdatabaseonmaster", 
    "name": "STLS Drop Test Database on Master", 
    "osCredKey": "linuxmasterpeekuser", 
    "serverKey": "peekmasterserver", 
    "successExitCode": 0, 
    "type": "com.servertribe.attune.tuples.StepSshTuple"
}