{
    "enabled": true, 
    "externalUuid4": "8fd643fe-a561-4d87-b49a-44b23e420a4a", 
    "interpreter": 1, 
    "key": "sctfdomdroptestfailoverdatabaseonmaster", 
    "name": "SCTFDOM Drop Test Failover Database on Master", 
    "osCredKey": "linuxmasterpeekuser", 
    "serverKey": "peekmasterserver", 
    "successExitCode": 0, 
    "type": "com.servertribe.attune.tuples.StepSshTuple"
}