{
    "enabled": true, 
    "externalUuid4": "1c5b6c5e-9ebc-4f62-a1dc-f6513fddb9df", 
    "interpreter": 1, 
    "key": "linreboot", 
    "name": "LIN Reboot", 
    "osCredKey": "linuxrootuser", 
    "serverKey": "targetserverlin", 
    "successExitCode": 0, 
    "type": "com.servertribe.attune.tuples.StepSshTuple"
}