{
    "actionOnStepFail": null, 
    "enabled": true, 
    "externalUuid4": "ca82bc49-7f01-42d7-84e4-f7cabacaed22", 
    "interpreter": 1, 
    "key": "sssensurepostgresqlautoconfdoesnotexistonstandby", 
    "name": "SSS Ensure postgresql.auto.conf Does Not Exist on Standby", 
    "osCredKey": "linuxstandbypeekuser", 
    "serverKey": "peekstandbyserver", 
    "successExitCode": 0, 
    "type": "com.servertribe.attune.tuples.StepSshTuple"
}