{
    "externalUuid4": "c37ce6f8-cc82-4c72-aae6-053629691148", 
    "key": "linuxmasterpeekuser", 
    "name": "Linux Master: Peek User", 
    "showInPlan": true, 
    "type": "c.s.s.b.phv.LinOsCred"
}