{
    "actionOnStepFail": null, 
    "enabled": true, 
    "externalUuid4": "7c460298-2701-498e-a104-989189172489", 
    "interpreter": 1, 
    "key": "stlscheckifwrittenonstandby", 
    "name": "STLS Check if Written on Standby", 
    "osCredKey": "linuxstandbypeekuser", 
    "serverKey": "peekstandbyserver", 
    "successExitCode": 0, 
    "type": "com.servertribe.attune.tuples.StepSshTuple"
}