{
    "enabled": true, 
    "externalUuid4": "54e8bb7e-dcee-4e75-b50a-cd3d871c4b60", 
    "interpreter": 1, 
    "key": "spsmenableuserallowotherinetcfuseconf", 
    "name": "SPSM Enable user_allow_other in /etc/fuse.conf", 
    "osCredKey": "linuxrootuser", 
    "serverKey": "peekmasterserver", 
    "successExitCode": 0, 
    "type": "com.servertribe.attune.tuples.StepSshTuple"
}