{
    "concurrency": 1, 
    "enabled": true, 
    "externalUuid4": "f0c385da-9ade-4dd1-ab22-ddb1f0ad0118", 
    "isBlueprint": true, 
    "key": "checkdatabasepersistedafterfailover", 
    "links": [
        {
            "order": 0, 
            "stepKey": "cdpafcheckifwrittenonmaster"
        }
    ], 
    "name": "Check Database Persisted After Failover", 
    "type": "com.servertribe.attune.tuples.StepGroupTuple"
}