{
    "actionOnStepFail": null, 
    "enabled": true, 
    "externalUuid4": "e45e7095-4dab-418e-82f4-707be4959ede", 
    "interpreter": 1, 
    "key": "peekv3linpdredeleteoldlogs", 
    "name": "Peek v3 LIN PDRE Delete Old Logs", 
    "osCredKey": "linuxpeekuser", 
    "serverKey": "peekserver", 
    "successExitCode": 0, 
    "type": "com.servertribe.attune.tuples.StepSshTuple"
}