{
    "actionOnStepFail": null, 
    "enabled": true, 
    "externalUuid4": "ce515817-8d27-4725-8ef8-fa8a727bbff5", 
    "interpreter": 1, 
    "key": "sssensurestandbysignalexistsonstandby", 
    "name": "SSS Ensure standby.signal Exists on Standby", 
    "osCredKey": "linuxstandbypeekuser", 
    "serverKey": "peekstandbyserver", 
    "successExitCode": 0, 
    "type": "com.servertribe.attune.tuples.StepSshTuple"
}