{
    "enabled": true, 
    "externalUuid4": "402b9897-b2ed-4330-a5f8-cfacefe03228", 
    "interpreter": 1, 
    "key": "sctfdomcreatetestfailoverdatabase", 
    "name": "SCTFDOM Create Test Failover Database", 
    "osCredKey": "linuxmasterpeekuser", 
    "serverKey": "peekmasterserver", 
    "successExitCode": 0, 
    "type": "com.servertribe.attune.tuples.StepSshTuple"
}