{
    "actionOnStepFail": null, 
    "enabled": true, 
    "externalUuid4": "3f137494-4450-42dc-af40-434e59becf7d", 
    "interpreter": 1, 
    "key": "stlscheckifdeletedonstandby", 
    "name": "STLS Check if Deleted on Standby", 
    "osCredKey": "linuxstandbypeekuser", 
    "serverKey": "peekstandbyserver", 
    "successExitCode": 0, 
    "type": "com.servertribe.attune.tuples.StepSshTuple"
}