{
    "enabled": true, 
    "externalUuid4": "ba385d82-cf50-4ffd-9cf0-f96a7111827b", 
    "interpreter": 1, 
    "key": "aplvpeekrhel8ovirtaddvirtualdisksforpgwal", 
    "name": "APLV PEEK RHEL8 oVirt Add Virtual Disks for pg_wal", 
    "osCredKey": "linuxattuneuser", 
    "serverKey": "attuneosbuildserver", 
    "successExitCode": 0, 
    "type": "com.servertribe.attune.tuples.StepSshTuple"
}