{
    "actionOnStepFail": null, 
    "enabled": true, 
    "externalUuid4": "b2e32093-b604-4a1b-8ee8-32760d8d80cb", 
    "interpreter": 1, 
    "key": "peekv3lintpdlogicteststart", 
    "name": "Peek v3 LIN TPD LOGIC Test Start", 
    "osCredKey": "linuxpeekuser", 
    "serverKey": "peekserver", 
    "successExitCode": 0, 
    "type": "com.servertribe.attune.tuples.StepSshTuple"
}