{
    "concurrency": 1, 
    "enabled": true, 
    "externalUuid4": "7900b704-eaf1-4f9b-a807-1a1e967a81f6", 
    "isBlueprint": true, 
    "key": "addpgwallogicalvolumeovirt", 
    "links": [
        {
            "order": 0, 
            "stepKey": "aplvpeekrhel8ovirtaddvirtualdisksforpgwal"
        }, 
        {
            "order": 50, 
            "stepKey": "aplvsetuppgwalgeneric"
        }
    ], 
    "name": "Add pg_wal Logical Volume oVirt", 
    "type": "com.servertribe.attune.tuples.StepGroupTuple"
}