{
    "actionOnStepFail": null, 
    "enabled": true, 
    "externalUuid4": "9ae631bd-5c3f-4151-8c4c-d9994c309427", 
    "interpreter": 1, 
    "key": "stlsdeletetestrow", 
    "name": "STLS Delete Test Row", 
    "osCredKey": "linuxmasterpeekuser", 
    "serverKey": "peekmasterserver", 
    "successExitCode": 0, 
    "type": "com.servertribe.attune.tuples.StepSshTuple"
}