{
    "actionOnStepFail": null, 
    "concurrency": 2, 
    "enabled": true, 
    "externalUuid4": "be08679a-bad7-4b47-ac4d-1290c0010e54", 
    "isBlueprint": true, 
    "key": "spsasstartpeek", 
    "links": [
        {
            "order": 0, 
            "stepKey": "spsasstartpeekonstandby"
        }, 
        {
            "order": 50, 
            "stepKey": "spsasrestartpeekonmaster"
        }
    ], 
    "name": "SPSAS Start Peek", 
    "type": "com.servertribe.attune.tuples.StepGroupTuple"
}