{
    "enabled": true, 
    "externalUuid4": "1943da49-113b-43a2-9be8-0881519b9584", 
    "interpreter": 1, 
    "key": "attunev4rhelyumupdateall", 
    "name": "Attune v4 RHEL Yum Update All", 
    "osCredKey": "linuxrootuser", 
    "serverKey": "attuneserver", 
    "successExitCode": 0, 
    "type": "com.servertribe.attune.tuples.StepSshTuple"
}