{
    "actionOnStepFail": null, 
    "concurrency": 1, 
    "enabled": true, 
    "externalUuid4": "d1991de5-5464-4d3e-90f1-01ab64a3f051", 
    "isBlueprint": false, 
    "key": "attunev4lininstallpostgresql", 
    "links": [
        {
            "order": 0, 
            "stepKey": "attunev4linipgdeploypostgresql"
        }, 
        {
            "order": 50, 
            "stepKey": "attunev4linipgconfigurebuildinstall"
        }, 
        {
            "order": 100, 
            "stepKey": "attunev4linipginitcluster"
        }, 
        {
            "order": 150, 
            "stepKey": "attunev4linpgtunepostgresqlconf"
        }, 
        {
            "order": 200, 
            "stepKey": "attunev4linipginstallservicefile"
        }
    ], 
    "name": "Attune v4 LIN Install PostgreSQL", 
    "type": "com.servertribe.attune.tuples.StepGroupTuple"
}