{
    "externalUuid4": "8ace5ab5-2b8c-4472-a413-bcf5c92ee68b", 
    "fileName": null, 
    "formatKey": null, 
    "key": "wimlib", 
    "md5": null, 
    "name": "wimlib", 
    "remoteUri": null, 
    "size": null, 
    "type": "com.servertribe.attune.tuples.FileArchiveLargeTuple"
}