{
    "externalUuid4": "0fe43152-d5dd-4e09-8bdc-da73176df466", 
    "key": "kerberosfulldomainname", 
    "name": "Kerberos Full Domain Name", 
    "showInPlan": true, 
    "type": "c.s.s.b.phv.Text"
}