{
    "actionOnStepFail": "stop", 
    "enabled": true, 
    "externalUuid4": "978ba055-5b4f-48c1-be92-9ec6fedd524a", 
    "interpreter": 1, 
    "key": "wimlibunmountbootwim1", 
    "name": "wimlib Unmount boot.wim (1)", 
    "osCredKey": "linuxattuneuser", 
    "serverKey": "attuneosbuildserver", 
    "successExitCode": 0, 
    "type": "com.servertribe.attune.tuples.StepSshTuple"
}