{
    "actionOnStepFail": null, 
    "concurrency": 1, 
    "enabled": true, 
    "externalUuid4": "810d65ba-3368-4cbc-9b07-bc4a33403325", 
    "isBlueprint": false, 
    "key": "rhel8connecttorpmserver", 
    "links": [
        {
            "order": 0, 
            "stepKey": "ponr8cosdeployosconfigfiles"
        }, 
        {
            "order": 50, 
            "stepKey": "r8crscheckforrpmserver"
        }, 
        {
            "order": 100, 
            "stepKey": "r8crssetuprepofile"
        }, 
        {
            "order": 200, 
            "stepKey": "rhelupdatecatrust"
        }, 
        {
            "order": 250, 
            "stepKey": "r8crsverifyclientyumconfig"
        }, 
        {
            "order": 300, 
            "stepKey": "rhelyumupdatesecuritypackages"
        }, 
        {
            "order": 350, 
            "stepKey": "rhelyumupdateall"
        }
    ], 
    "name": "RHEL8 Connect to RPM Server", 
    "type": "com.servertribe.attune.tuples.StepGroupTuple"
}