{
    "actionOnStepFail": "stop", 
    "concurrency": 1, 
    "enabled": true, 
    "externalUuid4": "28e12fac-95a3-46ed-98f8-c94a86733525", 
    "isBlueprint": true, 
    "key": "ksextractwinpeisoparent", 
    "links": [
        {
            "order": 0, 
            "stepKey": "ksextractwinpeiso"
        }, 
        {
            "order": 50, 
            "stepKey": "ksextractwinpebootimg"
        }, 
        {
            "order": 100, 
            "stepKey": "ksmovebootimgtoextractedwinpefolder"
        }
    ], 
    "name": "KS Extract WinPE ISO - Parent", 
    "type": "com.servertribe.attune.tuples.StepGroupTuple"
}