{
    "enabled": true, 
    "externalUuid4": "b30a5493-ad65-43d7-8709-cc49ced6d0e3", 
    "interpreter": 1, 
    "key": "ba4sr8installrunattuneserverpolicy", 
    "name": "BA4SR8 Install run_attune_server Policy", 
    "osCredKey": "linuxrootuser", 
    "serverKey": "targetserverlin", 
    "successExitCode": 0, 
    "type": "com.servertribe.attune.tuples.StepSshTuple"
}