{
    "externalUuid4": "13a62d05-cce8-4ed7-9d39-86676c8305c5", 
    "key": "ksvmwarestoragepoolname", 
    "name": "KS VMWare: Storage Pool Name", 
    "showInPlan": true, 
    "type": "c.s.s.b.phv.Text"
}