{
    "enabled": true, 
    "externalUuid4": "7b7c3aef-35b0-4663-b8f1-0e89f6b3806b", 
    "interpreter": 1, 
    "key": "attunev4linpypgupdatebashprofile", 
    "name": "Attune v4 LIN PYPG Update bash_profile", 
    "osCredKey": "linuxattuneuser", 
    "serverKey": "attuneserver", 
    "successExitCode": 0, 
    "type": "com.servertribe.attune.tuples.StepSshTuple"
}