{
    "externalUuid4": "89466aed-3fcb-4c88-af67-24396daea1e6", 
    "fileName": "Attune_v4_Offline_PostgreSQL_Source.tar", 
    "formatKey": "tar", 
    "key": "attunev4offlinepostgresqlsource", 
    "md5": "3975d96c6d89e8cb89a4fb63390ae344", 
    "name": "Attune v4 Offline PostgreSQL Source", 
    "remoteUri": null, 
    "size": 20736000, 
    "type": "com.servertribe.attune.tuples.FileArchiveLargeTuple"
}