{
    "enabled": true, 
    "externalUuid4": "d31d671d-65b8-45a6-b7f8-715724f3af28", 
    "interpreter": 1, 
    "key": "ponr8puinstallcifsutils", 
    "name": "PONR8 PU Install CIFS Utils", 
    "osCredKey": "linuxrootuser", 
    "serverKey": "targetserverlin", 
    "successExitCode": 0, 
    "type": "com.servertribe.attune.tuples.StepSshTuple"
}