{
    "externalUuid4": "75b0549d-0053-4227-8f72-868ff5c98fbf", 
    "key": "winwin2019unattendedconfigwithdrivers", 
    "name": "WIN Win2019 Unattended Config with Drivers", 
    "type": "com.servertribe.attune.tuples.FileArchiveVersionedTuple"
}