{
    "enabled": true, 
    "externalUuid4": "778a88b5-07da-4d93-bb09-3f36a2b1d92b", 
    "interpreter": 1, 
    "key": "bshagenerateprivatekey", 
    "name": "BSHA Generate Private Key", 
    "osCredKey": "linuxattuneuser", 
    "serverKey": "targetserverlin", 
    "successExitCode": 0, 
    "type": "com.servertribe.attune.tuples.StepSshTuple"
}