{
    "enabled": true, 
    "externalUuid4": "166e0b25-5a6d-4e72-98c2-5bfed001a454", 
    "interpreter": 1, 
    "key": "sssetupsharedfolder", 
    "name": "SS Setup Shared Folder", 
    "osCredKey": "linuxrootuser", 
    "serverKey": "targetserverlin", 
    "successExitCode": 0, 
    "type": "com.servertribe.attune.tuples.StepSshTuple"
}