{
    "enabled": true, 
    "externalUuid4": "0f07e12d-4ca3-4714-a588-393dfe29f174", 
    "interpreter": 1, 
    "key": "bpatssadsetupdblvs", 
    "name": "BPATS SAD Setup DB LVs", 
    "osCredKey": "linuxrootuser", 
    "serverKey": "targetserverlin", 
    "successExitCode": 0, 
    "type": "com.servertribe.attune.tuples.StepSshTuple"
}