{
    "enabled": true, 
    "externalUuid4": "e44f5109-f1df-487e-bbed-9cdfea341dd7", 
    "interpreter": 1, 
    "key": "ponr8puinstallwireshark", 
    "name": "PONR8 PU Install Wireshark", 
    "osCredKey": "linuxrootuser", 
    "serverKey": "targetserverlin", 
    "successExitCode": 0, 
    "type": "com.servertribe.attune.tuples.StepSshTuple"
}