{
    "actionOnStepFail": null, 
    "concurrency": 1, 
    "enabled": true, 
    "externalUuid4": "aeb759ad-a9e3-4f8a-9677-f6f22ac67189", 
    "isBlueprint": false, 
    "key": "attunev4setupattuneosprerequisites", 
    "links": [
        {
            "order": 0, 
            "stepKey": "attunev4rhelyumupdateall"
        }, 
        {
            "order": 50, 
            "stepKey": "attunev4acoinstallccompilerpackage"
        }, 
        {
            "order": 100, 
            "stepKey": "attunev4acoinstallpythonbuilddependencies"
        }, 
        {
            "order": 150, 
            "stepKey": "attunev4acoinstallclibrariesforpython"
        }, 
        {
            "order": 200, 
            "stepKey": "attunev4acoinstallclibrariesforlxml"
        }, 
        {
            "order": 250, 
            "stepKey": "attunev4acoinstallclibrariesfororacleclient"
        }, 
        {
            "order": 300, 
            "stepKey": "attunev4acoinstallclibrariesforldap"
        }, 
        {
            "order": 350, 
            "stepKey": "attunev4acoinstallclibrariesforpillowimaging"
        }, 
        {
            "order": 400, 
            "stepKey": "attunev4rhelcleanupdownloadedpackages"
        }
    ], 
    "name": "Attune v4 Setup Attune OS Prerequisites", 
    "type": "com.servertribe.attune.tuples.StepGroupTuple"
}