{
    "enabled": true, 
    "externalUuid4": "ac5cc52c-f2ef-4d46-84d2-e5b701b8e37c", 
    "interpreter": 1, 
    "key": "swpeicwrunautotools", 
    "name": "SWPE ICW Run autotools", 
    "osCredKey": "linuxattuneuser", 
    "serverKey": "targetserverlin", 
    "successExitCode": 0, 
    "type": "com.servertribe.attune.tuples.StepSshTuple"
}