{
    "archiveKey": "attunereleasev4313", 
    "deployPath": "/home/attune", 
    "enabled": true, 
    "externalUuid4": "e5bb4121-e0bb-4538-b500-65970bd211da", 
    "key": "attunev4sasdeployattune", 
    "name": "Attune v4 SAS Deploy Attune", 
    "osCredKey": "linuxattuneuser", 
    "serverKey": "attuneserver", 
    "type": "com.servertribe.attune.tuples.StepPushDesignFileTuple", 
    "unpack": true
}