{
    "enabled": true, 
    "externalUuid4": "3494f430-942c-4665-b5d3-5618995b6b7e", 
    "interpreter": 1, 
    "key": "ksesxideletevmhostname", 
    "name": "KS ESXi Delete VM Hostname", 
    "osCredKey": "linuxattuneuser", 
    "serverKey": "attuneosbuildserver", 
    "successExitCode": 0, 
    "type": "com.servertribe.attune.tuples.StepSshTuple"
}