{
    "enabled": true, 
    "externalUuid4": "3feebf6e-9c3c-46cb-8459-f40d4cc49c46", 
    "interpreter": 1, 
    "key": "attunev4acoinstallpythonbuilddependencies", 
    "name": "Attune v4 ACO Install Python Build Dependencies", 
    "osCredKey": "linuxrootuser", 
    "serverKey": "attuneserver", 
    "successExitCode": 0, 
    "type": "com.servertribe.attune.tuples.StepSshTuple"
}