{
    "externalUuid4": "3b9164a0-2a0d-4ca8-acf8-8e3b31138384", 
    "key": "winpestartnetcmdforwin2019", 
    "name": "WinPE startnet.cmd for Win2019", 
    "type": "com.servertribe.attune.tuples.FileArchiveVersionedTuple"
}