{
    "enabled": true, 
    "externalUuid4": "7739ab6e-20bb-463c-8501-a8bfa92bbd1f", 
    "interpreter": 1, 
    "key": "bpatssadsetupbackuplv", 
    "name": "BPATS SAD Setup Backup LV", 
    "osCredKey": "linuxrootuser", 
    "serverKey": "targetserverlin", 
    "successExitCode": 0, 
    "type": "com.servertribe.attune.tuples.StepSshTuple"
}