{
    "enabled": true, 
    "externalUuid4": "9c516f49-dde9-4db2-a680-40ff3bf09db9", 
    "interpreter": 1, 
    "key": "attunev4saoscreatevirtualenv", 
    "name": "Attune v4 SAOS Create Virtualenv", 
    "osCredKey": "linuxattuneuser", 
    "serverKey": "attuneserver", 
    "successExitCode": 0, 
    "type": "com.servertribe.attune.tuples.StepSshTuple"
}