{
    "actionOnStepFail": null, 
    "concurrency": 1, 
    "enabled": true, 
    "externalUuid4": "4dd4d062-fcd5-4411-a98e-352334af69eb", 
    "isBlueprint": false, 
    "key": "rhelupdatecatrust", 
    "links": [
        {
            "order": 0, 
            "stepKey": "ructdeployrootca"
        }, 
        {
            "order": 50, 
            "stepKey": "ructinstallrootca"
        }, 
        {
            "order": 100, 
            "stepKey": "ructtestyumconnection"
        }
    ], 
    "name": "RHEL Update CA Trust", 
    "type": "com.servertribe.attune.tuples.StepGroupTuple"
}