{
    "archiveKey": "attunev4offlinecmakesource", 
    "deployPath": "/home/attune", 
    "enabled": true, 
    "externalUuid4": "bcdc1403-7217-463f-a4f0-acdefa4695a5", 
    "key": "nameattunev4linicmdeploycmake", 
    "name": "Name  Attune v4 LIN ICM Deploy CMake", 
    "osCredKey": "linuxattuneuser", 
    "serverKey": "attuneserver", 
    "type": "com.servertribe.attune.tuples.StepPushDesignFileTuple", 
    "unpack": true
}