{
    "archiveKey": "attunev4offlinepythonpypis", 
    "deployPath": "/tmp/attune_offline/pypis", 
    "enabled": true, 
    "externalUuid4": "25597a05-9148-4c55-8cdc-87437a81cd70", 
    "key": "attunev4linpydeploypythonpypls", 
    "name": "Attune v4 LIN PY Deploy Python PyPls", 
    "osCredKey": "linuxattuneuser", 
    "serverKey": "attuneserver", 
    "type": "com.servertribe.attune.tuples.StepPushDesignFileTuple", 
    "unpack": true
}