{
    "externalUuid4": "eedc1c05-c1ef-4922-90e8-61867214a786", 
    "key": "kickstartorganisationname", 
    "name": "Kickstart Organisation Name", 
    "showInPlan": false, 
    "type": "c.s.s.b.phv.Text"
}