{
    "enabled": true, 
    "externalUuid4": "f6b57347-5be5-4cdd-a03a-c4bbf6e75ee7", 
    "interpreter": 1, 
    "key": "attunev4sauchownhomedir", 
    "name": "Attune v4 SAU chown Home Dir", 
    "osCredKey": "linuxrootuser", 
    "serverKey": "attuneserver", 
    "successExitCode": 0, 
    "type": "com.servertribe.attune.tuples.StepSshTuple"
}