<svg xmlns="http://www.w3.org/2000/svg" width="22" height="22" version="1.1">
 <defs>
  <style id="current-color-scheme" type="text/css">
   .ColorScheme-Text { color:#c6c6c6; } .ColorScheme-Highlight { color:#4285f4; } .ColorScheme-NeutralText { color:#ff9800; } .ColorScheme-PositiveText { color:#4caf50; } .ColorScheme-NegativeText { color:#f44336; }
  </style>
 </defs>
 <path style="opacity:0.35;fill:currentColor" class="ColorScheme-Text" d="m 18,5.0002604 v 8.2089846 c 0,0.9676 -0.790665,1.791016 -1.777344,1.791016 h -6.005859 l -0.8613283,0.832031 -0.1835939,0.167969 h 2.6347662 c 0.297636,0 0.419786,-0.0229 0.615234,0.226562 l 0.908203,0.876953 1.951172,1.78711 C 15.601001,19.200418 16.000334,18.814036 16,18.195573 v -1.818359 c 0,-0.388883 0.388672,-0.376953 0.388672,-0.376953 h 1.833984 C 18.653545,16.000261 19,15.6401 19,15.209245 V 5.7776042 C 19,5.3467498 18.653545,5.0002604 18.222656,5.0002604 Z"/>
 <path style="fill:currentColor" class="ColorScheme-Text" d="M 3.7773438,3.0000868 C 3.346455,3.0000868 3,3.3465762 3,3.7774305 v 9.4316405 c 0,0.430855 0.346455,0.791016 0.7773438,0.791016 h 1.8339843 c 0,0 0.3886719,-0.01193 0.3886719,0.376953 v 1.818359 c -3.344e-4,0.618466 0.3990005,1.004846 0.71875,0.695313 L 8.6699219,15.103603 9.578125,14.226649 c 0.195449,-0.249461 0.3175983,-0.226562 0.615234,-0.226562 h 6.029297 C 16.653545,14.000087 17,13.639926 17,13.209071 V 3.7774305 C 17,3.3465762 16.653545,3.0000868 16.222656,3.0000868 Z m 1.2226562,2 h 10 v 7.0000002 h -4.806641 c -0.09752,0 -0.3370491,-0.05786 -0.8789059,0.0918 -0.4441382,0.122669 -0.8754246,0.443457 -1.1503906,0.724609 l 0.025391,-0.0293 -0.5566406,0.53711 C 7.3593204,12.830452 7.0067374,12.39709 6.65625,12.232509 6.1383715,11.989325 5.7021027,11.994803 5.5957031,12.000087 H 5 Z m 1,1 v 1 h 8 v -1 z m 0,2 v 1 h 6 v -1 z m 0,2.0000002 v 1 h 4 v -1 z"/>
</svg>
