<svg xmlns="http://www.w3.org/2000/svg" width="22" height="22" version="1">
 <defs>
  <style id="current-color-scheme" type="text/css">
   .ColorScheme-Text { color:#c6c6c6; } .ColorScheme-Highlight { color:#4285f4; } .ColorScheme-NeutralText { color:#ff9800; } .ColorScheme-PositiveText { color:#4caf50; } .ColorScheme-NegativeText { color:#f44336; }
  </style>
 </defs>
 <path style="opacity:.35;fill:currentColor" class="ColorScheme-Text" d="M 4,3 C 3.446,3 3,3.45 3,4 V 18 C 3,18.55 3.446,19 4,19 H 18 C 18.55,19 19,18.55 19,18 V 4 C 19,3.45 18.55,3 18,3 Z M 5,7 H 7 V 12 H 5 Z M 8,7 H 16 V 15 H 14 V 10 H 13 V 15 H 11 V 10 H 10 V 15 H 8 Z M 5,13 H 7 V 15 H 5 Z"/>
</svg>
