<svg xmlns="http://www.w3.org/2000/svg" width="24" height="24" version="1.1">
 <defs>
  <style id="current-color-scheme" type="text/css">
   .ColorScheme-Text { color:#e4e4e4; } .ColorScheme-Highlight { color:#4285f4; } .ColorScheme-NeutralText { color:#ff9800; } .ColorScheme-PositiveText { color:#4caf50; } .ColorScheme-NegativeText { color:#f44336; }
  </style>
 </defs>
 <path style="fill:currentColor" class="ColorScheme-Text" d="M 8.1777344,5.0000001 C 7.5248059,5.0000001 7,5.5344188 7,6.1992189 V 7.5000001 10 H 18 V 7.5000001 6.1992189 C 18,5.5344186 17.475194,5.0000001 16.822266,5.0000001 Z m 1.3222656,1 a 0.5,0.5 0 0 1 0.5,0.5 v 1.9999998 a 0.5,0.5 0 0 1 -0.5,0.5 0.5,0.5 0 0 1 -0.5,-0.5 V 6.5000001 a 0.5,0.5 0 0 1 0.5,-0.5 z M 7,11 v 3 3 0.800782 c 0,0.602423 0.4331557,1.095821 1,1.183593 V 19.5 C 8,19.777 8.223,20 8.5,20 h 1 C 9.777,20 10,19.777 10,19.5 V 19 h 5 v 0.5 c 0,0.277 0.223,0.5 0.5,0.5 h 1 c 0.277,0 0.5,-0.223 0.5,-0.5 v -0.515625 c 0.566844,-0.08777 1,-0.58117 1,-1.183593 V 17 14 11 Z m 2.5,1 a 0.5,0.5 0 0 1 0.5,0.5 v 2 A 0.5,0.5 0 0 1 9.5,15 0.5,0.5 0 0 1 9,14.5 v -2 A 0.5,0.5 0 0 1 9.5,12 Z"/>
</svg>
