<svg xmlns="http://www.w3.org/2000/svg" width="24" height="24" version="1.1">
 <defs>
  <style id="current-color-scheme" type="text/css">
   .ColorScheme-Text { color:#a0a0a0; } .ColorScheme-Highlight { color:#4285f4; } .ColorScheme-NeutralText { color:#ff9800; } .ColorScheme-PositiveText { color:#4caf50; } .ColorScheme-NegativeText { color:#f44336; }
  </style>
 </defs>
 <g transform="translate(4,4)">
  <path style="fill:currentColor" class="ColorScheme-Text" d="M 3 0 C 2.446 0 2 0.446 2 1 L 2 7 L 13 7 C 14.090703 7 15 7.9092972 15 9 L 15 10 L 16 10 L 16 1 C 16 0.446 15.554 0 15 0 L 3 0 z M 4 2 L 11 2 L 11 3 L 4 3 L 4 2 z M 12 2 L 14 2 L 14 3 L 12 3 L 12 2 z M 4 4 L 8 4 L 8 5 L 4 5 L 4 4 z M 1 8 C 0.446 8 0 8.446 0 9 L 0 15 C 0 15.554 0.446 16 1 16 L 10 16 L 10 13 L 10 11 L 10 10 L 14 10 L 14 9 C 14 8.446 13.554 8 13 8 L 1 8 z M 14.980469 11.003906 C 14.938612 11.012276 14.894257 11.03544 14.849609 11.080078 L 14.214844 11.714844 L 15.285156 12.785156 L 15.919922 12.150391 C 16.098516 11.971822 15.919922 11.792969 15.919922 11.792969 L 15.207031 11.080078 C 15.207031 11.080078 15.106043 10.978797 14.980469 11.003906 z M 13.857422 12.072266 L 11 14.927734 L 11 16 L 12.072266 16 L 14.927734 13.142578 L 13.857422 12.072266 z M 1 14 L 2 14 L 2 15 L 1 15 L 1 14 z M 3 14 L 4 14 L 4 15 L 3 15 L 3 14 z M 5 14 L 6 14 L 6 15 L 5 15 L 5 14 z M 7 14 L 8 14 L 8 15 L 7 15 L 7 14 z"/>
 </g>
</svg>
