<svg xmlns="http://www.w3.org/2000/svg" width="22" height="22" version="1.1">
 <defs>
  <style id="current-color-scheme" type="text/css">
   .ColorScheme-Text { color:#c6c6c6; } .ColorScheme-Highlight { color:#4285f4; } .ColorScheme-NeutralText { color:#ff9800; } .ColorScheme-PositiveText { color:#4caf50; } .ColorScheme-NegativeText { color:#f44336; }
  </style>
 </defs>
 <path style="fill:currentColor" class="ColorScheme-Text" d="m 31.973689,-21.033178 c -4.4183,0 -8,3.5817 -8,8 0,4.4179998 3.5817,7.9999998 8,7.9999998 4.418,0 8,-3.582 8,-7.9999998 0,-4.4183 -3.582,-8 -8,-8 z m -1,3 h 2 v 5 h 3 l -4,4.9999998 -4,-4.9999998 h 3 z"/>
 <path style="fill:currentColor" class="ColorScheme-Text" d="M 11 3 C 8.7839998 3 7 4.784 7 7 C 7 9.216 8.7839998 11 11 11 C 13.216 11 15 9.216 15 7 C 15 4.784 13.216 3 11 3 z M 11 5 C 12.104572 5 13 5.8954279 13 7 C 13 8.1045718 12.104572 9 11 9 C 9.8954278 9 9 8.1045718 9 7 C 9 5.8954279 9.8954278 5 11 5 z M 10.798828 5.3828125 C 10.740198 5.3887725 10.681784 5.3926929 10.625 5.4042969 C 10.510999 5.4276139 10.403589 5.4576431 10.298828 5.5019531 C 9.7981488 5.7136921 9.4197383 6.1533633 9.2851562 6.6894531 C 9.2886563 6.6932131 9.292955 6.6969229 9.296875 6.7011719 C 9.390805 6.8014958 9.6358704 6.9398277 9.8183594 7.0058594 C 9.9181594 7.0419784 10.11219 7.0979564 10.244141 7.125 C 10.376099 7.151991 10.464172 7.1786575 10.451172 7.1796875 C 10.438172 7.1807475 10.378982 7.2245957 10.320312 7.2773438 C 10.208403 7.3779572 10.151881 7.4677154 10.103516 7.6269531 C 10.076976 7.7141411 10.078701 7.7418678 10.113281 7.7890625 C 10.134121 7.8175025 10.227612 7.8840225 10.320312 7.9414062 C 10.413013 7.9987933 10.521885 8.0777601 10.560547 8.1152344 C 10.704582 8.2548253 10.798828 8.5055389 10.798828 8.7480469 C 10.798828 8.8101039 10.806027 8.8433019 10.810547 8.8574219 C 10.822327 8.8584519 10.83194 8.8563519 10.84375 8.8574219 C 10.87041 8.8471379 10.91106 8.8345594 10.974609 8.8027344 C 11.50704 8.5362057 11.748589 8.1909629 11.724609 7.734375 C 11.705509 7.3702622 11.536196 7.2385565 10.84375 7.0917969 C 10.333863 6.9837142 10.058594 6.8013742 10.058594 6.5703125 C 10.058594 6.5093805 10.079914 6.4728065 10.146484 6.40625 C 10.218034 6.334689 10.231804 6.3307469 10.287109 6.3417969 C 10.322329 6.3488369 10.414449 6.3938458 10.484375 6.4492188 C 10.641787 6.573866 10.717416 6.6230469 10.798828 6.6230469 C 10.833508 6.6230469 10.865234 6.6184612 10.865234 6.6132812 C 10.865234 6.6080913 10.838987 6.5673746 10.810547 6.5253906 C 10.653387 6.2938199 10.662694 5.8601754 10.832031 5.4902344 C 10.858631 5.4321574 10.879763 5.3939654 10.876953 5.3828125 C 10.853433 5.3842125 10.822158 5.3803725 10.798828 5.3828125 z M 6.1015625 5.9863281 L 4.8886719 6.6855469 C 4.7072932 6.7955833 4.5472053 6.9371684 4.4160156 7.1035156 C 4.4134056 7.1061156 4.4108031 7.1087181 4.4082031 7.1113281 C 4.3497651 7.1763051 4.2962331 7.245514 4.2480469 7.3183594 C 4.2103269 7.3908874 4.1776966 7.4659479 4.1503906 7.5429688 C 4.1210376 7.6013778 4.0949556 7.6613736 4.0722656 7.7226562 C 4.072914 7.7239562 4.0735687 7.7252625 4.0742188 7.7265625 C 4.0264951 7.8856798 4.0015096 8.0507371 4 8.2167969 L 4 14.226562 C 4.0003392 14.858421 4.3391034 15.442205 4.8886719 15.757812 L 10.111328 18.761719 C 10.66114 19.078323 11.33886 19.078323 11.888672 18.761719 L 17.111328 15.757812 C 17.660897 15.442205 17.999661 14.85842 18 14.226562 L 18 8.2167969 C 17.999679 8.0488653 17.975346 7.8817997 17.927734 7.7207031 C 17.799452 7.283897 17.507041 6.91309 17.111328 6.6855469 L 15.898438 5.9863281 C 15.899219 5.9901589 15.898009 5.9941896 15.898438 5.9980469 A 5 5 0 0 1 16 7 A 5 5 0 0 1 11 12 A 5 5 0 0 1 6 7 A 5 5 0 0 1 6.0996094 6.0625 C 6.0964848 6.0365425 6.0965016 6.0110871 6.1015625 5.9863281 z M 12.425781 6.1992188 C 12.371121 6.2133227 12.139491 6.4587288 12.083984 6.5703125 C 11.966582 6.8063439 12.010744 6.9601113 12.291016 7.2558594 C 12.388116 7.3583127 12.506386 7.4957392 12.542969 7.5605469 C 12.579539 7.6253639 12.610571 7.6791919 12.619141 7.6699219 C 12.627741 7.6606519 12.653718 7.5854789 12.673828 7.5058594 C 12.726678 7.2966648 12.730788 6.9332414 12.673828 6.7226562 C 12.629708 6.5595391 12.474528 6.2245195 12.433594 6.1992188 C 12.431594 6.1979988 12.429381 6.1982785 12.425781 6.1992188 z"/>
</svg>
