<svg xmlns="http://www.w3.org/2000/svg" width="22" height="22" version="1.1">
 <defs>
  <style id="current-color-scheme" type="text/css">
   .ColorScheme-Text { color:#c6c6c6; } .ColorScheme-Highlight { color:#4285f4; } .ColorScheme-NeutralText { color:#ff9800; } .ColorScheme-PositiveText { color:#4caf50; } .ColorScheme-NegativeText { color:#f44336; }
  </style>
 </defs>
 <path style="fill:currentColor" class="ColorScheme-Text" d="m 7.0214838,3.0000501 a 0.9947634,1.0001 0 1 0 0,2 h 0.978516 v 2.9999998 c 0,1.328 -1.695715,2.0000001 -2.9999998,2.0000001 v 2 h 4.9999999 v 6 l 0.9765621,1 1.023438,-1 v -6 h 5 v -2 c -1.304286,0 -3.055749,-0.6731711 -3,-2.0000001 V 5.0000501 h 0.978516 a 0.9947634,1.0001 0 1 0 0,-2 z"/>
</svg>
