<svg xmlns="http://www.w3.org/2000/svg" width="22" height="22" version="1.1">
 <defs>
  <style id="current-color-scheme" type="text/css">
   .ColorScheme-Text { color:#e4e4e4; } .ColorScheme-Highlight { color:#4285f4; } .ColorScheme-NeutralText { color:#ff9800; } .ColorScheme-PositiveText { color:#4caf50; } .ColorScheme-NegativeText { color:#f44336; }
  </style>
 </defs>
 <path style="fill:currentColor" class="ColorScheme-Text" d="M 4,4 C 4,4 3,4 3,5.0000001 V 15 c 0,1 1,1 1,1 h 2 l 0.9999999,1 H 14 l 1,-1 h 2 c 0,0 1,0.13 1,-1 V 5.0000001 C 18,4 17,4 17,4 Z m 7,2.9999999 c 1.1,0 2,0.895 2,2.0000001 0,1.105 -0.9,2 -2,2 v 1 h -1 v -2 h 1 C 11.55,10 12,9.552 12,9 12,8.448 11.55,8 11,8 10.45,8 10,8.448 10,9 H 9.0000002 C 9.0000002,7.8949999 9.9,6.9999999 11,6.9999999 Z M 10,13 h 1 v 1 h -1 z"/>
</svg>
