<svg xmlns="http://www.w3.org/2000/svg" width="22" height="22" version="1.1">
 <defs>
  <style id="current-color-scheme" type="text/css">
   .ColorScheme-Text { color:#c6c6c6; } .ColorScheme-Highlight { color:#4285f4; } .ColorScheme-NeutralText { color:#ff9800; } .ColorScheme-PositiveText { color:#4caf50; } .ColorScheme-NegativeText { color:#f44336; }
  </style>
 </defs>
 <path style="fill:currentColor" class="ColorScheme-Text" d="M 9.5655172,3.0992357 A 1.0001,1.0001 0 0 0 8.9991114,3.9996264 V 8.0660329 L 6.6123927,6.2105638 A 1,1 0 0 0 5.2100489,6.3863451 1,1 0 0 0 5.3858302,7.7886889 l 3.6132812,2.8105471 v 0.800781 l -3.6132812,2.810547 a 1,1 0 0 0 -0.1757813,1.402343 1,1 0 0 0 1.4023438,0.175782 L 8.9991114,13.93322 v 4.066407 a 1.0001,1.0001 0 0 0 1.6249996,0.78125 l 5.000001,-4.000001 a 1.0001,1.0001 0 0 0 -0.01172,-1.570312 l -2.841796,-2.210937 2.841797,-2.2109381 a 1.0001,1.0001 0 0 0 0.01172,-1.570312 L 10.624112,3.2183764 A 1.0001,1.0001 0 0 0 9.5655172,3.0992357 Z m 1.4335938,2.9824219 2.384767,1.9082033 -2.242189,1.744141 -0.142578,-0.111329 z m 0.142578,6.1835944 2.242189,1.74414 -2.384767,1.908204 V 12.37658 Z"/>
</svg>
