<svg xmlns="http://www.w3.org/2000/svg" width="16" height="16" version="1.1">
  <path style="fill:#a0a0a0" d="M 2.063,1.001 C 0.911,1.001 0,1.913 0,3.064 v 9.873 C 0,14.088 0.912,15 2.063,15 H 13.937 C 15.088,15 16,14.088 16,12.937 V 3.064 C 16,1.912 15.088,1.001 13.937,1.001 Z M 1.975,3.0005 H 7 v 2 H 4.006 v 2 H 5 c 1.004,0.004 2.006,1.002 2.006,2 H 7 v 2 h 0.006 c 0,1 -1.005,2 -2.012,2 h -3.02 v -2 h 3.014 v -2 H 1.975 Z m 8.025,0 h 2 c 0.833,0 1.525,0.564 1.77,1.053 0.244,0.488 0.23,0.947 0.23,0.947 v 1 h -2 v -1 h -2 v 6 h 2 v -2 h -1 v -2 h 3 v 4 c 0,0 0.014,0.459 -0.23,0.947 -0.245,0.489 -0.937,1.053 -1.77,1.053 h -2 c 0,0 -0.459,0.014 -0.947,-0.23 C 8.564,12.5255 8,11.8335 8,11.0005 v -6 c 0,0 -0.014,-0.459 0.23,-0.947 0.245,-0.489 0.937,-1.053 1.77,-1.053 z"/>
</svg>
