<svg xmlns="http://www.w3.org/2000/svg" width="22" height="22" version="1.1">
 <defs>
  <style id="current-color-scheme" type="text/css">
   .ColorScheme-Text { color:#c6c6c6; } .ColorScheme-Highlight { color:#4285f4; } .ColorScheme-NeutralText { color:#ff9800; } .ColorScheme-PositiveText { color:#4caf50; } .ColorScheme-NegativeText { color:#f44336; }
  </style>
 </defs>
 <path style="fill:currentColor" class="ColorScheme-Text" d="M 11,3 C 6.5820599,3 3.0005989,6.5802469 2.9999999,10.998047 2.9994019,15.413168 6.5848799,19.000047 11,19 c 4.418126,-4.7e-5 8,-3.581719 8,-8 0,-1.0038316 -0.183956,-1.9644334 -0.521484,-2.8496094 -0.02713,-0.071151 -0.121395,-0.088261 -0.171875,-0.03125 L 16.791016,9.4375 A 6,6 0 0 1 17,11 6,6 0 0 1 11,17 6,6 0 0 1 4.9999999,11 6,6 0 0 1 11,5 6,6 0 0 1 13.162109,5.4101562 L 14.300781,3.8398437 C 14.338891,3.7895667 14.321671,3.7164564 14.265621,3.6875 13.167223,3.1200631 12.321319,3 10.999996,3 Z m 4.810547,1 c -0.02654,0.0034 -0.05291,0.017221 -0.07031,0.039063 l -6.2226591,7.810546 c -0.02728,0.03424 -0.0794,0.0382 -0.111328,0.0078 L 7.1835939,9.7402244 c -0.0477,-0.045416 -0.128894,-0.035267 -0.164062,0.019531 l -1.003907,1.5644536 c -0.02509,0.03909 -0.01843,0.09067 0.01563,0.123047 l 3.707032,3.523437 c 0.04246,0.04027 0.110595,0.03885 0.15039,-0.0039 L 17.974614,6.2792867 c 0.03102,-0.033365 0.03347,-0.081851 0.0078,-0.1191407 C 17.416831,5.3379211 16.706882,4.6130913 15.886724,4.019521 15.863794,4.002926 15.837084,3.996589 15.810554,3.99999 Z"/>
</svg>
