<svg xmlns="http://www.w3.org/2000/svg" width="16" height="16" version="1.1">
 <defs>
  <style id="current-color-scheme" type="text/css">
   .ColorScheme-Text { color:#a0a0a0; } .ColorScheme-Highlight { color:#4285f4; } .ColorScheme-NeutralText { color:#ff9800; } .ColorScheme-PositiveText { color:#4caf50; } .ColorScheme-NegativeText { color:#f44336; }
  </style>
 </defs>
 <path style="fill:currentColor" class="ColorScheme-Text" d="M 1.199219,0.99999997 C 0.534418,0.99999997 0,1.5344187 0,2.1992188 V 14.800781 C 0,15.465581 0.534418,16 1.199219,16 H 8 13.800781 C 14.465581,16 15,15.465581 15,14.800781 V 2.1992188 C 15,1.5344187 14.455917,1.1129393 13.800781,0.99999997 H 8 Z M 2,3 h 6 5 V 14 H 8 2 Z m 2.949219,0.9730005 c -0.194096,0 -0.46311,0.071972 -0.986329,0.2578126 -0.05063,0.017688 -0.05155,0.017444 -0.09375,0.035156 l 0.0332,0.1328125 c 0.329124,-0.088495 0.388261,-0.097656 0.472657,-0.097656 0.210972,0 0.262707,0.080353 0.380859,0.6113282 L 4.999997,6.0003442 4.308591,7.0355004 C 4.131375,7.3009853 3.971733,7.4612818 3.878903,7.4612818 c -0.05063,0 -0.136315,-0.026994 -0.220703,-0.080078 -0.109702,-0.061946 -0.193593,-0.087891 -0.269531,-0.087891 -0.168777,0 -0.28711,0.1316048 -0.28711,0.3085937 0,0.2300897 0.16026,0.3710938 0.421875,0.3710938 0.261615,0 0.363203,-0.078397 0.785157,-0.6093752 C 4.536439,7.0715818 4.722364,6.8054156 5.068356,6.3187037 l 0.251953,1.0625 c 0.109705,0.460178 0.220191,0.5917968 0.490235,0.5917968 0.320689,0 0.539841,-0.2113429 1.029297,-1.0078125 L 6.722653,6.8948751 C 6.655143,6.974522 6.611103,7.026963 6.535153,7.1331564 6.341058,7.3986438 6.241886,7.486672 6.140622,7.486672 6.022477,7.486672 5.94579,7.3731302 5.886716,7.1253439 5.861396,7.0279988 5.859996,7.0093133 5.851556,6.9827658 5.640584,6.0800998 5.548821,5.6721611 5.548821,5.5394062 5.928577,4.849154 6.223096,4.4690939 6.374993,4.4690939 c 0.05063,0 0.127176,0.026054 0.203125,0.070312 0.101267,0.061947 0.16038,0.080078 0.236328,0.080078 0.168779,2e-7 0.28711,-0.1325252 0.28711,-0.3183594 0,-0.1946903 -0.143171,-0.3281249 -0.345703,-0.328125 -0.371322,0 -0.684671,0.3187078 -1.275391,1.265625 L 5.388662,4.7522974 C 5.270518,4.1505199 5.177059,3.9730005 4.949209,3.9730005 Z M 8,7 v 1 h 4 V 7 Z M 5,9.0000001 c -0.594893,0 -1.076992,0.167379 -1.447266,0.5 C 3.184475,9.8326211 3,10.232066 3,10.703125 c 0,0.424907 0.133364,0.77785 0.398437,1.056641 0.265054,0.278792 0.557185,0.448241 0.878907,0.509765 l 0.0059,0.195313 H 3.582071 c -0.167939,0 -0.290298,-0.0282 -0.367187,-0.08203 C 3.137994,12.328994 3.096025,12.234167 3.08793,12.097658 H 2.976602 V 13 H 4.546915 L 4.490275,12.128906 C 4.18677,12.023145 3.980328,11.841585 3.873088,11.582031 3.765847,11.320561 3.712931,11.030139 3.712931,10.712891 c 0,-0.438365 0.118659,-0.7974179 0.357422,-1.0781249 0.24078,-0.282639 0.543914,-0.423829 0.910157,-0.423829 0.343982,0 0.643496,0.131151 0.898437,0.396485 0.256974,0.265334 0.386719,0.6485099 0.386719,1.1464839 0,0.761365 -0.261174,1.219264 -0.783203,1.375 L 5.404333,13 H 6.976598 V 12.097656 H 6.863317 c -0.004,0.105745 -0.03688,0.192502 -0.09961,0.261719 -0.0607,0.06922 -0.186679,0.105469 -0.378906,0.105469 H 5.668004 l 0.0293,-0.195313 c 0.388502,-0.107675 0.697211,-0.299313 0.923828,-0.576172 0.22865,-0.278791 0.34375,-0.617633 0.34375,-1.015625 0,-0.490279 -0.184538,-0.8916769 -0.550781,-1.2050779 -0.366244,-0.315316 -0.8374,-0.472656 -1.414063,-0.472656 z m 3,0 V 10 h 4 V 9.0000001 Z"/>
</svg>
