<svg xmlns="http://www.w3.org/2000/svg" width="16" height="16" version="1.1">
 <defs>
  <style id="current-color-scheme" type="text/css">
   .ColorScheme-Text { color:#a0a0a0; } .ColorScheme-Highlight { color:#4285f4; } .ColorScheme-NeutralText { color:#ff9800; } .ColorScheme-PositiveText { color:#4caf50; } .ColorScheme-NegativeText { color:#f44336; }
  </style>
 </defs>
 <path style="fill:currentColor" class="ColorScheme-Text" d="M 7.5 1 C 3.9101491 1 1 3.9101491 1 7.5 C 1.00378 10.908965 3.6405581 13.735847 7.0410156 13.976562 C 7.0384989 14.874999 7 16 7 16 C 10.949542 15.510867 14 12.081917 14 8 C 14 7.907964 13.991001 7.8300869 13.988281 7.7421875 C 13.993694 7.6615382 13.9976 7.580795 14 7.5 C 14 3.9101491 11.089851 1 7.5 1 z M 3.5 6 A 1.5 1.5 0 0 1 5 7.5 A 1.5 1.5 0 0 1 3.5 9 A 1.5 1.5 0 0 1 2 7.5 A 1.5 1.5 0 0 1 3.5 6 z M 7.5 6 A 1.5 1.5 0 0 1 9 7.5 A 1.5 1.5 0 0 1 7.5 9 A 1.5 1.5 0 0 1 6 7.5 A 1.5 1.5 0 0 1 7.5 6 z M 11.5 6 A 1.5 1.5 0 0 1 13 7.5 A 1.5 1.5 0 0 1 11.5 9 A 1.5 1.5 0 0 1 10 7.5 A 1.5 1.5 0 0 1 11.5 6 z"/>
</svg>
