<svg xmlns="http://www.w3.org/2000/svg" width="16" height="16" version="1.1">
 <defs>
  <style id="current-color-scheme" type="text/css">
   .ColorScheme-Text { color:#e4e4e4; } .ColorScheme-Highlight { color:#4285f4; } .ColorScheme-NeutralText { color:#ff9800; } .ColorScheme-PositiveText { color:#4caf50; } .ColorScheme-NegativeText { color:#f44336; }
  </style>
 </defs>
 <path style="fill:currentColor" class="ColorScheme-Text" d="m 7.9062452,5.7e-7 c -0.481034,0.014529 -0.779294,0.372199 -0.9921877,0.53906253 L 5.335933,1.78711 C 5.7296216,1.5233841 6.2941725,1.2822083 6.9999955,1.2031256 v 4.796875 c 0,0.5522846 0.4477147,0.9999996 0.9999997,0.9999996 0.552285,0 1,-0.447716 1,-0.9999996 0,-0.5522848 -0.447715,-1 -1,-1 -0.128738,0.001 -0.256069,0.026882 -0.375,0.076172 V 3.0292975 c 0.13254,-0.018412 0.241179,-0.028724 0.375,-0.029297 1.656854,0 2.9999998,1.3431456 2.9999998,3 0,1.6568537 -1.3431458,2.9999997 -2.9999998,2.9999997 -1.6568547,0 -2.9999997,-1.343146 -2.9999997,-2.9999996 V 2.052735 L 0.40233928,5.6816412 3.1132767,7.9023442 6.3456985,10.517578 c 0.497449,-0.248363 0.9569307,-0.464531 1.4980467,-0.519531 0.566565,-0.05759 1.174748,0.0863 1.886719,0.458984 0,0 0.002,0 0.002,0 L 12.771479,7.9980472 15.597651,5.6835944 9.0859332,0.5390631 C 8.8725862,0.37219957 8.5747792,0.01453017 8.0937452,5.7e-7 c -0.03002,-9.616e-4 -0.06227,0.00201 -0.09375,0.00391 -0.03148,-0.00188 -0.06372,-0.00481 -0.09375,-0.00391 z M -4.5166667e-6,6.6699222 V 7.1738282 10 11.097656 13.826172 14 c 0,0.01278 0.00343999667,0.02444 0.00390999667,0.03711 L 5.4003861,11.039062 2.8808549,9.0000002 h -0.00586 L 2.4648393,8.6640622 Z m 15.9999995166667,0 -2.53125,2.048828 -0.34375,0.28125 h -0.0039 l -2.455084,1.9863278 5.333984,3.021484 c 2.1e-5,-0.0027 0,-0.0051 0,-0.0078 V 13.826172 11.097656 10 7.1738282 Z M 8.2109332,10.990234 c -0.09272,-0.0063 -0.179741,-0.0048 -0.265626,0.0039 -0.343536,0.03492 -0.707029,0.195804 -1.2207027,0.453125 L 0.53905798,14.882812 C 0.67737458,14.954882 0.83265668,15 0.99999548,15 H 1.1699174 14.830073 14.999995 c 0.178295,0 0.343626,-0.04974 0.488281,-0.130859 L 9.2675732,11.34375 c -0.454564,-0.238102 -0.778494,-0.334506 -1.05664,-0.353516 z"/>
</svg>
