<svg xmlns="http://www.w3.org/2000/svg" width="24" height="24" version="1.1">
 <defs>
  <style id="current-color-scheme" type="text/css">
   .ColorScheme-Text { color:#e4e4e4; } .ColorScheme-Highlight { color:#4285f4; } .ColorScheme-NeutralText { color:#ff9800; } .ColorScheme-PositiveText { color:#4caf50; } .ColorScheme-NegativeText { color:#f44336; }
  </style>
 </defs>
 <path style="opacity:.35;fill:currentColor" class="ColorScheme-NegativeText" d="M 10,5 V 6 H 7 v 12 c 0,0.554 0.446,1 1,1 h 7 v -9 h 2 V 6 H 14 V 5 Z"/>
 <path style="fill:currentColor" class="ColorScheme-NegativeText" d="m 7,16 v 2 c 0,0.554 0.446,1 1,1 h 7 v -3 z"/>
 <path style="fill:currentColor" class="ColorScheme-NegativeText" d="m 16,11 v 4 l 0.25,2 h 1.5 L 18,15 v -4 z m 0,7 v 2 h 2 v -2 z"/>
</svg>
