<svg width="16" height="16" version="1.1" xmlns="http://www.w3.org/2000/svg">
 <defs>
  <style id="current-color-scheme" type="text/css">.ColorScheme-Text { color:#c6c6c6; } .ColorScheme-Highlight { color:#4285f4; } .ColorScheme-NeutralText { color:#ff9800; } .ColorScheme-PositiveText { color:#4caf50; } .ColorScheme-NegativeText { color:#f44336; }</style>
 </defs>
 <path d="m13.379539 3.0016349c-0.381704 0.0146906-0.751008 0.1387739-1.064453 0.3574467-0.595949 0.4162306-1.414764 0.9338246-2.158203 1.4336931-0.137675-0.1781608-0.1908918-0.3408462-0.3671878-0.5176141-0.582629-0.5841879-1.479045-1.1123564-2.496094-1.2344605-1.729376-0.2074876-3.3260668 0.475975-4.3730468 1.418067-1.0469799 0.9420921-1.6884194 2.0742971-2.1855469 3.0841982h-0.00195c-0.037036 0.075315-0.2814609 0.5430956-0.466797 1.1231248-0.1853362 0.5800292-0.4478032 1.3455739-0.083984 2.4454819 0.2060441 0.623052 0.7093708 1.191945 1.2089844 1.478619 0.4996136 0.286673 0.9547618 0.364511 1.3359375 0.394558 0.7615127 0.06002 1.3278363-0.07003 1.7558594-0.166028 1.2399838-0.277017 2.2289178-0.667339 3.2070308-1.166095 0.531228 0.577333 1.19012 1.105137 2.3515644 1.279385 0.796989 0.138345 1.245192 0.01557 1.753906-0.107429 0.525113-0.126957 1.017762-0.288989 1.533203-0.572306 0.724674-0.495818 1.355819-1.168383 2.021484-1.77942 1.266758-1.1640003 0.570765-3.279063-1.138671-3.4611776 0.205294-0.1997788 0.432902-0.375308 0.646484-0.5859776 1.299411-1.2817779 0.343913-3.4943416-1.478516-3.4240659zm0.07617 1.9981853c-1.210103 1.1917764-2.065146 2.0493618-3.5859358 3.0744319 0.3120768 0.5178689 0.6587728 0.9750586 1.1464848 1.2207876 0.814075 0.4100685 1.42268 0.4545495 2.984375-0.2949424l-1.636719 1.5001047c-0.550531 0.302141-1.555405 0.559574-2.011719 0.472688-0.6402328-0.088006-1.3413398-0.746135-1.8554688-1.3965808-0.116627-0.1476742-0.219213-0.3152368-0.330078-0.4707356-0.404419 0.2337802-0.742358 0.4455069-1.234375 0.7090332-0.917315 0.4821342-1.723219 0.7897902-2.9023438 1.0528082-0.7056859 0.15801-1.7451002 0.304208-1.9726563-0.382839-0.2370468-0.7155504 0.3294513-1.8195199 0.4472656-2.0587365 0.8894981-1.8042251 2.2185465-3.6768929 4.5410155-3.3986736 1.385879 0.1661298 1.944481 1.4689708 2.574219 2.6251819 1.5110828-0.9214188 2.8689198-1.9781634 3.8359378-2.6525276zm-7.9277328 0.9981159c-0.309967-0.0330222-0.676365 0.0641545-1.1249999 0.3691666-0.408314 0.2635183-0.8080341 0.7388453-1.1171876 1.2461804-0.4938383 0.8097562 0.3675846 1.8940493 1.1699219 1.8868489 1.1080266-0.0100007 2.2534066-0.374664 3.3671876-0.8887337-0.376288-0.5686624-0.741375-1.1516218-1.113281-1.716915-0.307627-0.4235924-0.665028-0.8415063-1.181641-0.8965472z" style="fill:currentColor" class="ColorScheme-Text"/>
</svg>
