<svg xmlns="http://www.w3.org/2000/svg" width="24" height="24" version="1.1">
 <defs>
  <style id="current-color-scheme" type="text/css">
   .ColorScheme-Text { color:#a0a0a0; } .ColorScheme-Highlight { color:#4285f4; } .ColorScheme-NeutralText { color:#ff9800; } .ColorScheme-PositiveText { color:#4caf50; } .ColorScheme-NegativeText { color:#f44336; }
  </style>
 </defs>
 <g transform="translate(-624 -500)">
  <path style="fill:currentColor" class="ColorScheme-Text" d="m636 504c-4.4183 0-8 3.5817-8 8s3.5817 8 8 8 8-3.5817 8-8-3.5817-8-8-8zm0.14453 3.998v0.002h0.002c1.309 0.048 2.5001 0.73736 3.2031 1.8184l1.3886-0.46289-1.5703 3.1465-3.1465-1.5742 1.2774-0.42578c-0.338-0.294-0.76252-0.4869-1.2285-0.5039-0.742-0.027-1.4346 0.35504-1.8066 0.99804l-1.7324-1c0.74-1.282 2.1343-2.053 3.6133-1.998zm-3.3125 3.5 3.1465 1.5742-1.2774 0.42578c0.338 0.294 0.76252 0.48495 1.2285 0.50195 0.74199 0.027 1.4346-0.35505 1.8066-0.99805l1.7324 1c-0.74 1.282-2.1343 2.053-3.6133 1.998-1.309-0.048-2.5001-0.73736-3.2031-1.8184l-1.3887 0.46289 1.5684-3.1465z"/>
 </g>
</svg>
