<svg xmlns="http://www.w3.org/2000/svg" width="16" height="16" version="1.1">
 <defs>
  <style id="current-color-scheme" type="text/css">
   .ColorScheme-Text { color:#a0a0a0; } .ColorScheme-Highlight { color:#4285f4; } .ColorScheme-NeutralText { color:#ff9800; } .ColorScheme-PositiveText { color:#4caf50; } .ColorScheme-NegativeText { color:#f44336; }
  </style>
 </defs>
 <path style="fill:currentColor" class="ColorScheme-Text" d="M 0 1 L 0 15 L 16 15 L 16 1 L 0 1 z M 2 3 L 7 3 L 7 13 L 2 13 L 2 3 z M 10 5 L 12 6.5 L 14 8 L 12 9.5 L 10 11 L 10 8 L 10 5 z"/>
</svg>
