<svg xmlns="http://www.w3.org/2000/svg" width="24" height="24" viewBox="0 0 24 24">
 <defs>
  <style id="current-color-scheme" type="text/css">
   .ColorScheme-Text { color:#a0a0a0; } .ColorScheme-Highlight { color:#4285f4; } .ColorScheme-NeutralText { color:#ff9800; } .ColorScheme-PositiveText { color:#4caf50; } .ColorScheme-NegativeText { color:#f44336; }
  </style>
 </defs>
 <path style="fill:currentColor" class="ColorScheme-Text" d="M 2 1 L 2 2 L 4.28125 2 L 6 3.71875 L 7 4.71875 L 7.28125 5 L 4.71875 5 L 3 3.28125 L 2 2.28125 L 2 3.71875 L 3 4.71875 L 3.28125 5 L 2 5 L 2 6 L 9 6 L 9 5 L 8.71875 5 L 7 3.28125 L 6 2.28125 L 5.71875 2 L 8.28125 2 L 9 2.71875 L 9 1 L 2 1 z M 12 1 L 10 5 L 14 5 L 12 1 z M 1 7 L 1 15 L 15 15 L 15 7 L 13 7 L 13 9 L 11 9 L 11 7 L 9 7 L 9 9 L 7 9 L 7 7 L 5 7 L 5 9 L 3 9 L 3 7 L 1 7 z M 3 11 L 5 11 L 5 13 L 3 13 L 3 11 z M 7 11 L 9 11 L 9 13 L 7 13 L 7 11 z M 11 11 L 13 11 L 13 13 L 11 13 L 11 11 z" transform="translate(4 4)"/>
</svg>
