<svg xmlns="http://www.w3.org/2000/svg" width="16" height="16" version="1.1">
 <defs>
  <style id="current-color-scheme" type="text/css">
   .ColorScheme-Text { color:#a0a0a0; } .ColorScheme-Highlight { color:#4285f4; } .ColorScheme-NeutralText { color:#ff9800; } .ColorScheme-PositiveText { color:#4caf50; } .ColorScheme-NegativeText { color:#f44336; }
  </style>
 </defs>
 <path style="fill:none;stroke:currentColor;stroke-width:2;stroke-linecap:round;stroke-linejoin:round" class="ColorScheme-Text" d="M 2,3.9999987 V 12 h 3.9999986 v 0"/>
 <path style="fill:none;stroke:currentColor;stroke-width:2;stroke-linecap:round;stroke-linejoin:bevel" class="ColorScheme-Text" d="m 12.043317,3.9987417 c 2.399679,0 2.000002,2.000001 2.000002,3.9999983 0,2.000001 0.355578,4.061102 -2.000002,4.000002 -2.348587,0 -1.999997,-2.000001 -1.999997,-4.000002 0,-1.9999973 -0.435451,-3.9999983 1.999997,-3.9999983"/>
</svg>
