<svg xmlns="http://www.w3.org/2000/svg" width="16" height="16" version="1.1">
 <path style="fill:#a0a0a0" d="M 8,0 1,3.5 V 12.5 L 8,16 15,12.5 V 3.5 Z M 8,2.25 13,4.75 V 11.25 L 8,13.75 V 7 L 3,4.75 Z"/>
</svg>
