<svg xmlns="http://www.w3.org/2000/svg" width="24" height="24" version="1.1">
 <defs>
  <style id="current-color-scheme" type="text/css">
   .ColorScheme-Text { color:#c6c6c6; } .ColorScheme-Highlight { color:#4285f4; } .ColorScheme-NeutralText { color:#ff9800; } .ColorScheme-PositiveText { color:#4caf50; } .ColorScheme-NegativeText { color:#f44336; }
  </style>
 </defs>
 <path style="fill:currentColor" class="ColorScheme-Text" d="M 7,5 C 4.9997355,5 5,7 5,7 L 5,19 18.999736,19 19,7 c 4.4e-5,-2 -2,-2 -2,-2 z m 0,2 10,0 0,10 -10,0 z m 1,1 0,2 2,0 0,-2 z m 3.0001,0 0,2 2,0 0,-2 z m 3,0 0,2 2,0 0,-2 z M 8,11 l 0,2 2,0 0,-2 z m 3.0001,0 0,2 2,0 0,-2 z m 3,0 0,2 2,0 0,-2 z M 8,14 l 0,2 2,0 0,-2 z m 3.0001,0 0,2 2,0 0,-2 z m 3,0 0,2 2,0 0,-2 z"/>
</svg>
