<svg xmlns="http://www.w3.org/2000/svg" width="24" height="24" version="1.1">
 <defs>
  <style id="current-color-scheme" type="text/css">
   .ColorScheme-Text { color:#c6c6c6; } .ColorScheme-Highlight { color:#4285f4; } .ColorScheme-NeutralText { color:#ff9800; } .ColorScheme-PositiveText { color:#4caf50; } .ColorScheme-NegativeText { color:#f44336; }
  </style>
 </defs>
 <path style="fill:currentColor" class="ColorScheme-Text" d="m 4,4.0000668 5,4.9999334 5.9896,-0.0104 v 0.0208 h 0.0208 L 15,15 20,19.958333 V 4.0003334 Z M 9,9.0000002 4,13.8126 v 6.187333 h 6.541333 L 15,15 H 9 Z"/>
</svg>
