<svg xmlns="http://www.w3.org/2000/svg" width="22" height="22" version="1.1">
 <defs>
  <style id="current-color-scheme" type="text/css">
   .ColorScheme-Text { color:#a0a0a0; } .ColorScheme-Highlight { color:#4285f4; } .ColorScheme-NeutralText { color:#ff9800; } .ColorScheme-PositiveText { color:#4caf50; } .ColorScheme-NegativeText { color:#f44336; }
  </style>
 </defs>
 <path style="fill:currentColor" class="ColorScheme-Text" d="M 12.128906 3.0039062 C 11.755126 3.0254333 11.383836 3.1263346 11.027344 3.3066406 C 10.913034 3.3644566 10.757785 3.4532423 10.681641 3.5039062 C 9.9231383 4.0086261 9.2692042 4.7282794 8.8164062 5.7773438 C 8.7052763 6.0348116 8.5537094 6.4385564 8.5371094 6.5214844 C 8.5221894 6.5960604 8.4906687 6.5928125 8.4023438 6.5078125 C 8.0570087 6.1754605 7.6311576 6.0015575 7.2128906 6.0234375 C 6.7935386 6.0453895 6.432175 6.2226701 6.078125 6.5800781 C 5.801747 6.8590781 5.6006075 7.1640697 5.4296875 7.5585938 C 5.2070305 8.0725457 5.0996595 8.5347035 5.0390625 9.2421875 L 5.0292969 9.3457031 L 4.8789062 9.4472656 C 4.0331963 10.015693 3.3754436 11.399453 3.1191406 12.814453 C 2.7753256 14.712605 3.1904409 16.6847 4.1699219 17.929688 C 4.2834839 18.07403 4.559854 18.358221 4.6875 18.460938 C 5.063401 18.763409 5.4480405 18.93179 5.8984375 18.990234 L 5.9003906 18.990234 C 5.9261806 18.993534 8.2753744 18.996847 11.121094 18.998047 C 16.794183 19.000647 16.408827 19.007649 16.712891 18.912109 C 17.243469 18.745313 17.772642 18.295155 18.15625 17.685547 C 18.811258 16.644643 19.109197 15.20517 18.964844 13.767578 C 18.771594 11.843006 17.8629 10.280347 17.140625 10.007812 L 17.015625 9.9726562 L 17.011719 9.8417969 C 16.982009 8.7339357 16.923252 8.1786014 16.751953 7.4121094 C 16.284056 5.3184972 14.616172 3.6900555 13.25 3.1796875 C 12.879437 3.0412515 12.502687 2.9823797 12.128906 3.0039062 z M 9.7148438 8.0019531 C 10.498673 7.9926431 11.264571 8.0415241 11.876953 8.1523438 C 12.308939 8.2305178 12.684805 8.3321709 13.060547 8.4746094 C 13.926204 8.8027661 14.627783 9.3485835 14.898438 10.0625 C 15.079349 10.539724 14.993616 11.932057 14.847656 12.523438 C 14.720367 13.039129 14.387161 13.657689 13.966797 14.03125 L 15.511719 17 L 14.611328 17 L 13.888672 17 L 12.970703 17 L 12.097656 14.888672 C 11.728571 14.938392 11.358114 14.973572 10.919922 15.019531 C 10.576065 15.046371 9.9157265 15.043152 9.4609375 15.013672 C 9.2601725 15.000662 9.1187145 14.985922 9.1015625 14.982422 C 9.0844125 14.978922 9.0635875 14.984221 9.0546875 14.994141 C 9.0432775 15.006741 9.049475 14.416212 9.046875 15.0625 L 9.0429688 16.980469 L 7.6972656 16.982422 L 7 16.986328 L 7.0039062 12.142578 L 7.0078125 8.2988281 L 7.0625 8.28125 C 7.09339 8.27196 7.2654544 8.2378121 7.4433594 8.2050781 C 8.1293324 8.0788411 8.9310147 8.011263 9.7148438 8.0019531 z"/>
 <path style="fill:currentColor" class="ColorScheme-Highlight" d="m 10.550535,10.000576 c -0.446585,-0.00122 -0.9692383,0.03923 -1.3593753,0.109375 -0.07654,0.01377 -0.144097,0.02539 -0.148437,0.02539 -0.0043,0 -0.01536,0.0067 -0.02539,0.01563 -0.01629,0.01462 -0.01774,0.152504 -0.01758,1.373046 8.9e-5,0.764103 0.004,1.364947 0.0098,1.373047 0.01743,0.02457 0.347181,0.0724 0.65039,0.09375 0.29238,0.02059 1.0945903,0.0075 1.3808603,-0.02148 0.404483,-0.04094 0.790619,-0.131114 1.074214,-0.251953 0.340238,-0.144972 0.581902,-0.351208 0.730469,-0.621094 0.09849,-0.178921 0.139429,-0.326542 0.152344,-0.564453 0.02162,-0.398119 -0.112645,-0.72903 -0.400391,-0.984375 -0.342728,-0.304142 -0.848209,-0.468177 -1.632812,-0.53125 -0.124093,-0.01 -0.265201,-0.01522 -0.414063,-0.01563 z"/>
</svg>
