<svg xmlns="http://www.w3.org/2000/svg" width="16" height="16" version="1.1">
 <path style="fill:#c6c6c6" d="M 8 1 C 5.951 1 3.90175 1.7798906 2.34375 3.3378906 C -0.77225 6.4538906 -0.77225 11.534391 2.34375 14.650391 C 3.0683483 15.400022 4.3129192 14.679331 4.0234375 13.677734 L 4.8183594 12.882812 L 4.1113281 12.175781 L 3.4179688 12.869141 C 2.6100011 11.917909 2.1196818 10.737855 2.015625 9.4941406 L 3 9.4941406 L 3 8.4941406 L 2.015625 8.4941406 C 2.1196818 7.2504265 2.6100013 6.070372 3.4179688 5.1191406 L 4.1113281 5.8125 L 4.8183594 5.1054688 L 4.1269531 4.4140625 C 4.194771 4.3563902 4.2658445 4.3053942 4.3359375 4.2519531 L 4.3320312 4.2519531 C 4.3620813 4.2287117 4.3933287 4.2062735 4.4238281 4.1835938 C 4.4505585 4.1641372 4.4768724 4.1438733 4.5039062 4.125 C 5.4884622 3.4176821 6.6951818 3 8 3 C 9.2918576 3 10.487647 3.4089556 11.466797 4.1035156 C 11.532546 4.148506 11.596208 4.1976159 11.660156 4.2460938 C 11.732092 4.3006265 11.805465 4.353035 11.875 4.4121094 L 11.183594 5.1054688 L 11.890625 5.8125 L 12.582031 5.1191406 C 13.389998 6.070372 13.880318 7.2504265 13.984375 8.4941406 L 13 8.4941406 L 13 9.4941406 L 13.984375 9.4941406 C 13.880318 10.737855 13.389998 11.917909 12.582031 12.869141 L 11.888672 12.175781 L 11.181641 12.882812 L 11.978516 13.679688 C 11.696501 14.677296 12.931932 15.392093 13.65625 14.650391 C 16.77225 11.534391 16.77225 6.4538906 13.65625 3.3378906 C 12.156806 1.8373392 10.121314 0.99601204 8 1 z M 8 3 C 7.446 3 7 3.446 7 4 L 7 7.265625 C 6.3893857 7.618478 6.0004422 8.2726069 6 8.9941406 C 5.9999997 10.09871 6.8954303 10.994141 8 10.994141 C 9.1045697 10.994141 10 10.09871 10 8.9941406 C 10.000466 8.274331 9.6134701 7.6182963 9 7.2636719 L 9 4 C 9 3.446 8.554 3 8 3 z"/>
</svg>
