<svg xmlns="http://www.w3.org/2000/svg" width="24" height="24" version="1.1">
 <defs>
  <style id="current-color-scheme" type="text/css">
   .ColorScheme-Text { color:#c6c6c6; } .ColorScheme-Highlight { color:#4285f4; } .ColorScheme-NeutralText { color:#ff9800; } .ColorScheme-PositiveText { color:#4caf50; } .ColorScheme-NegativeText { color:#f44336; }
  </style>
 </defs>
 <path style="fill:currentColor" class="ColorScheme-Text" d="M 11.90625 4 C 11.425216 4.014529 11.126956 4.372199 10.914062 4.5390625 L 9.3359375 5.7871094 C 9.7296261 5.5233835 10.294177 5.2822077 11 5.203125 L 11 10 C 11 10.552285 11.447715 11 12 11 C 12.552285 11 13 10.552284 13 10 C 13 9.4477152 12.552285 9 12 9 C 11.871262 9.001 11.743931 9.0268819 11.625 9.0761719 L 11.625 7.0292969 C 11.75754 7.0108849 11.866179 7.000573 12 7 C 13.656854 7 15 8.3431456 15 10 C 15 11.656854 13.656854 13 12 13 C 10.343145 13 9 11.656854 9 10 L 9 6.0527344 L 4.4023438 9.6816406 L 7.1132812 11.902344 L 10.345703 14.517578 C 10.843152 14.269215 11.302634 14.053047 11.84375 13.998047 C 12.410315 13.940455 13.018498 14.084346 13.730469 14.457031 C 13.730469 14.457031 13.732422 14.457031 13.732422 14.457031 L 16.771484 11.998047 L 19.597656 9.6835938 L 13.085938 4.5390625 C 12.872591 4.372199 12.574784 4.0145296 12.09375 4 C 12.06373 3.9990384 12.03148 4.0020063 12 4.0039062 C 11.96852 4.0020263 11.93628 3.9991 11.90625 4 z M 4 10.669922 L 4 11.173828 L 4 14 L 4 15.097656 L 4 17.826172 L 4 18 C 4 18.012784 4.0034354 18.024444 4.0039062 18.037109 L 9.4003906 15.039062 L 6.8808594 13 L 6.875 13 L 6.4648438 12.664062 L 4 10.669922 z M 20 10.669922 L 17.46875 12.71875 L 17.125 13 L 17.121094 13 L 14.666016 14.986328 L 20 18.007812 C 20.000021 18.005153 20 18.002664 20 18 L 20 17.826172 L 20 15.097656 L 20 14 L 20 11.173828 L 20 10.669922 z M 12.210938 14.990234 C 12.118222 14.983898 12.031197 14.985411 11.945312 14.994141 C 11.601776 15.029061 11.238283 15.189945 10.724609 15.447266 L 4.5390625 18.882812 C 4.6773791 18.954882 4.8326612 19 5 19 L 5.1699219 19 L 18.830078 19 L 19 19 C 19.178295 19 19.343626 18.950263 19.488281 18.869141 L 13.267578 15.34375 C 12.813014 15.105648 12.489084 15.009244 12.210938 14.990234 z"/>
</svg>
