<svg xmlns="http://www.w3.org/2000/svg" width="22" height="22" version="1.1">
 <defs>
  <style id="current-color-scheme" type="text/css">
   .ColorScheme-Text { color:#c6c6c6; } .ColorScheme-Highlight { color:#4285f4; } .ColorScheme-NeutralText { color:#ff9800; } .ColorScheme-PositiveText { color:#4caf50; } .ColorScheme-NegativeText { color:#f44336; }
  </style>
 </defs>
 <path style="fill:currentColor" class="ColorScheme-Text" d="m 4,4.0000002 c 0,0 -1,0 -1,1 V 15 c 0,1 1,1 1,1 h 2 l 1,1 h 7 l 1,-1 h 2 c 0,0 1,0.13 1,-1 V 5.0000002 c 0,-1 -1,-1 -1,-1 z m 1,2 H 6 V 7.9999998 H 7 V 6.0000002 H 8 V 7.9999998 H 9 V 6.0000002 h 1 v 1.9999996 h 1 V 6.0000002 h 1 v 1.9999996 h 1 V 6.0000002 h 1 v 1.9999996 h 1 V 6.0000002 h 1 V 14 h -2 l -1,1 H 8 L 7,14 H 5 Z"/>
</svg>
