<svg xmlns="http://www.w3.org/2000/svg" width="22" height="22" version="1.1">
 <defs>
  <style id="current-color-scheme" type="text/css">
   .ColorScheme-Text { color:#c6c6c6; } .ColorScheme-Highlight { color:#4285f4; } .ColorScheme-NeutralText { color:#ff9800; } .ColorScheme-PositiveText { color:#4caf50; } .ColorScheme-NegativeText { color:#f44336; }
  </style>
 </defs>
 <g transform="translate(3,3)">
  <path style="fill:currentColor" class="ColorScheme-Text" d="M 3,1 V 3 H 13 V 1 Z M 2,3 C 2,3 0,3 0,5 V 13 C 0,15 2,15 2,15 H 8 V 10 L 2,7 Z M 14,3 V 7 L 12,8 H 16 V 5 C 16,3 14,3 14,3 Z M 3,5 V 7 H 13 V 5 Z M 10,9 C 9,9 9,10 9,10 V 15 C 9,15 9,16 10,16 H 15 C 16,16 16,15 16,15 V 10 C 16,10 16,9 15,9 Z M 10,10 H 11 V 11 H 12 V 12 H 13 V 11 H 14 V 10 H 15 V 15 H 14 V 12 H 13 V 13 H 12 V 12 H 11 V 15 H 10 Z"/>
 </g>
</svg>
