<svg xmlns="http://www.w3.org/2000/svg" width="16" height="16" version="1.1">
 <defs>
  <style id="current-color-scheme" type="text/css">
   .ColorScheme-Text { color:#c6c6c6; } .ColorScheme-Highlight { color:#4285f4; } .ColorScheme-NeutralText { color:#ff9800; } .ColorScheme-PositiveText { color:#4caf50; } .ColorScheme-NegativeText { color:#f44336; }
  </style>
 </defs>
 <path style="fill:currentColor" class="ColorScheme-Text" d="m 31.973689,-27.033178 c -4.4183,0 -8,3.5817 -8,8 0,4.418 3.5817,8 8,8 4.418,0 8,-3.582 8,-8 0,-4.4183 -3.582,-8 -8,-8 z m -1,3 h 2 v 5 h 3 l -4,5 -4,-5 h 3 z"/>
 <path style="fill:currentColor" class="ColorScheme-Text" d="m 8,4.14e-4 c -2.2160002,0 -4,1.784 -4,4 0,2.216 1.7839998,4 4,4 2.216,0 4,-1.784 4,-4 0,-2.216 -1.784,-4 -4,-4 z m 0,2 c 1.104572,0 2,0.8954279 2,2 0,1.104572 -0.895428,2 -2,2 -1.104572,0 -2,-0.895428 -2,-2 0,-1.1045721 0.895428,-2 2,-2 z M 7.798828,2.3832265 c -0.05863,0.00596 -0.117044,0.00988 -0.173828,0.021484 -0.114001,0.023317 -0.221411,0.053346 -0.326172,0.097656 -0.500679,0.211739 -0.87909,0.6514102 -1.013672,1.1875 0.0035,0.00376 0.0078,0.00747 0.01172,0.011719 0.09393,0.1003239 0.338996,0.2386558 0.521485,0.3046875 0.0998,0.036119 0.29383,0.092097 0.425781,0.1191406 0.131958,0.026991 0.220031,0.053657 0.207031,0.054687 -0.013,0.00106 -0.07219,0.044908 -0.13086,0.097656 C 7.208404,4.37837 7.151882,4.4681282 7.103517,4.6273659 c -0.02654,0.087188 -0.02482,0.1149147 0.0098,0.1621094 0.02084,0.02844 0.114331,0.09496 0.207031,0.1523437 0.0927,0.057387 0.201573,0.136354 0.240235,0.173828 0.144035,0.139591 0.238281,0.390305 0.238281,0.632813 0,0.06206 0.0072,0.09525 0.01172,0.109375 0.01178,0.001 0.02139,-0.0011 0.0332,0 0.02666,-0.01028 0.06731,-0.02286 0.130859,-0.05469 0.532431,-0.266529 0.77398,-0.611772 0.75,-1.0683597 C 8.705513,4.3706762 8.536196,4.2389705 7.84375,4.0922109 7.333863,3.9841282 7.058594,3.8017882 7.058594,3.5707265 c 0,-0.060932 0.02132,-0.097506 0.08789,-0.1640625 0.07155,-0.071561 0.08532,-0.075503 0.140625,-0.064453 0.03522,0.00704 0.12734,0.052049 0.197266,0.1074219 0.157412,0.1246472 0.233041,0.1738281 0.314453,0.1738281 0.03468,0 0.06641,-0.00459 0.06641,-0.00977 0,-0.00519 -0.02625,-0.045907 -0.05469,-0.087891 -0.15716,-0.2315707 -0.147853,-0.6652152 0.02148,-1.0351562 0.0266,-0.058077 0.04773,-0.096269 0.04492,-0.1074219 -0.02352,0.0014 -0.0548,-0.00244 -0.07813,0 z M 3.1015625,2.9867421 1.8886719,3.6859609 C 1.7072932,3.7959973 1.5472053,3.9375824 1.4160156,4.1039296 c -0.00261,0.0026 -0.00521,0.0052 -0.00781,0.00781 -0.058438,0.064977 -0.11197,0.1341859 -0.1601562,0.2070313 -0.03772,0.072528 -0.07035,0.1475885 -0.097656,0.2246094 -0.029353,0.058409 -0.055435,0.1184048 -0.078125,0.1796874 6.484e-4,0.0013 0.0013,0.00261 0.00195,0.00391 C 1.0264951,4.8860938 1.0015096,5.051151 1,5.217211 v 6.009765 c 3.392e-4,0.631859 0.3391034,1.215643 0.8886719,1.53125 l 5.2226561,3.003907 c 0.549812,0.316604 1.227532,0.316604 1.777344,0 l 5.222656,-3.003907 C 14.660897,12.442619 14.999661,11.858834 15,11.226976 V 5.217211 C 14.999679,5.049279 14.975346,4.8822137 14.927734,4.7211171 14.799452,4.284311 14.507041,3.913504 14.111328,3.6859609 l -1.21289,-0.6992188 c 7.81e-4,0.00383 -4.29e-4,0.00786 0,0.011719 A 5,5 0 0 1 13,4.000414 a 5,5 0 0 1 -5,5 5,5 0 0 1 -5,-5 5,5 0 0 1 0.099609,-0.9375 C 3.096489,3.036957 3.096499,3.011501 3.101559,2.986742 Z M 9.425781,3.1996328 c -0.05466,0.014104 -0.28629,0.25951 -0.341797,0.3710937 -0.117402,0.2360314 -0.07324,0.3897988 0.207032,0.6855469 0.0971,0.1024533 0.21537,0.2398798 0.251953,0.3046875 0.03657,0.064817 0.0676,0.118645 0.07617,0.109375 0.0086,-0.00927 0.03458,-0.084443 0.05469,-0.1640625 0.05285,-0.2091946 0.05696,-0.572618 0,-0.7832032 -0.04412,-0.1631171 -0.1993,-0.4981367 -0.240234,-0.5234374 -0.002,-0.00122 -0.0042,-9.403e-4 -0.0078,0 z"/>
</svg>
