<svg xmlns="http://www.w3.org/2000/svg" width="16" height="16" version="1.1">
 <defs>
  <style id="current-color-scheme" type="text/css">
   .ColorScheme-Text { color:#c6c6c6; } .ColorScheme-Highlight { color:#4285f4; } .ColorScheme-NeutralText { color:#ff9800; } .ColorScheme-PositiveText { color:#4caf50; } .ColorScheme-NegativeText { color:#f44336; }
  </style>
 </defs>
 <path style="fill:currentColor" class="ColorScheme-Text" d="m 5.5996092,-2.6203061e-4 c -0.8864,0 -1.5996091,0.74445067061 -1.5996091,1.66796883061 V 2.999738 H 10.400391 C 11.806168,2.999738 13,4.1361748 13,5.5485661 V 9.999738 h 1.400391 C 15.286791,9.999738 16,9.2552873 16,8.3317692 V 1.6677068 C 16,0.74418864 15.286791,-2.6203061e-4 14.400391,-2.6203061e-4 Z M 1.5996093,3.999738 C 0.71320915,3.999738 -1.5e-7,4.6907783 -1.5e-7,5.5485661 v 6.1933599 3.669921 c 0,0.523369 0.6523839,0.784543 1.03320305,0.416016 l 2.5000003,-2.828125 h 6.8164058 c 1.35,0 1.650391,-1.099892 1.650391,-1.658203 V 10.999738 H 5.5996092 c -1.445576,0 -2.5996093,-1.2293206 -2.5996093,-2.6679688 V 3.999738 Z m 2.4003908,0 v 1 3.3339844 c 1.251e-4,0.1147536 0.01209,0.2258613 0.0332,0.3339844 1.21e-4,6.249e-4 -1.22e-4,0.00133 0,0.00195 0.01055,0.053722 0.02371,0.1065242 0.03906,0.1582031 1.78e-4,6.016e-4 -1.789e-4,0.00135 0,0.00195 0.01541,0.051663 0.03279,0.102994 0.05273,0.1523438 2.279e-4,5.655e-4 -2.29e-4,0.00139 0,0.00195 0.04023,0.09923 0.08943,0.1930218 0.1464839,0.28125 3.06e-4,4.74e-4 -3.07e-4,0.00148 0,0.00195 0.05716,0.088214 0.123395,0.1691261 0.195313,0.2441407 0.1086571,0.113368 0.2326941,0.2101245 0.36914,0.2871093 0.226694,0.1281588 0.486672,0.2011843 0.763672,0.2011843 h 5.400391 1 v -1 -3.4511719 c 0,-0.8577878 -0.713209,-1.5488281 -1.599609,-1.5488281 H 4.9999902 Z"/>
</svg>
