<svg xmlns="http://www.w3.org/2000/svg" width="22" height="22" version="1.1">
 <defs>
  <style id="current-color-scheme" type="text/css">
   .ColorScheme-Text { color:#a0a0a0; } .ColorScheme-Highlight { color:#4285f4; } .ColorScheme-NeutralText { color:#ff9800; } .ColorScheme-PositiveText { color:#4caf50; } .ColorScheme-NegativeText { color:#f44336; }
  </style>
 </defs>
 <path style="fill:currentColor;opacity:.35" class="ColorScheme-Text" d="M 6.0253906 4 L 6.0253906 4.0019531 C 3.5366823 4.0019531 1.6659672 6.0030219 1.5351562 8.4824219 L 1.0371094 16.943359 C 0.72208294 18.793359 2.5196244 19.9605 4.03125 17.9375 C 4.9738288 16.6585 7 14 7 14 L 15 14.041016 L 17.988281 18.0625 C 19.487306 20.0745 21.174891 18.420374 20.984375 17.058594 L 20.488281 8.5839844 C 20.489065 8.5493604 20.498047 8.5172394 20.498047 8.4824219 C 20.498017 6.0000219 18.496121 4 16.007812 4 L 10.990234 4 C 11.806944 4 12.603248 4.2394575 13.171875 4.7910156 C 13.728124 5.3305664 14 6.1117169 14 6.8964844 C 14 7.3211767 13.933826 7.7354108 13.767578 8.1210938 C 13.624451 8.4603138 13.418576 8.7719292 13.166016 9.0429688 C 12.966508 9.2570743 12.737967 9.4764666 12.480469 9.7070312 C 12.478569 9.7087414 12.478463 9.7092375 12.476562 9.7109375 L 12.474609 9.7128906 C 12.287957 9.8834223 12.157306 10.021595 12.085938 10.109375 C 12.043517 10.168488 12.028544 10.206338 12.027344 10.210938 A 1.0001 1.0001 0 0 1 12.023438 10.222656 C 12.016766 10.246492 12 10.339067 12 10.484375 L 12 10.669922 A 1.0001 1.0001 0 0 1 11.869141 11.162109 C 12.142165 11.512052 12.302734 11.911891 12.302734 12.263672 C 12.302734 12.679137 12.202798 13.1766 11.810547 13.550781 C 11.522025 13.82601 11.084792 14 10.6875 14 C 10.293698 14 9.8448744 13.838781 9.5429688 13.550781 A 1.0001 1.0001 0 0 1 9.5214844 13.529297 C 9.1431829 13.147196 9.0605469 12.670509 9.0605469 12.263672 C 9.0605469 11.929854 9.2149276 11.555679 9.4550781 11.212891 A 1.0001 1.0001 0 0 1 9.2929688 10.669922 L 9.2929688 10.376953 C 9.2929686 10.045118 9.3202901 9.7367164 9.3925781 9.4375 A 1.0001 1.0001 0 0 1 9.3964844 9.4140625 C 9.4792917 9.1030376 9.61567 8.8081983 9.7949219 8.5410156 A 1.0001 1.0001 0 0 1 9.8105469 8.5195312 C 9.9933916 8.261342 10.214377 8.0250684 10.470703 7.7929688 C 10.716877 7.5693657 10.898068 7.3880374 11 7.2734375 A 1.0001 1.0001 0 0 1 11.015625 7.2558594 C 11.101952 7.1632155 11.131714 7.1043925 11.132812 7.1015625 C 11.132593 7.102116 11.152344 7.0415881 11.152344 6.9179688 C 11.152344 6.8686665 11.153747 6.8677729 11.154297 6.8574219 C 11.171357 6.8708001 11.153731 6.8339844 10.929688 6.8339844 C 10.694626 6.8339844 10.519882 6.8680415 10.394531 6.9140625 A 1.0001 1.0001 0 0 1 10.371094 6.921875 C 10.162762 6.9924771 9.9650606 7.0769149 9.7753906 7.1757812 A 1.0001 1.0001 0 0 1 8.3886719 6.671875 L 8.0761719 5.9121094 A 1.0001 1.0001 0 0 1 8.5097656 4.6601562 C 8.8453645 4.4710749 9.2061539 4.317367 9.5898438 4.1972656 A 1.0001 1.0001 0 0 1 9.5957031 4.1953125 C 10.03504 4.0606029 10.502725 4 10.990234 4 L 6.0253906 4 z"/>
 <path style="fill:currentColor" class="ColorScheme-Text" d="m 10.292929,10.669377 v -0.292683 q 0,-0.411924 0.07071,-0.704607 0.08081,-0.303523 0.262625,-0.5745257 0.191919,-0.2710027 0.515152,-0.5636857 0.393939,-0.3577236 0.60606,-0.596206 0.222223,-0.2384824 0.313132,-0.4661247 0.09091,-0.2276422 0.09091,-0.5528455 0,-0.5203252 -0.313132,-0.8021681 -0.313131,-0.2818428 -0.90909,-0.2818428 -0.49495,0 -0.878788,0.1409214 Q 9.6666667,6.1056912 9.3131313,6.2899731 L 9,5.5311655 Q 9.4040404,5.3035232 9.8888889,5.1517616 10.383838,5.0000001 10.989899,5.0000001 q 0.959596,0 1.484848,0.5094851 Q 13,6.0189704 13,6.8970192 13,7.3848241 12.848484,7.7317076 12.707071,8.0677509 12.434343,8.3604339 12.171717,8.6422767 11.80808,8.96748 q -0.333333,0.303523 -0.515151,0.5311653 -0.171717,0.2276423 -0.232323,0.4552846 -0.06061,0.2168021 -0.06061,0.5311651 v 0.184282 z m -0.232323,1.593496 q 0,-0.401084 0.171717,-0.563686 0.181818,-0.162601 0.454545,-0.162601 0.252526,0 0.434344,0.162601 0.181818,0.162602 0.181818,0.563686 0,0.390244 -0.181818,0.563686 Q 10.939394,13 10.686868,13 10.414141,13 10.232323,12.826559 10.060606,12.653117 10.060606,12.262873 Z"/>
</svg>
