<svg xmlns="http://www.w3.org/2000/svg" width="24" height="24" version="1.1">
 <defs>
  <style id="current-color-scheme" type="text/css">
   .ColorScheme-Text { color:#e4e4e4; } .ColorScheme-Highlight { color:#4285f4; } .ColorScheme-NeutralText { color:#ff9800; } .ColorScheme-PositiveText { color:#4caf50; } .ColorScheme-NegativeText { color:#f44336; }
  </style>
 </defs>
 <path style="opacity:0.35;fill:currentColor" class="ColorScheme-Text" d="M 5.7322049,5.0005404 C 5.6904289,4.9995578 5.6499769,5.0007761 5.609158,5.0024904 4.3845768,5.0544584 3.5722367,6.3213845 4.2400174,7.3716311 l 0.064453,0.064453 6.7070316,0.7382813 A 5,5 0 0 1 10.999782,8.0005404 5,5 0 0 1 11.61111,5.6313998 L 5.859158,5.0083529 c -0.042495,-0.00389 -0.085177,-0.00683 -0.1269531,-0.00781 z m -0.84375,3.505859 4.6601562,8.1328136 c 0.5841279,-0.09439 0.6931899,-0.245292 1.0546879,-0.748047 L 13.12283,12.076713 A 5,5 0 0 1 11.156033,9.1958537 Z m 9.1035151,4.0683606 -2.564453,3.884765 -0.582031,0.808594 c -0.259018,0.311185 -0.778392,0.310925 -0.9726561,-0.0625 l 0.5839841,0.996094 c 0.129509,0.18671 0.259163,0.311073 0.388672,0.435547 0.7123,0.560131 1.878147,0.498269 2.460938,-0.373047 l 3.664062,-5.371094 A 5,5 0 0 1 15.999783,13.000541 5,5 0 0 1 13.99197,12.57476 Z"/>
 <path style="fill:currentColor" class="ColorScheme-Text" d="m 15.939236,3.9985873 c -0.05777,9.358e-4 -0.115791,0.00433 -0.173828,0.00781 -0.265312,0.01593 -0.534044,0.059389 -0.800781,0.1308594 -2.1339,0.5718 -3.399824,2.7645374 -2.828125,4.898438 0.57174,2.1337993 2.764537,3.3999243 4.898437,2.8281243 2.1339,-0.5718 3.399825,-2.7645373 2.828125,-4.8984373 C 19.378426,5.1566552 17.730239,3.9695769 15.939236,3.9985873 Z m -1.439453,2.0019531 a 0.5,0.5 0 0 1 0.353516,0.1464844 l 1.146484,1.1464844 1.146484,-1.1464844 a 0.5,0.5 0 0 1 0.707032,0 0.5,0.5 0 0 1 0,0.7070312 l -1.146485,1.1464844 1.146485,1.1464843 a 0.5,0.5 0 0 1 0,0.707032 0.5,0.5 0 0 1 -0.707032,0 L 15.999783,8.7075714 14.853299,9.8540567 a 0.5,0.5 0 0 1 -0.707032,0 0.5,0.5 0 0 1 0,-0.707032 L 15.292752,8.0005404 14.146267,6.854056 a 0.5,0.5 0 0 1 0,-0.7070312 0.5,0.5 0 0 1 0.353516,-0.1464844 z"/>
</svg>
