<svg xmlns="http://www.w3.org/2000/svg" width="22" height="22" version="1.1">
 <defs>
  <style id="current-color-scheme" type="text/css">
   .ColorScheme-Text { color:#e4e4e4; } .ColorScheme-Highlight { color:#4285f4; } .ColorScheme-NeutralText { color:#ff9800; } .ColorScheme-PositiveText { color:#4caf50; } .ColorScheme-NegativeText { color:#f44336; }
  </style>
 </defs>
 <path style="fill:currentColor" class="ColorScheme-Text" d="M 6.5 6 C 4.3690474 6 3.0571007 7.3753205 2.5214844 8.5996094 C 2.051515 9.6738449 2.0063459 10.662297 2.0019531 10.900391 L 2 10.900391 C 2 10.900391 2.0019204 10.933343 2.0019531 10.939453 C 2.0018767 10.952051 2 11 2 11 L 2.0039062 11 C 2.0114778 11.229984 2.0704438 12.062849 2.5664062 12.941406 C 3.1442042 13.964929 4.4547662 15 6.5 15 C 7.7083322 15 8.7502672 14.416688 9.6679688 13.689453 C 10.313515 13.177888 10.915564 12.574898 11.5 11.958984 C 12.084436 12.574898 12.686485 13.177888 13.332031 13.689453 C 14.249733 14.416688 15.291668 15 16.5 15 C 18.53571 15 19.842081 14.00453 20.425781 13.003906 C 20.924936 12.148218 20.98763 11.330105 20.996094 11.099609 L 21 11.099609 C 21 11.099609 20.998112 11.051395 20.998047 11.039062 C 20.998096 11.032768 21 11 21 11 L 20.998047 11 C 20.993961 10.761701 20.950436 9.7547052 20.482422 8.6582031 C 19.950439 7.411819 18.640476 6 16.5 6 C 15.291668 6 14.249733 6.5833116 13.332031 7.3105469 C 12.686485 7.822112 12.084436 8.4251014 11.5 9.0410156 C 10.915564 8.4251013 10.313515 7.822112 9.6679688 7.3105469 C 8.7502669 6.5833116 7.7083321 6 6.5 6 z M 6.5 8 C 7.0416661 8 7.6872345 8.2916896 8.4257812 8.8769531 C 8.9698298 9.3080863 9.5423284 9.8795334 10.130859 10.5 C 9.5423286 11.120466 8.9698299 11.691914 8.4257812 12.123047 C 7.6872344 12.70831 7.0416662 13 6.5 13 C 5.0452373 13 4.6057924 12.485448 4.3085938 11.958984 C 4.0493824 11.499813 4.010357 11.058247 4.0039062 10.947266 C 4.0087945 10.8141 4.0459927 10.103313 4.3535156 9.4003906 C 4.6928874 8.6246688 5.1309561 8 6.5 8 z M 16.5 8 C 17.85952 8 18.299573 8.6397333 18.642578 9.4433594 C 18.952398 10.169237 18.990918 10.901575 18.996094 11.042969 C 18.99028 11.144998 18.954033 11.559247 18.699219 11.996094 C 18.407923 12.495456 17.964287 13 16.5 13 C 15.958334 13 15.312766 12.70831 14.574219 12.123047 C 14.03017 11.691914 13.457672 11.120466 12.869141 10.5 C 13.457672 9.8795333 14.03017 9.3080861 14.574219 8.8769531 C 15.312766 8.2916896 15.958334 8 16.5 8 z M 6.5 9 A 0.5 0.5 0 0 0 6 9.5 L 6 10 L 5.5 10 A 0.5 0.5 0 0 0 5 10.5 A 0.5 0.5 0 0 0 5.5 11 L 6 11 L 6 11.5 A 0.5 0.5 0 0 0 6.5 12 A 0.5 0.5 0 0 0 7 11.5 L 7 11 L 7.5 11 A 0.5 0.5 0 0 0 8 10.5 A 0.5 0.5 0 0 0 7.5 10 L 7 10 L 7 9.5 A 0.5 0.5 0 0 0 6.5 9 z M 16.5 9 A 0.5 0.5 0 0 0 16 9.5 A 0.5 0.5 0 0 0 16.5 10 A 0.5 0.5 0 0 0 17 9.5 A 0.5 0.5 0 0 0 16.5 9 z M 15.5 10 A 0.5 0.5 0 0 0 15 10.5 A 0.5 0.5 0 0 0 15.5 11 A 0.5 0.5 0 0 0 16 10.5 A 0.5 0.5 0 0 0 15.5 10 z M 17.5 10 A 0.5 0.5 0 0 0 17 10.5 A 0.5 0.5 0 0 0 17.5 11 A 0.5 0.5 0 0 0 18 10.5 A 0.5 0.5 0 0 0 17.5 10 z M 16.5 11 A 0.5 0.5 0 0 0 16 11.5 A 0.5 0.5 0 0 0 16.5 12 A 0.5 0.5 0 0 0 17 11.5 A 0.5 0.5 0 0 0 16.5 11 z"/>
</svg>
