<svg xmlns="http://www.w3.org/2000/svg" width="16" height="16" version="1.1">
 <defs>
  <style id="current-color-scheme" type="text/css">
   .ColorScheme-Text { color:#a0a0a0; } .ColorScheme-Highlight { color:#4285f4; } .ColorScheme-NeutralText { color:#ff9800; } .ColorScheme-PositiveText { color:#4caf50; } .ColorScheme-NegativeText { color:#f44336; }
  </style>
 </defs>
 <path style="fill:currentColor" class="ColorScheme-Text" d="m 2,1.0000001 c -0.55,0 -1,0.45 -1,1 V 14 c 0,0.55 0.45,1 1,1 H 8 V 13 H 3 V 3.0000001 h 1 v 5 h 4 4 v -5 h 1 v 5 h 2 v -5 l -2,-2 z m 4,2 h 2 v 4 H 6 Z m 3.875,6 c 0,0 -0.875,1e-7 -0.875,0.9999999 v 5 c 0,1 0.875,1 0.875,1 h 5.25 c 0,0 0.875,0 0.875,-1 V 10 C 16,9.0000002 15.125,9.0000001 15.125,9.0000001 Z M 11,10 h 3 v 5 h -1 v -2 h -1 v 2 h -1 z m 1,1 v 1 h 1 v -1 z"/>
</svg>
