<svg xmlns="http://www.w3.org/2000/svg" width="22" height="22" version="1.1">
 <defs>
  <style id="current-color-scheme" type="text/css">
   .ColorScheme-Text { color:#a0a0a0; } .ColorScheme-Highlight { color:#4285f4; } .ColorScheme-NeutralText { color:#ff9800; } .ColorScheme-PositiveText { color:#4caf50; } .ColorScheme-NegativeText { color:#f44336; }
  </style>
 </defs>
 <path style="fill:currentColor" class="ColorScheme-Text" d="M 9.6660156,3 7,5.8574219 V 12.285156 C 7,12.285156 6.9993486,13 7.6660156,13 H 14.333984 C 14.333984,13 15,12.999442 15,12.285156 V 3.7148437 C 15,3.0005579 14.333984,3 14.333984,3 Z M 10.414063,5 H 13 v 6 H 9 V 6.6972656 Z M 5.6660156,9 3,11.857422 v 6.427734 C 3,18.285156 2.9993486,19 3.6660156,19 H 10.333984 C 10.333984,19 11,18.999442 11,18.285156 11,18.285156 10.999349,19 11.666016,19 h 6.667968 C 18.333984,19 19,18.999442 19,18.285156 V 9.714844 C 19,9.000558 18.333984,9 18.333984,9 H 16 v 2 h 1 v 6 H 13 V 14 H 11 9 v 3 H 5 V 12.697266 L 6,11.496094 V 9 Z"/>
</svg>
