<svg xmlns="http://www.w3.org/2000/svg" width="22" height="22" version="1.1">
 <defs>
  <linearGradient id="linearGradient3605" x1="7" x2="19" y1="12" y2="5" gradientTransform="matrix(-.43209 .90183 .90183 .43209 5.3637 -5.007)" gradientUnits="userSpaceOnUse">
   <stop offset="0" stop-color="#a0a0a0" stop-opacity=".5"/>
   <stop offset="1" stop-color="#a0a0a0" stop-opacity="0"/>
  </linearGradient>
  <linearGradient id="linearGradient3611" x1="7" x2="17" y1="12" y2="12" gradientTransform="matrix(.43209 -.90183 -.90183 -.43209 16.637 27.007)" gradientUnits="userSpaceOnUse">
   <stop offset="0" stop-color="#a0a0a0"/>
   <stop offset="1" stop-color="#a0a0a0" stop-opacity=".5"/>
  </linearGradient>
 </defs>
 <path style="fill:url(#linearGradient3611)" d="m14.025 4.6875l-0.865 1.8027c1.794 0.8592 2.813 2.6498 2.811 4.5138 0.01 0 0.019-0.004 0.029-0.004 0.743 0 1.411 0.288 1.932 0.744 0.307-2.8653-1.158-5.7402-3.907-7.0565zm-5.607 10.714c-0.9348-0.023-1.4673 1.418-0.4414 1.909 1.3023 0.624 2.6944 0.783 4.0234 0.587v-2.031c-1.033 0.216-2.135 0.133-3.1602-0.357-0.1465-0.07-0.2883-0.104-0.4218-0.108z"/>
 <path style="fill:url(#linearGradient3605)" d="m11.33 4.0059c-2.7249-0.1273-5.3896 1.3539-6.6425 3.9687-1.6704 3.4864-0.1974 7.6674 3.2891 9.3374l0.8632-1.802c-2.4903-1.193-3.5408-4.18-2.3476-6.6702 1.1931-2.4903 4.1788-3.5428 6.6698-2.3496l0.863-1.8027c-0.871-0.4176-1.787-0.6392-2.695-0.6816z"/>
 <path fill="#a0a0a0" d="m16 12c-1.108 0-2 0.91085-2 2.0312v0.96875h-1v4h6v-4h-1v-0.96875c0-1.12-0.892-2.031-2-2.031zm0 1c0.554 0 1 0.4424 1 1v1h-2v-1c0-0.5576 0.446-1 1-1z"/>
</svg>
