<svg xmlns="http://www.w3.org/2000/svg" width="16" height="16" version="1.1">
 <path style="fill:#a0a0a0" d="M 7.6606729,0.00754076 A 8.0082745,8.0082291 0 0 0 1.2496527,3.7031079 8.0102748,8.0102294 0 0 0 1.9857698,13.278577 8.0072743,8.007229 0 0 0 11.384266,15.24988 1.0001592,1.0001535 0 1 0 10.538131,13.437602 5.9939539,5.99392 0 0 1 3.4880089,11.958375 5.9909534,5.9909195 0 0 1 2.9379213,4.7772728 5.9909534,5.9909195 0 0 1 9.6759937,2.2398834 a 5.9919536,5.9919197 0 0 1 4.3236883,5.7608842 1.0001592,1.0001535 0 0 0 0,0.041006 v 0.9591472 a 0.99415821,0.99415258 0 0 1 -0.50008,0.8651328 0.99315805,0.99315243 0 0 1 -1.000159,0 0.99515837,0.99515274 0 0 1 -0.500079,-0.8651325 V 8.0007676 c 0,-2.1973373 -1.803287,-4.0006141 -4.0006373,-4.0006141 -2.1973497,0 -4.0006366,1.8032768 -4.0006366,4.0006141 0,2.1973374 1.8032869,4.0006134 4.0006366,4.0006134 1.0441662,0 1.9903168,-0.416064 2.7054303,-1.078165 0.222036,0.26504 0.487078,0.498076 0.795127,0.676104 a 3.0044781,3.0044611 0 0 0 3.000478,0 A 3.003478,3.003461 0 0 0 16,9.0009211 V 8.0007676 A 8.0092746,8.0092293 0 0 0 10.237083,0.31758834 7.9842706,7.9842254 0 0 0 7.6606729,0.00754076 Z M 7.9987267,6.0004606 c 1.1171778,0 2.0003181,0.8841357 2.0003181,2.000307 0,1.1161713 -0.8831403,2.0003074 -2.0003181,2.0003074 -1.1161776,0 -2.0003183,-0.8841361 -2.0003183,-2.0003074 0,-1.1161713 0.8841407,-2.000307 2.0003183,-2.000307 z"/>
</svg>
