<svg xmlns="http://www.w3.org/2000/svg" width="22" height="22" version="1.1">
 <defs>
  <style id="current-color-scheme" type="text/css">
   .ColorScheme-Text { color:#a0a0a0; } .ColorScheme-Highlight { color:#4285f4; } .ColorScheme-NeutralText { color:#ff9800; } .ColorScheme-PositiveText { color:#4caf50; } .ColorScheme-NegativeText { color:#f44336; }
  </style>
 </defs>
 <path style="fill:currentColor" class="ColorScheme-Text" d="M 5.4003906,6 C 4.6247906,6 4,6.6363058 4,7.427734 v 7.144532 C 4,15.363694 4.6247906,16 5.4003906,16 H 10.423828 A 5,5 0 0 1 10,14 5,5 0 0 1 15,9 5,5 0 0 1 18,10.001953 V 7.427734 C 18,6.6363058 17.375209,6 16.599609,6 Z M 15,10 a 4,4 0 0 0 -4,4 4,4 0 0 0 4,4 4,4 0 0 0 4,-4 4,4 0 0 0 -4,-4 z m 0,1 c 1.656854,0 3,1.343146 3,3 0,1.656854 -1.343146,3 -3,3 v -1 c 1.10457,0 2,-0.89543 2,-2 0,-1.104569 -0.89543,-2 -2,-2 -0.785337,0.0037 -1.495834,0.466655 -1.816406,1.183594 L 14,14 h -1 -1 v -2 l 0.441406,0.441406 C 12.984734,11.547816 13.954196,11.00166 15,11 Z"/>
</svg>
