<svg xmlns="http://www.w3.org/2000/svg" width="16" height="16" version="1.1">
 <path style="fill:#a0a0a0" d="M 11,3.95 C 10.61,3.95 10.25,4.0395 9.9199,4.1895 9.9699,4.4495 10,4.72 10,5 10,6.1 9.5503,7.1001 8.8203,7.8301 9.2803,8.5301 10.08,9 11,9 12.43,9 13.59,7.87 13.59,6.47 13.59,5.08 12.43,3.95 11,3.95 Z M 11,10 C 10.8,10 10.63,10.01 10.45,10.02 11.14,10.42 11.68,10.9 12.05,11.4 12.99,12.66 13,14 13,14 H 16 V 13 C 16,13 16,10 11,10 Z"/>
 <path style="fill:#a0a0a0" d="M 6,2 C 7.66,2 9,3.34 9,5 9,6.65 7.66,8 6,8 4.34,8 3,6.65 3,5 3,3.34 4.34,2 6,2 Z M 6,10 C 11.277,10 12,14 12,14 V 15 H 0 V 14 C 0,14 0,10 6,10 Z"/>
</svg>
