<svg xmlns="http://www.w3.org/2000/svg" width="22" height="22" version="1.1">
 <defs>
  <style id="current-color-scheme" type="text/css">
   .ColorScheme-Text { color:#e4e4e4; } .ColorScheme-Highlight { color:#4285f4; } .ColorScheme-NeutralText { color:#ff9800; } .ColorScheme-PositiveText { color:#4caf50; } .ColorScheme-NegativeText { color:#f44336; }
  </style>
 </defs>
 <path style="fill:currentColor" class="ColorScheme-Text" d="M 14,11 C 14,12.657 12.657,14 11,14 9.3433,14 8,12.657 8,11 8,9.3435 9.3433,8.0002 11,8.0002 12.657,8.0002 14,9.3435 14,11 Z M 4.8322,3.0002 C 4.6216,3.0049 4.4383,3.0807 4.3009,3.2172 4.1057,3.4082 4,3.7174 4,4.1175 V 17.877 C 4,18.277 4.1147,18.587 4.3,18.778 4.5846,19.06 5.028,19.086 5.5334,18.785 L 17.361,11.893 C 18.213,11.402 18.213,10.602 17.361,10.102 L 16.883,9.8226 C 16.335,7.0733 13.911,5.0002 11,5.0002 10.346,5.0002 9.7159,5.1067 9.1271,5.3002 L 5.5334,3.2074 C 5.2807,3.0619 5.0428,2.9958 4.8322,3.0002 Z M 11,6.0002 C 13.774,6.0002 16,8.227 16,11 16,11.189 15.967,11.374 15.945,11.561 L 9.049,15.576 C 8.3721,15.395 6,13.893 6,11 6,8.1502 8.3995,6.0002 11,6.0002 Z M 16,14 V 20 H 18 V 14 Z M 19,14 V 20 H 21 V 14 Z"/>
</svg>
