<svg xmlns="http://www.w3.org/2000/svg" width="16" height="16" version="1.1">
 <defs>
  <style id="current-color-scheme" type="text/css">
   .ColorScheme-Text { color:#a0a0a0; } .ColorScheme-Highlight { color:#4285f4; } .ColorScheme-NeutralText { color:#ff9800; } .ColorScheme-PositiveText { color:#4caf50; } .ColorScheme-NegativeText { color:#f44336; }
  </style>
 </defs>
 <path style="fill:currentColor;opacity:0.35" class="ColorScheme-Text" d="m 9.3297051,12.098513 -2.4226793,2.655385 c -0.3011489,0.330081 -0.8276228,0.326185 -1.1329875,0 L 3.0256442,11.918431 0.23225005,8.834258 c -0.2999491,-0.331172 -0.30710101,-0.8236134 0,-1.1481645 L 2.5553786,5.230961 c 0.3070996,-0.3245524 0.8192187,-0.3181094 1.1329873,1e-7 l 5.64134,5.7193859 c 0.3137688,0.31811 0.3011526,0.818087 4e-7,1.148165 z"/>
 <rect style="fill:currentColor" class="ColorScheme-Text" width="4.857" height="14.244" x="10.39" y="-8.06" ry=".774" transform="matrix(0.69970749,0.71442945,-0.69970749,0.71442945,0,0)"/>
</svg>
