<svg xmlns="http://www.w3.org/2000/svg" width="16" height="16" version="1.1">
 <defs>
  <style id="current-color-scheme" type="text/css">
   .ColorScheme-Text { color:#c6c6c6; } .ColorScheme-Highlight { color:#4285f4; } .ColorScheme-NeutralText { color:#ff9800; } .ColorScheme-PositiveText { color:#4caf50; } .ColorScheme-NegativeText { color:#f44336; }
  </style>
 </defs>
 <path style="fill:currentColor" class="ColorScheme-Text" d="M 8 0 A 8 8 0 0 0 0 8 A 8 8 0 0 0 8 16 A 8 8 0 0 0 12.037109 14.904297 A 2.5 2.5 0 0 1 12 14.5 A 2.5 2.5 0 0 1 14.5 12 A 2.5 2.5 0 0 1 14.90625 12.035156 A 8 8 0 0 0 16 8 A 8 8 0 0 0 8 0 z M 4.8671875 5 C 5.0574107 5.0004136 5.322616 5.0135925 5.7929688 5.0390625 C 7.6217268 5.1381015 8.0012337 5.1414307 9.0585938 5.0722656 C 10.362182 4.9869866 11.60682 4.9861965 11.96875 5.0703125 C 12.707169 5.2419865 13.379006 5.8160907 13.753906 6.5976562 C 13.958621 7.0244285 14.021611 7.3651637 13.994141 7.8828125 C 13.971161 8.3157465 13.888527 8.7193425 13.755859 9.0429688 C 13.54618 9.5544559 13.044122 10.136915 12.625 10.355469 C 12.149801 10.603267 11.347523 10.806272 10.355469 10.927734 C 9.8228828 10.992944 7.0278052 11.025943 6.2226562 10.976562 C 5.4220373 10.927457 4.4006163 10.76279 3.9082031 10.603516 C 3.1783127 10.367429 2.7043276 9.9520025 2.3398438 9.234375 C 2.1062383 8.7744326 2.0314175 8.4698212 2.0078125 7.8652344 C 1.9910385 7.435598 1.998485 7.3406442 2.0625 7.0898438 C 2.1929047 6.5789418 2.4301684 6.1695361 2.8398438 5.7480469 C 3.2379331 5.3384777 3.6707853 5.1392726 4.3945312 5.0351562 C 4.5619337 5.0110763 4.6769643 4.9996 4.8671875 5 z M 5.5 6 A 1.4988496 2 0 0 0 4 8 A 1.4988496 2 0 0 0 5.5 10 A 1.4988496 2 0 0 0 7 8 A 1.4988496 2 0 0 0 5.5 6 z M 10.5 6 A 1.4988497 2 0 0 0 9 8 A 1.4988497 2 0 0 0 10.5 10 A 1.4988497 2 0 0 0 12 8 A 1.4988497 2 0 0 0 10.5 6 z"/>
 <circle style="fill:currentColor" class="ColorScheme-Highlight" cx="14.5" cy="14.5" r="1.5"/>
</svg>
