<svg xmlns="http://www.w3.org/2000/svg" width="22" height="22" version="1.1">
 <defs>
  <style id="current-color-scheme" type="text/css">
   .ColorScheme-Text { color:#c6c6c6; } .ColorScheme-Highlight { color:#4285f4; } .ColorScheme-NeutralText { color:#ff9800; } .ColorScheme-PositiveText { color:#4caf50; } .ColorScheme-NegativeText { color:#f44336; }
  </style>
 </defs>
 <path style="fill:currentColor" class="ColorScheme-Text" d="M 9.5644531 3.0019531 C 9.5250149 2.9999474 9.4844203 3.0004932 9.4433594 3.0039062 C 9.3338644 3.0130063 9.2214022 3.042169 9.1132812 3.09375 C 7.9525733 3.585289 8.0236389 4.3567908 8.0917969 5.4140625 C 8.1563469 5.6627695 8.103635 6.0214844 8.140625 6.0214844 C 8.140625 6.0214844 8.9742676 5.9468024 9.2128906 5.9433594 C 9.4561506 5.8561604 9.458808 5.8515115 9.421875 5.671875 C 9.404225 5.58602 9.3891819 5.368752 9.3886719 5.1875 C 9.3875719 4.7757345 9.4806715 4.4774068 9.7421875 4.0585938 C 9.9966795 3.651031 10.064453 3.5072455 10.064453 3.3789062 C 10.064453 3.1580646 9.8405204 3.0159932 9.5644531 3.0019531 z M 13.478516 3.1328125 C 13.423306 3.1353725 13.386342 3.1505625 13.375 3.1796875 C 13.36383 3.2083715 13.394993 3.4443607 13.445312 3.7050781 C 13.630085 4.662507 13.517369 5.2784416 13.019531 6.0097656 C 12.917373 6.1598376 12.874798 6.2501139 12.896484 6.2714844 C 12.950154 6.3243714 13.911168 6.8101561 13.970703 6.8144531 C 14.000743 6.8166031 14.076366 6.7613284 14.138672 6.6933594 C 14.406134 6.4015858 14.701379 5.9321148 14.847656 5.5664062 C 15.22891 4.6132297 15.016564 3.8421724 14.248047 3.390625 C 13.971005 3.2278474 13.64414 3.1251484 13.478516 3.1328125 z M 4.8007812 5.0605469 C 3.8820862 5.0703969 3.2276201 5.4284735 3.0488281 6.0390625 C 2.9858581 6.2541161 2.9837619 6.7358015 3.0449219 6.96875 C 3.1850969 7.502682 3.5711079 7.8762168 4.1230469 8.0117188 C 4.3863169 8.0763507 5.0286389 8.0773489 5.3886719 8.0136719 C 5.7933699 7.9420989 6.4345091 7.7232504 6.8300781 7.5234375 C 7.0123311 7.4313765 7.179422 7.344846 7.203125 7.328125 C 7.240475 7.301775 7.4449785 6.8024546 7.4453125 6.7363281 C 7.4453795 6.7231081 7.371583 6.7489129 7.28125 6.7949219 C 7.074991 6.8999879 6.1627526 7.1668854 5.7597656 7.2402344 C 5.3338596 7.3177554 4.795974 7.3165932 4.59375 7.2382812 C 4.388674 7.1588522 4.2944439 7.0257234 4.2949219 6.8164062 C 4.2954719 6.5851219 4.3849956 6.3914632 4.5722656 6.2207031 C 4.8151946 5.9991945 4.9651165 5.9547995 5.5546875 5.9375 C 6.0872385 5.921875 6.4727458 5.9638385 7.0429688 6.0996094 C 7.3749307 6.1786494 7.54893 6.2769192 7.578125 6.4023438 L 7.5976562 6.4863281 L 7.6523438 6.4082031 C 7.7026938 6.3352861 7.999735 6.3168849 7.921875 6.1210938 C 7.876085 6.0059598 7.507662 5.8765934 7.46875 5.8339844 C 7.3826 5.7396504 6.7402863 5.4200611 6.4414062 5.3222656 C 6.0909733 5.2076017 5.6431235 5.1181229 5.2109375 5.078125 C 5.0696095 5.065045 4.9320233 5.0591369 4.8007812 5.0605469 z M 5.6894531 6.3730469 C 5.6106954 6.3726263 5.5232292 6.3740656 5.421875 6.3769531 C 4.766286 6.3956331 4.5350687 6.4831553 4.6367188 6.6757812 C 4.7544227 6.8988308 5.2534892 6.9216851 6.1445312 6.7421875 C 6.6950022 6.6312959 6.8360945 6.586762 6.7890625 6.5390625 C 6.7716325 6.5213875 6.5690348 6.4750254 6.3398438 6.4355469 C 6.0873083 6.3920476 5.9257263 6.3743087 5.6894531 6.3730469 z M 16.333984 6.5058594 C 16.012598 6.5185244 15.684724 6.5570375 15.419922 6.6191406 C 14.9992 6.7178096 14.595958 6.8620524 14.402344 6.984375 L 14.289062 7.0566406 L 14.470703 7.2246094 C 14.570543 7.3168324 14.676178 7.4010644 14.707031 7.4121094 C 14.738491 7.4233744 14.888815 7.3720112 15.048828 7.2929688 C 15.489607 7.0752273 15.897331 6.9788562 16.478516 6.9570312 C 16.913426 6.9406963 16.993454 6.9467268 17.201172 7.0117188 C 17.557766 7.1232948 17.74856 7.3667815 17.697266 7.6484375 C 17.646066 7.9295855 17.438472 8.096266 17.064453 8.15625 C 16.838063 8.19256 16.201905 8.1393653 15.621094 8.0351562 C 15.474131 8.0087862 15.34234 7.9949163 15.328125 8.0039062 C 15.313905 8.0128963 15.337126 8.0832983 15.378906 8.1601562 C 15.728716 8.8033002 17.130614 9.1828414 18.158203 8.9121094 C 18.940981 8.7058754 19.184351 8.248439 18.861328 7.5859375 C 18.594888 7.0394835 18.047781 6.6973376 17.208984 6.5488281 C 16.970271 6.5065631 16.65537 6.4931994 16.333984 6.5058594 z M 16.583984 7.4003906 C 16.091478 7.3842806 15.498104 7.4704785 15.572266 7.546875 C 15.581166 7.556075 15.753025 7.5860784 15.955078 7.6152344 C 16.15713 7.6443894 16.360269 7.6741726 16.40625 7.6816406 C 16.45223 7.6891106 16.675691 7.6985919 16.902344 7.7011719 C 17.272843 7.7054219 17.314483 7.6988714 17.304688 7.6464844 C 17.298687 7.6144294 17.218378 7.548465 17.126953 7.5 C 16.983855 7.424139 16.907856 7.4109811 16.583984 7.4003906 z M 14.966797 7.8730469 C 14.903757 7.8730469 14.880186 7.8935906 14.865234 7.9628906 C 14.816064 8.1907911 14.731028 8.3594233 14.603516 8.4824219 C 14.28831 8.7864689 13.811619 8.7687702 13.148438 8.4257812 L 12.824219 8.2578125 L 12.609375 8.4882812 C 12.157159 8.9727293 11.539305 9.1348072 11.064453 8.8945312 C 10.904603 8.8136512 10.777382 8.6125396 10.730469 8.3671875 C 10.712069 8.2709255 10.697266 8.188229 10.697266 8.1816406 C 10.697266 8.1397406 10.601585 8.183514 10.515625 8.265625 C 10.229598 8.5388705 9.7267894 8.7405894 9.3339844 8.7402344 C 8.9470964 8.7398844 8.7531884 8.6159275 8.6152344 8.2832031 C 8.5815844 8.2020491 8.5420869 8.1367868 8.5292969 8.1367188 C 8.5165069 8.1366527 8.4388927 8.1824387 8.3554688 8.2382812 C 7.9438807 8.5137902 7.3776294 8.5445964 7.1621094 8.3046875 C 7.0356234 8.1638871 6.9756934 8.2293907 6.9746094 8.5097656 C 6.9735094 8.7949546 6.9153824 9.1062187 6.7089844 9.9492188 C 6.6002614 10.393286 6.436939 11.118433 6.34375 11.5625 C 6.25056 12.006567 6.0707555 12.800543 5.9453125 13.326172 C 5.5673515 14.909897 5.496353 15.356009 5.5 16.111328 C 5.5042 16.986591 5.645989 17.373272 6.140625 17.859375 C 6.389962 18.104411 6.4763138 18.165585 6.8085938 18.328125 C 7.2418537 18.540062 7.5976691 18.650465 8.2207031 18.763672 C 9.4803471 18.992552 12.102723 19.079592 12.849609 18.917969 C 13.262663 18.828589 13.550938 18.732295 13.865234 18.578125 C 14.676296 18.180278 15.128802 17.658828 15.365234 16.849609 C 15.453134 16.548765 15.516362 15.978103 15.494141 15.699219 C 15.486941 15.608589 15.464952 15.326019 15.445312 15.072266 C 15.425672 14.818514 15.359439 14.099928 15.296875 13.474609 C 15.119465 11.701545 15.044841 10.665236 14.982422 9.1074219 C 14.966442 8.7086669 14.944031 8.3254944 14.931641 8.2558594 C 14.913721 8.1552329 14.922566 8.1102658 14.978516 8.0351562 C 15.070356 7.9119493 15.067707 7.8730469 14.966797 7.8730469 z M 12.160156 9.703125 C 12.51858 9.701125 12.7796 9.8988644 12.939453 10.291016 C 12.993303 10.423133 13.010469 10.535788 13.011719 10.806641 C 13.013219 11.133438 13.005742 11.16606 12.902344 11.373047 C 12.77585 11.626262 12.5338 11.86208 12.277344 11.980469 C 12.089588 12.067139 11.957141 12.075509 11.808594 12.011719 C 11.660437 11.948099 11.501485 11.752379 11.4375 11.554688 C 11.3526 11.292369 11.336022 10.733319 11.40625 10.472656 C 11.43766 10.356078 11.478484 10.201408 11.496094 10.128906 C 11.559544 9.8677161 11.815049 9.705075 12.160156 9.703125 z M 9.6992188 9.7675781 C 9.7352376 9.7673612 9.771489 9.770484 9.8085938 9.7773438 C 9.9941728 9.8116537 10.32033 10.149526 10.417969 10.40625 C 10.581414 10.836 10.455046 11.365976 10.097656 11.744141 C 9.8607623 11.994804 9.673357 12.055827 9.46875 11.951172 C 9.303695 11.866752 9.1953093 11.745449 9.0976562 11.53125 C 8.9521883 11.212169 8.9679581 10.769205 9.1425781 10.212891 C 9.2281881 9.9401468 9.447087 9.7690965 9.6992188 9.7675781 z M 12.013672 10.115234 C 11.931142 10.110834 11.856365 10.12461 11.8125 10.15625 C 11.700365 10.23705 11.60832 10.842301 11.689453 10.96875 C 11.715843 11.00987 11.735713 11.004041 11.814453 10.931641 C 11.948847 10.808058 12.047532 10.766022 12.205078 10.763672 C 12.387853 10.760972 12.533413 10.839839 12.611328 10.982422 C 12.678578 11.105485 12.728516 11.109727 12.728516 10.994141 C 12.728516 10.710787 12.489468 10.294189 12.261719 10.179688 C 12.186209 10.141728 12.096198 10.119634 12.013672 10.115234 z M 9.515625 10.191406 C 9.403478 10.191406 9.35742 10.299082 9.328125 10.640625 C 9.299365 10.975933 9.3121114 10.993146 9.5058594 10.896484 C 9.5930294 10.852994 9.7102111 10.816406 9.7675781 10.816406 C 9.8249481 10.816406 9.9303472 10.846833 10.001953 10.882812 C 10.073553 10.918793 10.138424 10.941534 10.146484 10.933594 C 10.182524 10.898074 10.110371 10.680966 10.013672 10.537109 C 9.894341 10.359566 9.651742 10.191406 9.515625 10.191406 z M 11.435547 15.5 L 11.677734 15.515625 C 12.200572 15.546995 12.400934 15.806597 12.242188 16.25 C 12.09086 16.672683 11.624641 17.045103 11.308594 16.996094 C 11.092595 16.962594 10.949014 16.600314 10.996094 16.212891 C 11.025054 15.974516 11.067627 15.890371 11.273438 15.671875 L 11.435547 15.5 z M 8.609375 15.792969 C 8.645785 15.786969 8.675202 15.79447 8.71875 15.8125 C 8.7719 15.83452 8.8502563 15.90672 8.8945312 15.972656 C 9.0707163 16.235025 9.0193585 16.620451 8.7734375 16.876953 C 8.6463465 17.009515 8.6266805 17.01832 8.4453125 17.03125 C 8.2545175 17.04485 8.249485 17.044556 8.125 16.921875 C 8.00633 16.804928 7.999711 16.786685 8 16.615234 C 8.000221 16.48682 8.022995 16.384275 8.078125 16.267578 C 8.189616 16.031564 8.261837 15.952508 8.453125 15.857422 C 8.529075 15.819672 8.57296 15.798979 8.609375 15.792969 z M 11.349609 15.984375 L 11.337891 16.107422 C 11.331391 16.175222 11.342814 16.291566 11.365234 16.365234 C 11.432604 16.586955 11.625083 16.600348 11.839844 16.398438 C 12.058718 16.192666 11.91406 15.985425 11.548828 15.984375 L 11.349609 15.984375 z M 19 16 A 2 2 0 0 0 17 18 A 2 2 0 0 0 19 20 A 2 2 0 0 0 21 18 A 2 2 0 0 0 19 16 z M 8.4335938 16.175781 C 8.4117037 16.182681 8.3659343 16.239538 8.3320312 16.300781 C 8.2800413 16.394701 8.2765138 16.424786 8.3085938 16.494141 C 8.3295038 16.539371 8.3928737 16.595006 8.4492188 16.619141 C 8.5766907 16.673741 8.6066619 16.675836 8.6542969 16.628906 C 8.7320469 16.552286 8.7003944 16.386206 8.5839844 16.271484 C 8.5235144 16.211884 8.4554838 16.168858 8.4335938 16.175781 z"/>
</svg>
