<svg xmlns="http://www.w3.org/2000/svg" width="22" height="22" version="1.1">
 <defs>
  <style id="current-color-scheme" type="text/css">
   .ColorScheme-Text { color:#e4e4e4; } .ColorScheme-Highlight { color:#4285f4; } .ColorScheme-NeutralText { color:#ff9800; } .ColorScheme-PositiveText { color:#4caf50; } .ColorScheme-NegativeText { color:#f44336; }
  </style>
 </defs>
 <path style="fill:currentColor" class="ColorScheme-Text" d="m 9.9257812,3.0027144 c -0.1248493,0.00976 -0.246754,0.039844 -0.359375,0.094609 C 9.2204118,3.2638354 9.0002998,3.6137377 9,3.9977144 V 8.0641202 L 6.6132812,6.2086519 C 6.1773939,5.8703108 5.5498304,5.9489748 5.2109375,6.3844332 4.8725964,6.8203205 4.9512604,7.4478842 5.3867188,7.7867772 L 9,10.597324 v 0.800781 l -3.6132812,2.810547 c -0.435458,0.338893 -0.5141219,0.966456 -0.1757813,1.402343 0.338893,0.435458 0.9664565,0.514122 1.4023437,0.175781 L 9,13.931308 v 4.066406 c -3.499e-4,0.838869 0.970049,1.305407 1.625,0.78125 l 5,-4 c 0.504555,-0.404192 0.498813,-1.173695 -0.01172,-1.570312 l -2.841796,-2.210938 2.841797,-2.2109368 c 0.510532,-0.396617 0.516275,-1.166121 0.01172,-1.570313 l -5,-3.9999998 C 10.427702,3.0584274 10.177877,2.9840146 9.9257812,3.0027144 Z M 11,6.0797456 13.384766,7.9879492 11.142578,9.7320892 11,9.6207612 Z M 5,10.000112 c -0.5522847,0 -1,0.447715 -1,1 0,0.552285 0.4477153,1 1,1 0.5522847,0 1,-0.447715 1,-1 0,-0.552285 -0.4477153,-1 -1,-1 z m 12,0 c -0.552285,0 -1,0.447715 -1,1 0,0.552285 0.447715,1 1,1 0.552285,0 1,-0.447715 1,-1 0,-0.552285 -0.447715,-1 -1,-1 z M 11.142578,12.263339 13.384766,14.00748 11,15.915683 v -3.541016 z"/>
</svg>
