<svg xmlns="http://www.w3.org/2000/svg" width="22" height="22" version="1.1">
 <defs>
  <style id="current-color-scheme" type="text/css">
   .ColorScheme-Text { color:#a0a0a0; } .ColorScheme-Highlight { color:#4285f4; } .ColorScheme-NeutralText { color:#ff9800; } .ColorScheme-PositiveText { color:#4caf50; } .ColorScheme-NegativeText { color:#f44336; }
  </style>
 </defs>
 <path style="fill:currentColor" class="ColorScheme-Text" d="M 5.4091119,6 C 4.63472,6 3.9013896,6.6439431 4.0109025,7.427734 L 5.00915,14.572266 C 5.1186626,15.356057 5.6329674,16 6.4073594,16 h 3.5941976 5.591082 c 0.774393,0 1.288698,-0.643943 1.398211,-1.427734 L 17.989097,7.427734 C 18.09861,6.6439431 17.365279,6 16.590887,6 h -6.58933 z"/>
</svg>
