<svg xmlns="http://www.w3.org/2000/svg" width="22" height="22" version="1.1">
 <defs>
  <style id="current-color-scheme" type="text/css">
   .ColorScheme-Text { color:#c6c6c6; } .ColorScheme-Highlight { color:#4285f4; } .ColorScheme-NeutralText { color:#ff9800; } .ColorScheme-PositiveText { color:#4caf50; } .ColorScheme-NegativeText { color:#f44336; }
  </style>
 </defs>
 <path style="fill:currentColor" class="ColorScheme-Text" d="M 17.333984,3 C 17.333984,3 18,3.0005578 18,3.7148437 V 12.285156 C 18,12.999442 17.333984,13 17.333984,13 H 16 V 11 6.7148438 5 h -1.666016 -0.919921 -2.613282 l 1.865235,-2 z m -3,3 C 14.333984,6 15,6.0005579 15,6.7148438 V 15.285156 C 15,15.999442 14.333984,16 14.333984,16 H 13 V 14 9.714844 8 H 11.333984 10.414063 7.800781 L 9.6660156,6 Z m -3,3 C 11.333984,9 12,9.000558 12,9.714844 v 8.570312 C 12,18.999442 11.333984,19 11.333984,19 H 4.666016 C 3.999349,19 4,18.285156 4,18.285156 V 11.857422 L 6.666016,9 Z M 10,11 H 7.414062 L 6,12.697266 V 17 h 4 z"/>
</svg>
