<svg xmlns="http://www.w3.org/2000/svg" width="24" height="24" version="1.1">
 <defs>
  <style id="current-color-scheme" type="text/css">
   .ColorScheme-Text { color:#c6c6c6; } .ColorScheme-Highlight { color:#4285f4; } .ColorScheme-NeutralText { color:#ff9800; } .ColorScheme-PositiveText { color:#4caf50; } .ColorScheme-NegativeText { color:#f44336; }
  </style>
 </defs>
 <path style="fill:currentColor" class="ColorScheme-Text" d="M 13.363281,4.0000538 A 0.99995354,0.99995354 0 0 0 12.542969,4.4863819 L 10.638672,7.66021 5.4414062,5.1035694 A 0.99995354,0.99995354 0 0 0 4.0214844,6.2012257 L 4.9882812,10.900444 A 0.99995354,0.99995354 0 0 0 5,11.027397 v 3.146484 a 3,3 0 0 1 1,-0.173828 3,3 0 0 1 1,0.175781 V 12.3731 l 4,1.693359 v 3.375 L 8.9589844,16.513725 A 3,3 0 0 1 9,17.000053 3,3 0 0 1 8.5742188,18.535209 l 2.8906252,1.316406 a 0.99995354,0.99995354 0 0 0 0.707031,0.128907 0.99995354,0.99995354 0 0 0 0.08594,-0.01758 l 0.01172,-0.0039 5.988281,-1.595703 A 0.99995354,0.99995354 0 0 0 19,17.396537 v -5.283203 l 1.910156,-4.1992177 a 0.99995354,0.99995354 0 0 0 -0.55664,-1.3496094 l -6.59961,-2.5 A 0.99995354,0.99995354 0 0 0 13.363281,4.0000538 Z M 13.828125,6.2305226 18.648438,8.0566944 17.490234,10.603569 12.6875,8.6152884 A 0.99995354,0.99995354 0 0 0 12.482422,8.4707574 Z M 6.3886719,7.7969288 8.9960938,9.0801324 6.7675781,9.6406784 Z m 6.0781251,2.8925772 2.355469,0.974609 -2.050782,0.515626 z m -2.023438,0.08984 0.195313,0.962892 -1.5000001,-0.634766 z M 17,13.179741 v 3.449218 l -4,1.064453 v -3.509765 z"/>
 <circle style="fill:currentColor" class="ColorScheme-Highlight" cx="6" cy="17" r="2"/>
</svg>
