<svg xmlns="http://www.w3.org/2000/svg" width="16" height="16" version="1.1">
 <defs>
  <style id="current-color-scheme" type="text/css">
   .ColorScheme-Text { color:#a0a0a0; } .ColorScheme-Highlight { color:#4285f4; } .ColorScheme-NeutralText { color:#ff9800; } .ColorScheme-PositiveText { color:#4caf50; } .ColorScheme-NegativeText { color:#f44336; }
  </style>
 </defs>
 <path style="fill:none;stroke:currentColor;stroke-width:2;stroke-linecap:round;stroke-linejoin:bevel" class="ColorScheme-Text" d="m 2.0141,11.992274 c 0,0 4.013654,0.350449 4,-3.9999981 -0.0142,-4.5253938 -4,-4.0000022 -4,-4.0000022 M 2,11.98586 V 3.9858636"/>
 <path style="fill:none;stroke:currentColor;stroke-width:2;stroke-linecap:round;stroke-linejoin:round" class="ColorScheme-Text" d="m 10,3.9999994 h 3.999999 L 10,12.000001 h 3.999999 v 0"/>
</svg>
