<svg xmlns="http://www.w3.org/2000/svg" width="16" height="16" version="1.1">
 <defs>
  <style id="current-color-scheme" type="text/css">
   .ColorScheme-Text { color:#c6c6c6; } .ColorScheme-Highlight { color:#4285f4; } .ColorScheme-NeutralText { color:#ff9800; } .ColorScheme-PositiveText { color:#4caf50; } .ColorScheme-NegativeText { color:#f44336; }
  </style>
 </defs>
 <path style="fill:currentColor" class="ColorScheme-Text" d="M 5.8867188,4 C 5.7223726,4.0005692 5.5849296,4.0410617 5.4472656,4.1171875 5.2842638,4.2073885 4.6806218,4.7729404 4.1035156,5.3730469 3.2264061,6.284857 2.968461,6.4969199 2.5351562,6.6699219 1.8532189,6.9430649 1.2786457,7.0086485 0.80664062,6.8671875 0.16592372,6.6751455 -0.17976988,7.0351928 0.09570312,7.6054688 0.35836592,8.1492147 1.4076131,8.642197 2.7988281,8.875 4.7303489,9.198213 6.0094724,8.8979515 7.3671875,7.8046875 7.6274393,7.5951155 7.9171646,7.4238281 8.0097656,7.4238281 c 0.092601,0 0.4082878,0.1939945 0.7011719,0.4296875 0.6956175,0.559776 1.0346672,0.7376668 1.8593745,0.9804688 0.586917,0.172802 0.813393,0.192245 1.638672,0.140625 1.735219,-0.108561 2.896507,-0.4748049 3.507813,-1.1074219 C 15.922799,7.6541845 16,7.4905344 16,7.2695312 16,6.8255263 15.760443,6.7140918 15.148438,6.8710938 c -0.371005,0.096 -0.577168,0.097672 -0.951172,0.013672 -0.91501,-0.205002 -1.328521,-0.4879005 -2.394532,-1.6328125 -0.829009,-0.8891095 -1.171088,-1.2333999 -1.621093,-1.25 -0.2710033,-0.01 -0.580589,0.097942 -1.0585941,0.2773438 C 8.6160414,4.469699 8.0948452,4.6250005 7.9648438,4.625 7.8338424,4.6249005 7.4332695,4.5009578 7.0722656,4.3476562 6.5107593,4.1087787 6.1606289,3.9990513 5.8867188,4 Z M 7.5,10 c -0.3156024,2.58e-4 -0.5521312,0.245268 -0.4902344,0.507812 l 0.5,2.123047 c 0.1093404,0.452353 0.8711284,0.452353 0.9804688,0 l 0.5,-2.123047 C 9.0521312,10.245268 8.8156024,10.000258 8.5,10 Z"/>
</svg>
