<svg xmlns="http://www.w3.org/2000/svg" width="16" height="16" version="1.1">
 <defs>
  <style id="current-color-scheme" type="text/css">
   .ColorScheme-Text { color:#e4e4e4; } .ColorScheme-Highlight { color:#4285f4; } .ColorScheme-NeutralText { color:#ff9800; } .ColorScheme-PositiveText { color:#4caf50; } .ColorScheme-NegativeText { color:#f44336; }
  </style>
 </defs>
 <path style="fill:currentColor;opacity:.35" class="ColorScheme-Text" d="m 1.8003905,1.9999999 c -0.4432,0 -0.800781,0.357581 -0.800781,0.8007811 v 9.398438 c 0,0.4432 0.357581,0.800781 0.800781,0.800781 h 3.199219 v 0.199219 c 0,0.4432 0.357581,0.800781 0.800781,0.800781 h 4.3992185 c 0.443201,0 0.800782,-0.357581 0.800782,-0.800781 V 13 h 3.199218 c 0.443201,0 0.800782,-0.357581 0.800782,-0.800781 V 2.800781 c 0,-0.4431999 -0.357581,-0.8007811 -0.800782,-0.8007811 z M 2.9996095,4 H 13.000391 v 7 H 2.9996095 Z"/>
</svg>
