<svg xmlns="http://www.w3.org/2000/svg" width="24" height="24" version="1.1">
 <defs>
  <style id="current-color-scheme" type="text/css">
   .ColorScheme-Text { color:#c6c6c6; } .ColorScheme-Highlight { color:#4285f4; } .ColorScheme-NeutralText { color:#ff9800; } .ColorScheme-PositiveText { color:#4caf50; } .ColorScheme-NegativeText { color:#f44336; }
  </style>
 </defs>
 <path style="fill:currentColor" class="ColorScheme-Text" d="m 10.564154,4.0019531 c -0.03944,-0.00201 -0.08003,-0.00146 -0.121093,0.00195 -0.109495,0.0091 -0.221957,0.038263 -0.330078,0.089844 -1.1607083,0.491539 -1.0896427,1.2630408 -1.0214847,2.3203125 0.06455,0.248707 0.011838,0.6074219 0.048828,0.6074219 0,0 0.8336426,-0.074682 1.0722657,-0.078125 0.24326,-0.087196 0.245917,-0.091845 0.208984,-0.2714815 -0.01765,-0.085855 -0.03269,-0.303123 -0.0332,-0.484375 -0.0011,-0.4117655 0.092,-0.7100932 0.353516,-1.1289062 0.254492,-0.4075628 0.322265,-0.5513483 0.322265,-0.6796876 0,-0.2208416 -0.223932,-0.362913 -0.5,-0.3769531 z m 3.914063,0.1308594 c -0.05521,0.00256 -0.09217,0.01775 -0.103516,0.046875 -0.01117,0.028684 0.01999,0.2646732 0.07031,0.5253906 0.184773,0.9574289 0.07206,1.5733635 -0.425781,2.3046875 -0.102158,0.150072 -0.144733,0.2403483 -0.123047,0.2617188 0.05367,0.052887 1.014684,0.5386717 1.074219,0.5429687 0.03004,0.00215 0.105663,-0.053125 0.167969,-0.1210937 C 15.405835,7.4015858 15.70108,6.9321148 15.847357,6.5664062 16.228611,5.6132297 16.016265,4.8421724 15.247748,4.390625 14.970706,4.2278474 14.643841,4.1251484 14.478217,4.1328125 Z M 5.8004826,6.0605469 c -0.918695,0.00985 -1.5731611,0.3679266 -1.7519531,0.9785156 -0.06297,0.2150536 -0.065066,0.696739 -0.00391,0.9296875 0.140175,0.533932 0.526186,0.9074668 1.078125,1.042969 0.26327,0.06463 0.905592,0.06563 1.265625,0.002 0.4047018,-0.07157 1.045841,-0.2904186 1.44141,-0.4902315 0.182253,-0.092111 0.3493439,-0.1786415 0.3730469,-0.1953625 0.03735,-0.02635 0.2418535,-0.5256704 0.2421875,-0.5917969 6.7e-5,-0.01322 -0.073729,0.012585 -0.1640625,0.058594 C 8.0746924,7.8999879 7.162454,8.1668854 6.759467,8.2402344 6.333561,8.3177554 5.7956754,8.3165932 5.5934514,8.2382812 5.3883754,8.1588522 5.2941453,8.0257234 5.2946233,7.8164062 5.2951733,7.5851219 5.384697,7.3914632 5.571967,7.2207031 5.814896,6.9991945 5.9648179,6.9547995 6.5543889,6.9375 c 0.532551,-0.015625 0.9180583,0.026338 1.4882813,0.1621094 0.3319619,0.07904 0.5059612,0.1773098 0.5351562,0.3027344 l 0.019531,0.083984 0.054688,-0.078125 c 0.05035,-0.072917 0.347391,-0.091318 0.269531,-0.287109 C 8.8757864,7.0059598 8.5073634,6.8765934 8.4684514,6.8339844 8.3823014,6.7396504 7.7399877,6.4200611 7.4411076,6.3222656 7.0906747,6.2076017 6.6428249,6.1181229 6.2106389,6.078125 6.0693109,6.065045 5.9317247,6.0591369 5.8004826,6.0605469 Z m 0.8886719,1.3125 C 6.6103965,7.3726263 6.5229306,7.3740669 6.4215764,7.3769569 5.7659874,7.3956369 5.5347701,7.4831591 5.6364202,7.675785 5.7541241,7.8988346 6.2531906,7.9216889 7.1442326,7.742191 7.6947036,7.6312959 7.8357959,7.586762 7.7887639,7.5390625 7.7713339,7.5213875 7.5687362,7.4750254 7.3395452,7.4355469 7.0870097,7.3920476 6.9254277,7.3743087 6.6891545,7.3730469 Z M 17.333685,7.5058594 c -0.321386,0.012665 -0.64926,0.051178 -0.914062,0.1132812 -0.420722,0.098669 -0.823964,0.2429118 -1.017578,0.3652344 l -0.113282,0.072266 0.181641,0.1679688 c 0.09984,0.092223 0.205475,0.176455 0.236328,0.1875 0.03146,0.011265 0.181784,-0.040098 0.341797,-0.1191406 0.440779,-0.2177415 0.848503,-0.3141126 1.429688,-0.3359376 0.43491,-0.016335 0.514938,-0.010304 0.722656,0.054688 0.356594,0.111576 0.547388,0.3550627 0.496094,0.6367187 -0.0512,0.281148 -0.258794,0.4478287 -0.632813,0.5078127 -0.22639,0.03631 -0.862548,-0.01688 -1.443359,-0.121094 -0.146963,-0.02637 -0.278754,-0.04024 -0.292969,-0.03125 -0.01422,0.009 0.009,0.07939 0.05078,0.15625 0.34981,0.643144 1.751708,1.022685 2.779297,0.751953 0.782778,-0.206234 1.026148,-0.66367 0.703125,-1.3261717 -0.26644,-0.546454 -0.813547,-0.8885999 -1.652344,-1.0371094 -0.238713,-0.042265 -0.553614,-0.055629 -0.875,-0.042969 z m 0.25,0.8945312 c -0.492506,-0.01611 -1.08588,0.070088 -1.011718,0.1464844 0.0089,0.0092 0.180759,0.039203 0.382812,0.068359 0.202052,0.029155 0.405191,0.058938 0.451172,0.066406 0.04598,0.00747 0.269441,0.016951 0.496094,0.019531 0.370499,0.00425 0.412139,-0.0023 0.402344,-0.054687 C 18.298388,8.6144294 18.218079,8.548465 18.126654,8.5 17.983556,8.424139 17.907557,8.4109811 17.583685,8.4003906 Z m -1.617187,0.4726563 c -0.06304,0 -0.08661,0.020544 -0.101563,0.089844 C 15.815765,9.190791 15.730729,9.359424 15.603217,9.482422 15.288011,9.786469 14.81132,9.768771 14.148139,9.425782 L 13.82392,9.257814 13.609076,9.488282 c -0.452216,0.484448 -1.07007,0.646526 -1.544922,0.40625 -0.15985,-0.08088 -0.287071,-0.281991 -0.333984,-0.527343 -0.0184,-0.09626 -0.0332,-0.178959 -0.0332,-0.185547 0,-0.0419 -0.09568,0.0019 -0.181641,0.08398 -0.286027,0.273245 -0.788835,0.474964 -1.18164,0.474609 C 9.9468008,9.739881 9.7528928,9.615924 9.6149388,9.2832 9.5812888,9.20205 9.5417908,9.136783 9.5290018,9.136715 c -0.01279,-6.6e-5 -0.090404,0.04572 -0.1738281,0.101563 -0.4115881,0.275509 -0.9778394,0.306315 -1.1933594,0.06641 -0.126486,-0.140801 -0.186416,-0.0753 -0.1875,0.205078 -0.0011,0.285189 -0.059227,0.596453 -0.265625,1.439453 -0.1087265,0.444067 -0.2720489,1.169214 -0.3652379,1.613281 -0.09319,0.444067 -0.2729945,1.238043 -0.3984375,1.763672 -0.377961,1.583725 -0.4489595,2.029837 -0.4453125,2.785156 0.0042,0.875263 0.145989,1.261944 0.640625,1.748047 0.249337,0.245036 0.3356888,0.30621 0.6679688,0.46875 0.4332599,0.211937 0.7890753,0.32234 1.4121093,0.435547 1.2596435,0.22888 3.8820195,0.31592 4.6289055,0.154297 0.413054,-0.08938 0.701329,-0.185674 1.015625,-0.339844 0.811062,-0.397847 1.263568,-0.919297 1.5,-1.728516 0.0879,-0.300844 0.151128,-0.871506 0.128907,-1.15039 -0.0072,-0.09063 -0.02919,-0.3732 -0.04883,-0.626953 -0.01964,-0.253752 -0.08587,-0.972338 -0.148437,-1.597657 -0.17741,-1.773064 -0.252034,-2.809373 -0.314453,-4.367187 -0.01598,-0.398755 -0.03839,-0.781928 -0.05078,-0.851563 -0.01792,-0.100626 -0.0091,-0.145593 0.04687,-0.220703 0.09184,-0.1232067 0.08919,-0.1621091 -0.01172,-0.1621091 z m -2.806641,1.8300781 c 0.358424,-0.002 0.619444,0.195739 0.779297,0.587891 0.05385,0.132117 0.07102,0.244772 0.07227,0.515625 0.0015,0.326797 -0.006,0.359419 -0.109375,0.566406 -0.126494,0.253215 -0.368544,0.489033 -0.625,0.607422 -0.187756,0.08667 -0.320203,0.09504 -0.46875,0.03125 -0.148157,-0.06362 -0.307109,-0.25934 -0.371094,-0.457031 -0.0849,-0.262319 -0.101478,-0.821369 -0.03125,-1.082032 0.03141,-0.116578 0.07223,-0.271248 0.08984,-0.34375 0.06345,-0.26119 0.318955,-0.423831 0.664062,-0.425781 z m -2.460937,0.06445 c 0.03602,-2.17e-4 0.07227,0.0029 0.109375,0.0098 0.185579,0.03431 0.511736,0.372182 0.609375,0.628906 0.163445,0.42975 0.03708,0.959726 -0.320313,1.337891 -0.236893,0.250632 -0.424299,0.311655 -0.628906,0.207 -0.165055,-0.08442 -0.27344,-0.205723 -0.371093,-0.419922 -0.1454683,-0.319081 -0.1296985,-0.762045 0.04492,-1.318359 0.08561,-0.272744 0.304509,-0.443794 0.556641,-0.445313 z m 2.314453,0.347656 c -0.08253,-0.0044 -0.157307,0.0094 -0.201172,0.04102 -0.112135,0.0808 -0.20418,0.686051 -0.123047,0.8125 0.02639,0.04112 0.04626,0.03529 0.125,-0.03711 0.134394,-0.123583 0.233079,-0.165619 0.390625,-0.167969 0.182775,-0.0027 0.328335,0.07617 0.40625,0.21875 0.06725,0.123063 0.117188,0.127305 0.117188,0.01172 0,-0.283354 -0.239048,-0.699952 -0.466797,-0.814453 -0.07551,-0.03796 -0.165521,-0.06005 -0.248047,-0.06445 z m -2.498047,0.07617 c -0.112147,0 -0.158205,0.107676 -0.1875,0.449219 -0.02876,0.335308 -0.01601,0.352521 0.177735,0.255859 0.08717,-0.04349 0.204351,-0.08008 0.261718,-0.08008 0.05737,0 0.16277,0.03043 0.234375,0.06641 0.0716,0.03598 0.136471,0.05872 0.144531,0.05078 0.03604,-0.03552 -0.03611,-0.252628 -0.132812,-0.396485 -0.119331,-0.177538 -0.36193,-0.345698 -0.498047,-0.345698 z M 12.435248,16.5 l 0.242187,0.01563 c 0.522838,0.03137 0.7232,0.290972 0.564454,0.734375 -0.151328,0.422683 -0.617547,0.795103 -0.933594,0.746094 -0.215999,-0.0335 -0.35958,-0.39578 -0.3125,-0.783203 0.02896,-0.238375 0.07153,-0.32252 0.277344,-0.541016 z m -2.8261716,0.292969 c 0.03641,-0.006 0.065827,0.0015 0.109375,0.01953 0.05315,0.02202 0.1315063,0.09422 0.1757812,0.160156 0.1761854,0.262369 0.1248274,0.647795 -0.1210937,0.904297 -0.127091,0.132562 -0.146757,0.141367 -0.328125,0.154297 -0.190795,0.0136 -0.1958275,0.01331 -0.3203125,-0.109374 -0.11867,-0.116947 -0.125289,-0.13519 -0.125,-0.306641 2.21e-4,-0.128414 0.022995,-0.230959 0.078125,-0.347656 0.111491,-0.236014 0.183712,-0.31507 0.375,-0.410156 0.07595,-0.03775 0.119835,-0.05844 0.15625,-0.06445 z m 2.7402336,0.191406 -0.01172,0.123047 c -0.0065,0.0678 0.0049,0.184144 0.02734,0.257812 0.06737,0.221721 0.259849,0.235114 0.47461,0.0332 0.218874,-0.205772 0.07422,-0.413013 -0.291016,-0.414063 z M 19.999701,17 a 2,2 0 0 0 -2,2 2,2 0 0 0 2,2 2,2 0 0 0 2,-2 2,2 0 0 0 -2,-2 z M 9.4332952,17.175781 c -0.02189,0.0069 -0.06766,0.06376 -0.1015626,0.125 -0.05199,0.09392 -0.055517,0.124005 -0.023437,0.19336 0.02091,0.04523 0.08428,0.100865 0.140625,0.125 0.1274719,0.0546 0.1574431,0.0567 0.2050781,0.0098 0.07775,-0.07662 0.046098,-0.2427 -0.070312,-0.357422 -0.06047,-0.0596 -0.1285006,-0.102626 -0.1503906,-0.0957 z"/>
</svg>
