<svg xmlns="http://www.w3.org/2000/svg" width="24" height="24" version="1.1">
 <defs>
  <style id="current-color-scheme" type="text/css">
   .ColorScheme-Text { color:#a0a0a0; } .ColorScheme-Highlight { color:#4285f4; } .ColorScheme-NeutralText { color:#ff9800; } .ColorScheme-PositiveText { color:#4caf50; } .ColorScheme-NegativeText { color:#f44336; }
  </style>
 </defs>
 <path style="fill:currentColor;opacity:0.35" class="ColorScheme-Text" d="M 4.2851562,5 C 3.5728704,5 3,5.6228376 3,6.3984375 V 17.601562 C 3,18.377163 3.5728704,19 4.2851562,19 H 19.714844 C 20.42713,19 21,18.377163 21,17.601562 V 6.3984375 C 21,5.6228375 20.42713,5 19.714844,5 Z M 9,8 c 2.209067,0 4,1.790933 4,4 0,2.209066 -1.790933,4 -4,4 C 6.790933,16 5,14.209066 5,12 5,9.790933 6.790933,8.0000001 9,8 Z m 5,0 h 5 v 1 h -5 z m -5,2 a 2,2 0 0 0 -2,2 2,2 0 0 0 2,2 2,2 0 0 0 2,-2 2,2 0 0 0 -2,-2 z m 5,0 h 5 v 1 h -5 z m 0,2 h 5 v 1 h -5 z m 1,2 a 1,1 0 0 1 1,1 1,1 0 0 1 -1,1 1,1 0 0 1 -1,-1 1,1 0 0 1 1,-1 z m 3,0 a 1,1 0 0 1 1,1 1,1 0 0 1 -1,1 1,1 0 0 1 -1,-1 1,1 0 0 1 1,-1 z"/>
</svg>
