<svg xmlns="http://www.w3.org/2000/svg" width="24" height="24" version="1.1">
 <defs>
  <style id="current-color-scheme" type="text/css">
   .ColorScheme-Text { color:#c6c6c6; } .ColorScheme-Highlight { color:#4285f4; } .ColorScheme-NeutralText { color:#ff9800; } .ColorScheme-PositiveText { color:#4caf50; } .ColorScheme-NegativeText { color:#f44336; }
  </style>
 </defs>
 <path style="fill:currentColor" class="ColorScheme-Text" d="m 18.00048,4.0002311 c -1.104569,0 -2,0.8954305 -2,2 9.2e-4,0.2672118 0.05538,0.5315299 0.160156,0.7773438 0.01604,0.057736 0.02818,0.124959 0.04687,0.1738281 0.418397,1.6126072 -0.008,2.8737054 -0.960026,4.021484 -1.333266,1.343031 -3.248976,1.366728 -4.573176,0.05469 L 6.6313403,4.6349967 C 6.2214533,4.1927468 5.6512847,4.0341163 5.1293871,4.0314811 4.0073923,4.0129121 3.2299462,4.908506 3.0454027,5.8693717 2.9090916,6.6383157 2.8467816,6.5050496 6.471184,13.090075 c 2.287717,4.156434 3.374426,6.073393 3.552735,6.261718 0.631557,0.667205 1.533031,0.831906 2.375,0.435547 0.221377,-0.104224 0.470776,-0.291775 0.630858,-0.472656 0.313564,-0.354299 6.697523,-12.0903834 6.802734,-12.4941404 0.125372,-0.2685977 0.15201,-0.5524121 0.167969,-0.8203125 0,-1.1045695 -0.895431,-2 -2,-2 z"/>
</svg>
