<svg xmlns="http://www.w3.org/2000/svg" width="24" height="24" version="1.1">
 <defs>
  <style id="current-color-scheme" type="text/css">
   .ColorScheme-Text { color:#c6c6c6; } .ColorScheme-Highlight { color:#4285f4; } .ColorScheme-NeutralText { color:#ff9800; } .ColorScheme-PositiveText { color:#4caf50; } .ColorScheme-NegativeText { color:#f44336; }
  </style>
 </defs>
 <g transform="translate(4,4)">
  <path style="fill:currentColor" class="ColorScheme-Text" d="M 1,2 V 15 H 3 V 2 Z M 4,2 V 8 H 5 V 2 Z M 6,2 V 15 H 7 V 2 Z M 8,2 V 15 H 9 V 2 Z M 10,2 V 9 H 11 V 2 Z M 12,2 V 15 H 15 V 2 Z"/>
 </g>
</svg>
