<svg xmlns="http://www.w3.org/2000/svg" width="22" height="22" version="1.1">
 <defs>
  <style id="current-color-scheme" type="text/css">
   .ColorScheme-Text { color:#e4e4e4; } .ColorScheme-Highlight { color:#4285f4; } .ColorScheme-NeutralText { color:#ff9800; } .ColorScheme-PositiveText { color:#4caf50; } .ColorScheme-NegativeText { color:#f44336; }
  </style>
 </defs>
 <path style="fill:currentColor" class="ColorScheme-Text" d="m 31.973689,-21.033178 c -4.4183,0 -8,3.5817 -8,8 0,4.4179998 3.5817,7.9999998 8,7.9999998 4.418,0 8,-3.582 8,-7.9999998 0,-4.4183 -3.582,-8 -8,-8 z m -1,3 h 2 v 5 h 3 l -4,4.9999998 -4,-4.9999998 h 3 z"/>
 <path style="fill:currentColor" class="ColorScheme-Text" d="M 6.1015625 5.9863281 L 4.8886719 6.6855469 C 4.7072932 6.7955833 4.5472053 6.9371684 4.4160156 7.1035156 C 4.4134056 7.1061156 4.4108031 7.1087181 4.4082031 7.1113281 C 4.3497651 7.1763051 4.2962331 7.245514 4.2480469 7.3183594 C 4.2103269 7.3908874 4.1776966 7.4659479 4.1503906 7.5429688 C 4.1210376 7.6013778 4.0949556 7.6613736 4.0722656 7.7226562 C 4.072914 7.7239562 4.0735687 7.7252625 4.0742188 7.7265625 C 4.0264951 7.8856798 4.0015096 8.0507371 4 8.2167969 L 4 14.226562 C 4.0003392 14.85842 4.3391034 15.442204 4.8886719 15.757812 L 10.111328 18.761719 C 10.66114 19.078323 11.33886 19.078323 11.888672 18.761719 L 17.111328 15.757812 C 17.660897 15.442204 17.999661 14.858419 18 14.226562 L 18 8.2167969 C 17.999679 8.0488653 17.975346 7.8817997 17.927734 7.7207031 C 17.799452 7.283897 17.507041 6.91309 17.111328 6.6855469 L 15.898438 5.9863281 C 15.89922 5.9901589 15.89801 5.9941896 15.898438 5.9980469 A 5 5 0 0 1 16 7 A 5 5 0 0 1 11 12 A 5 5 0 0 1 6 7 A 5 5 0 0 1 6.0996094 6.0625 C 6.0964848 6.0365425 6.0965016 6.0110871 6.1015625 5.9863281 z"/>
 <path style="fill:currentColor" class="ColorScheme-Highlight" d="M 11,3 C 8.7839998,3 7,4.784 7,7 c 0,2.216 1.7839998,4 4,4 2.216,0 4,-1.784 4,-4 0,-2.216 -1.784,-4 -4,-4 z m 0,1 c 1.656854,0 3,1.3431458 3,3 h 0.8 L 13.5,8.5 12.2,7 H 13 C 13,5.8954305 12.104569,5 11,5 9.8954305,5 9,5.8954305 9,7 9,8.1045695 9.8954305,9 11,9 v 1 C 9.3431458,10 8,8.6568542 8,7 8,5.3431458 9.3431458,4 11,4 Z"/>
</svg>
