<svg xmlns="http://www.w3.org/2000/svg" width="24" height="24" version="1.1">
 <defs>
  <style id="current-color-scheme" type="text/css">
   .ColorScheme-Text { color:#a0a0a0; } .ColorScheme-Highlight { color:#4285f4; } .ColorScheme-NeutralText { color:#ff9800; } .ColorScheme-PositiveText { color:#4caf50; } .ColorScheme-NegativeText { color:#f44336; }
  </style>
 </defs>
 <path style="fill:currentColor" class="ColorScheme-Text" d="M 12,5 C 9.92893,5 8.16529,6.2679201 7.40625,8.0625 5.47842,8.3491001 4,9.99242 4,12 c 0,1.083161 0.4305277,2.065766 1.1297949,2.786027 0,0 0,0 -0.1297949,-0.786027 v -1 c 5.52e-5,-0.552262 0.4477381,-0.999945 1,-1 h 5.193359 C 11.15894,11.892128 11.14309,11.779195 11.146484,11.666016 11.497628,10.672818 12.44457,10.00282 13.498047,10 H 13.5 c 1.252866,0 2.205409,0.991056 2.375,2.201172 C 16.088032,12.141459 16.270015,12.000611 16.498047,12 H 16.5 c 1.368866,0 2.5,1.131134 2.5,2.5 0,0.170444 -0.01743,0.336699 -0.05078,0.498047 C 19.597005,14.362847 20,13.478926 20,12.5 20,10.70346 18.64921,9.2313 16.90625,9.03125 16.45168,6.73786 14.42687,5 12,5 Z m 1.5,6 c -0.634185,0.0017 -1.198763,0.402082 -1.410156,1 H 14 v 1 H 13.5 12.089844 6 v 1 h 7.5 C 14.328427,14 15,13.328427 15,12.5 15,11.671573 14.328427,11 13.5,11 Z m 3,2 c -0.634185,0.0017 -1.198763,0.402082 -1.410156,1 H 17 v 1 H 16.5 15.089844 9 v 1 h 7.5 C 17.328427,16 18,15.328427 18,14.5 18,13.671573 17.328427,13 16.5,13 Z M 6,17 v 1 H 12.089844 13.5 14 v 1 H 12.089844 C 12.301237,19.597918 12.865815,19.998284 13.5,20 14.328427,20 15,19.328427 15,18.5 15,17.671573 14.328427,17 13.5,17 Z"/>
</svg>
