<svg xmlns="http://www.w3.org/2000/svg" width="22" height="22" version="1.1">
 <defs>
  <style id="current-color-scheme" type="text/css">
   .ColorScheme-Text { color:#c6c6c6; } .ColorScheme-Highlight { color:#4285f4; } .ColorScheme-NeutralText { color:#ff9800; } .ColorScheme-PositiveText { color:#4caf50; } .ColorScheme-NegativeText { color:#f44336; }
  </style>
 </defs>
 <g transform="matrix(.085113 0 0 .083333 19.15 -2.5)">
  <path style="fill:currentColor" class="ColorScheme-Text" d="m-89.597 258h64.334l-82.786-89.924-38.872 27.494z"/>
  <path style="fill:currentColor" class="ColorScheme-Text" d="m-89.597 66h64.334l-88.403 96-33.144 33.688-31.19-33.69z"/>
 </g>
</svg>
