<svg width="22" height="22" version="1.1" xmlns="http://www.w3.org/2000/svg">
 <defs>
  <style id="current-color-scheme" type="text/css">.ColorScheme-Text { color:#e4e4e4; } .ColorScheme-Highlight { color:#4285f4; } .ColorScheme-NeutralText { color:#ff9800; } .ColorScheme-PositiveText { color:#4caf50; } .ColorScheme-NegativeText { color:#f44336; }</style>
 </defs>
 <path d="m18.595563 4.001301a2.9957488 2.9985693 0 0 0-1.878983 0.5878907c-0.687796 0.5119674-1.515486 1.1058891-2.279391 1.6894531-0.117053-0.145537-0.140649-0.269943-0.277355-0.416016-0.775207-0.8283266-2.025432-1.6214754-3.457173-1.8046871-2.3588767-0.3016851-4.5794585 0.7134553-5.9553215 2.0332031-1.3758629 1.319748-2.1829457 2.853545-2.810662 4.2128912-0.043408 0.09409-0.3566215 0.73634-0.5937744 1.527343-0.2371528 0.791004-0.58026517 1.823291-0.1035198 3.361328 0.2714539 0.874818 0.955363 1.724331 1.6778031 2.166016 0.72244 0.441685 1.3956717 0.565776 1.9395326 0.611328 1.086847 0.09103 1.8378196-0.104005 2.3985358-0.238281 1.3997834-0.333665 2.5286143-0.85091 3.6524932-1.417969 0.657188 0.70525 1.507437 1.333076 3.007936 1.578125 0.960878 0.183944 1.547409 0.101842 2.257905-0.01563 0.730148-0.120711 1.456599-0.274763 2.347752-0.796875a2.9957488 2.9985693 0 0 0 0.824253-0.714844l1.998128-2.498046a2.9957488 2.9985693 0 0 0 0.656277-1.875 2.9957488 2.9985693 0 0 0-1.6153-2.6582032c0.0921-0.096 0.195858-0.173493 0.289074-0.271485a2.9957488 2.9985693 0 0 0-2.07821-5.0605418zm-8.8206738 2.9980468c0.1718952 0.0015 0.3478858 0.01393 0.5293188 0.03711 1.803212 0.230521 2.491782 2.094938 3.320448 3.6796882 1.953506-1.2971932 3.625486-2.7874752 4.8752-3.7167972-1.521568 1.597949-2.675104 2.745918-4.650582 4.1230472 0.386777 0.680359 0.819471 1.279552 1.421934 1.603515 1.018041 0.547001 1.776588 0.272438 3.728668-0.726562l-2.000082 2.5c-0.688218 0.40282-1.992081 0.578741-2.562605 0.462891-0.800032-0.118-1.675427-0.994327-2.318453-1.861329-0.137238-0.185338-0.261723-0.39632-0.388688-0.601562-0.479013 0.290576-0.99605 0.595096-1.564518 0.919922-1.1470468 0.643-2.1550943 1.053296-3.6290547 1.404297-0.8821361 0.211-2.1804331 0.406234-2.4649448-0.509766-0.2963121-0.955 0.4113107-2.427093 0.5586167-2.746094 1.0424489-2.2552502 2.566314-4.5907792 5.144742-4.5683602zm-1.6074877 1.503906c-0.3826821-0.03666-0.7787476 0.0541-1.1660634 0.320313-0.510421 0.3514-1.0080725 0.983556-1.3945884 1.6601562-0.6172253 1.079-0.260842 2.483063 1.3555243 2.789063 1.5625065-0.08227 3.061267-0.58143 4.46112-1.275391-0.500968-0.880755-0.964776-1.818148-1.5371721-2.4726562-0.4778945-0.5465-1.0810169-0.96039-1.7188204-1.021485z" style="fill:currentColor" class="ColorScheme-Text"/>
</svg>
