<svg xmlns="http://www.w3.org/2000/svg" width="22" height="22" version="1.1">
 <defs>
  <style id="current-color-scheme" type="text/css">
   .ColorScheme-Text { color:#a0a0a0; } .ColorScheme-Highlight { color:#4285f4; } .ColorScheme-NeutralText { color:#ff9800; } .ColorScheme-PositiveText { color:#4caf50; } .ColorScheme-NegativeText { color:#f44336; }
  </style>
 </defs>
 <path style="opacity:0.35;fill:currentColor" class="ColorScheme-Text" d="m 4.7320278,4.0005407 c -0.041776,-9.826e-4 -0.082228,2.357e-4 -0.1230469,0.00195 -1.2245812,0.051968 -2.0369213,1.3188941 -1.3691406,2.3691407 l 0.064453,0.064453 6.7070316,0.7382813 A 5,5 0 0 1 9.9996059,7.0005407 5,5 0 0 1 10.610934,4.6314001 L 4.8589809,4.0083532 c -0.042495,-0.00389 -0.085177,-0.00683 -0.1269531,-0.00781 z m -0.84375,3.505859 4.6601562,8.1328133 c 0.5841276,-0.09439 0.6931895,-0.245292 1.0546875,-0.748047 L 12.122653,11.076713 A 5,5 0 0 1 10.155856,8.1958537 Z M 12.991793,11.57476 10.42734,15.459525 9.845309,16.268119 c -0.259018,0.311185 -0.7783926,0.310925 -0.9726562,-0.0625 l 0.5839843,0.996094 c 0.1295088,0.18671 0.2591631,0.311073 0.3886719,0.435547 0.7123,0.560131 1.878147,0.498269 2.460938,-0.373047 l 3.664062,-5.371094 a 5,5 0 0 1 -0.970703,0.107422 5,5 0 0 1 -2.007813,-0.425781 z"/>
 <path style="fill:currentColor" class="ColorScheme-Text" d="m 14.939059,2.9985876 c -0.05777,9.358e-4 -0.115791,0.00433 -0.173828,0.00781 -0.265312,0.01593 -0.534044,0.059389 -0.800781,0.1308594 -2.1339,0.5718 -3.399824,2.7645374 -2.828125,4.8984377 0.57174,2.1337993 2.764537,3.3999243 4.898437,2.8281243 2.1339,-0.5718 3.399825,-2.7645373 2.828125,-4.898437 C 18.378249,4.1566555 16.730062,2.9695772 14.939059,2.9985876 Z m -1.439453,2.0019531 a 0.5,0.5 0 0 1 0.353516,0.1464844 l 1.146484,1.1464844 1.146484,-1.1464844 a 0.5,0.5 0 0 1 0.707032,0 0.5,0.5 0 0 1 0,0.7070312 l -1.146485,1.1464844 1.146485,1.146484 a 0.5,0.5 0 0 1 0,0.707032 0.5,0.5 0 0 1 -0.707032,0 l -1.146484,-1.146485 -1.146484,1.146485 a 0.5,0.5 0 0 1 -0.707032,0 0.5,0.5 0 0 1 0,-0.707032 L 14.292575,7.0005407 13.14609,5.8540563 a 0.5,0.5 0 0 1 0,-0.7070312 0.5,0.5 0 0 1 0.353516,-0.1464844 z"/>
</svg>
