<svg xmlns="http://www.w3.org/2000/svg" width="16" height="16" version="1.1">
 <defs>
  <style id="current-color-scheme" type="text/css">
   .ColorScheme-Text { color:#c6c6c6; } .ColorScheme-Highlight { color:#4285f4; } .ColorScheme-NeutralText { color:#ff9800; } .ColorScheme-PositiveText { color:#4caf50; } .ColorScheme-NegativeText { color:#f44336; }
  </style>
 </defs>
 <path style="fill:currentColor" class="ColorScheme-Text" d="M 3 1 C 3 1 2 1 2 2 L 2 14 C 2 15 3 15 3 15 L 13 15 C 14 15 14 14 14 14 L 14 5 L 10 1 L 3 1 z M 4 3 L 9 3 L 9 6 L 12 6 L 12 13 L 4 13 L 4 3 z M 5 8 L 5 9 L 11 9 L 11 8 L 5 8 z M 5 10 L 5 11 L 11 11 L 11 10 L 5 10 z"/>
</svg>
