<svg xmlns="http://www.w3.org/2000/svg" width="22" height="22" version="1.1">
 <defs>
  <style id="current-color-scheme" type="text/css">
   .ColorScheme-Text { color:#a0a0a0; } .ColorScheme-Highlight { color:#4285f4; } .ColorScheme-NeutralText { color:#ff9800; } .ColorScheme-PositiveText { color:#4caf50; } .ColorScheme-NegativeText { color:#f44336; }
  </style>
 </defs>
 <path style="fill:currentColor" class="ColorScheme-Text" d="M 5,4 C 4,4 4,5 4,5 V 9 H 6 V 6 H 9 V 4 Z m 8,0 v 2 h 3 v 3 h 2 V 5 C 18,4 17,4 17,4 Z M 8,8 v 5 1 h 1 5 V 12 H 10 V 8 Z m -4,5 v 4 c 0,1 1,1 1,1 H 9 V 16 H 6 v -3 z m 12,0 v 3 h -3 v 2 h 4 c 0,0 1,0 1,-1 v -4 z"/>
</svg>
