<svg xmlns="http://www.w3.org/2000/svg" width="16" height="16" version="1.1">
 <defs>
  <style id="current-color-scheme" type="text/css">
   .ColorScheme-Text { color:#a0a0a0; } .ColorScheme-Highlight { color:#4285f4; } .ColorScheme-NeutralText { color:#ff9800; } .ColorScheme-PositiveText { color:#4caf50; } .ColorScheme-NegativeText { color:#f44336; }
  </style>
 </defs>
 <path style="fill:currentColor;opacity:.35" class="ColorScheme-Text" d="M 4,2 C 1.784,2 0,3.8111038 0,6.0605469 L 0.0078125,8 C 0.0069725,8.0308589 0,8.0586803 0,8.0898438 c 0,0.026494 0.0073125,0.051732 0.0078125,0.078125 l 0.02148438,5.1582032 c -0.25174003,1.504365 1.18653122,2.456012 2.39453122,0.810547 L 4.5527344,11 H 7.6875 c -0.36944,0 -0.7859973,-0.12626 -1.0957031,-0.384766 -0.00724,-0.0058 -0.014405,-0.01162 -0.021484,-0.01758 C 6.1798608,10.252579 6.0605469,9.7512015 6.0605469,9.3554688 c 0,-0.2782896 0.1950904,-0.5875404 0.3730469,-0.8847657 C 6.3418307,8.3164761 6.2932577,8.1403988 6.2929688,7.9609375 V 7.7050781 c -10e-8,-0.3045833 0.02574,-0.5940521 0.1054687,-0.8828125 0.00249,-0.0085 0.0051,-0.016962 0.00781,-0.025391 0.091825,-0.3017921 0.2429887,-0.5793666 0.4277344,-0.8203125 0.00513,-0.00658 0.010336,-0.013086 0.015625,-0.019531 C 7.0356765,5.7271346 7.2572423,5.5149644 7.5175781,5.3085938 7.7654642,5.1116334 7.9505099,4.95222 8.046875,4.8574219 c 0.0058,-0.00528 0.011658,-0.010486 0.017578,-0.015625 0.074298,-0.069766 0.086058,-0.1010447 0.080078,-0.087891 -0.016817,-0.00567 -0.021401,-0.023438 -0.2148437,-0.023437 -0.2474474,-10e-8 -0.4362068,0.030511 -0.5722656,0.074219 -0.00713,0.00269 -0.014293,0.00529 -0.021484,0.00781 C 7.1233397,4.8755426 6.9185661,4.9514901 6.7265625,5.0390625 6.2285917,5.2652608 5.6412776,5.0494773 5.4082031,4.5546875 L 5.0957031,3.890625 C 4.8639563,3.3973692 5.0697987,2.8093723 5.5585938,2.5683594 5.8909079,2.4045324 6.2469546,2.2715084 6.625,2.1679688 c 0.0013,-6.539e-4 0.0026,-0.00131 0.00391,-0.00195 C 7.0577688,2.0509548 7.5131239,2 7.9902344,2 Z M 7.9902344,2 C 8.7843141,2 9.5417952,2.1919237 10.121094,2.6835938 10.687876,3.1646412 11,3.9198939 11,4.6601562 11,5.0622739 10.925222,5.4639333 10.744141,5.8300781 10.589696,6.1488966 10.371889,6.4287972 10.117188,6.6679688 9.917823,6.8551761 9.6909397,7.0487613 9.4316406,7.2519531 l -0.00586,0.00586 C 9.2348998,7.4104597 9.0971444,7.5376019 9.0332031,7.6074219 L 9.03125,7.609375 C 9.02982,7.611857 9.0137281,7.637664 9.0175781,7.625 c -0.00127,0.00457 -0.00257,0.00912 -0.00391,0.013672 C 9.0160295,7.6312924 9,7.6886778 9,7.7988281 v 0.1621094 c -5.545e-4,0.1583676 -0.038711,0.3143396 -0.1113281,0.4550781 0.209269,0.3091719 0.4140625,0.6416274 0.4140625,0.9394532 0,0.4046115 -0.1387647,0.9240102 -0.5410156,1.2597652 C 8.4686651,10.859842 8.0584818,11 7.6875,11 h 3.759766 l 2.128906,3.136719 c 1.208,1.645465 2.645531,0.693818 2.394531,-0.810547 l 0.02149,-5.1582032 C 15.993169,8.141576 16,8.1163374 16,8.0898438 c 0,-0.024464 -0.0068,-0.04595 -0.0078,-0.070313 L 16,6.0605469 C 16,3.8111038 14.216,2 12,2 Z m 1.4589844,4.2832031 c -0.00458,0.0045 -0.012958,0.00916 -0.017578,0.013672 v 0.00195 z"/>
 <path style="fill:currentColor" class="ColorScheme-Text" d="M 7.9902344 3 C 7.586194 3 7.2186381 3.0442849 6.8886719 3.1328125 C 6.5654395 3.22134 6.2693602 3.3320524 6 3.4648438 L 6.3125 4.1289062 C 6.5481902 4.0214085 6.7948891 3.9293964 7.0507812 3.8535156 C 7.3066734 3.7713115 7.5997212 3.7304688 7.9296875 3.7304688 C 8.3269939 3.7304687 8.6291364 3.8121542 8.8378906 3.9765625 C 9.0466448 4.1409708 9.1523438 4.3761645 9.1523438 4.6796875 C 9.1523438 4.8693894 9.1211529 5.029318 9.0605469 5.1621094 C 8.9999408 5.2949007 8.896195 5.4311978 8.7480469 5.5703125 C 8.6066327 5.7094272 8.4032512 5.8831247 8.140625 6.0917969 C 7.9251367 6.2625285 7.7548993 6.4278526 7.6269531 6.5859375 C 7.5057411 6.7440224 7.4171527 6.9108355 7.3632812 7.0878906 C 7.3161426 7.2586223 7.2929688 7.464789 7.2929688 7.7050781 L 7.2929688 7.9609375 L 8 7.9609375 L 8 7.7988281 C 8 7.6154496 8.0201427 7.4604523 8.0605469 7.3339844 C 8.1009509 7.201193 8.1784907 7.0683382 8.2929688 6.9355469 C 8.4141809 6.8027556 8.5863715 6.6477583 8.8085938 6.4707031 C 9.0510179 6.2810012 9.2585095 6.1038614 9.4335938 5.9394531 C 9.615412 5.7687215 9.7533802 5.5866503 9.8476562 5.390625 C 9.9486663 5.1882763 10 4.9447091 10 4.6601562 C 10 4.1479612 9.8247776 3.7425122 9.4746094 3.4453125 C 9.124441 3.1481128 8.629965 3 7.9902344 3 z M 7.6875 8.71875 C 7.5056818 8.71875 7.3536339 8.7664771 7.2324219 8.8613281 C 7.1179437 8.9561791 7.0605469 9.1215031 7.0605469 9.3554688 C 7.0605469 9.5831107 7.1179437 9.7464815 7.2324219 9.8476562 C 7.3536339 9.9488304 7.5056818 10 7.6875 10 C 7.8558501 10 7.9998816 9.9488304 8.1210938 9.8476562 C 8.2423058 9.7464815 8.3027344 9.5831107 8.3027344 9.3554688 C 8.3027344 9.1215031 8.2423058 8.9561791 8.1210938 8.8613281 C 7.9998816 8.7664771 7.8558501 8.71875 7.6875 8.71875 z"/>
</svg>
