<svg xmlns="http://www.w3.org/2000/svg" width="24" height="24" viewBox="0 0 24 24">
 <defs>
  <style id="current-color-scheme" type="text/css">
   .ColorScheme-Text { color:#c6c6c6; } .ColorScheme-Highlight { color:#4285f4; } .ColorScheme-NeutralText { color:#ff9800; } .ColorScheme-PositiveText { color:#4caf50; } .ColorScheme-NegativeText { color:#f44336; }
  </style>
 </defs>
 <path style="fill:currentColor" class="ColorScheme-Text" d="M 4 1 L 1 4 L 3 4 L 3 15 L 5 15 L 5 4 L 7 4 L 4 1 z M 11 1 L 11 12 L 9 12 L 12 15 L 15 12 L 13 12 L 13 1 L 11 1 z" transform="translate(4 4)"/>
</svg>
