<svg xmlns="http://www.w3.org/2000/svg" width="24" height="24" version="1.1">
 <defs>
  <style id="current-color-scheme" type="text/css">
   .ColorScheme-Text { color:#c6c6c6; } .ColorScheme-Highlight { color:#4285f4; } .ColorScheme-NeutralText { color:#ff9800; } .ColorScheme-PositiveText { color:#4caf50; } .ColorScheme-NegativeText { color:#f44336; }
  </style>
 </defs>
 <path style="fill:currentColor" class="ColorScheme-Text" d="M 10.470432,14.070465 C 10.450323,13.884474 10.30195,13.864365 10.198857,13.804038 9.8568621,13.605476 9.2069393,13.416965 8.8599125,13.225944 L 8.2941232,12.916788 C 8.0803828,12.798663 7.8641212,12.685558 7.6503808,12.562394 7.3863392,12.411591 7.1223075,12.263298 6.8683301,12.094895 6.3930591,11.780709 6.0183806,11.363478 5.7040476,10.88592 5.4953394,10.569225 5.3318802,10.22991 5.2212434,9.870486 5.0527621,9.325061 4.9496585,8.7620469 5.0251005,8.1914919 5.0703191,7.8396083 5.1407693,6.9877241 5.2690236,6.6458996 5.4651566,6.1231034 5.7543389,5.6706739 6.1290274,5.2685222 6.3754616,5.0020943 6.6621229,4.788454 6.9689127,4.5949228 7.338559,4.3611634 7.7408992,4.2078504 8.1608468,4.1173645 8.5078636,4.0419679 8.8674556,4.0092794 9.2220257,4.0067695 c 2.2606563,-0.01 4.1187933,-0.008 6.3794493,0 0.316844,0 0.641231,0.025099 0.948021,0.1030554 0.611049,0.1558329 1.149186,0.4574492 1.58421,0.9299777 0.28164,0.3066361 0.512988,0.6484705 0.648785,1.035543 0.306861,0.7803948 0.18844,1.0936146 0.01508,1.814612 -0.11819,0.2739673 -0.271584,0.5328563 -0.432523,0.7842043 -0.218772,0.3393151 -0.515498,0.6107621 -0.865026,0.8093331 -0.253987,0.143264 -0.528073,0.256369 -0.80469,0.359424 -0.455143,0.168402 -0.935436,0.125674 -1.410707,0.130694 -0.432513,0.005 -0.567152,0 -0.999675,0.003 -0.04271,0 -0.185899,0.0302 -0.228604,0.0477 1.739791,1.312938 3.769274,2.162811 4.678327,4.021536 0.153394,0.417231 0.231348,0.849542 0.26152,1.289402 0.0151,0.228719 -0.0176,0.907455 -0.04782,1.136174 -0.03021,0.22873 -0.06793,0.462479 -0.14082,0.681149 -0.08304,0.256369 -0.186078,0.507717 -0.311812,0.743987 -0.211228,0.394612 -0.492868,0.738946 -0.824798,1.040562 -0.319365,0.289047 -0.673926,0.517777 -1.066211,0.693719 -0.575844,0.258888 -1.179359,0.361933 -1.800472,0.364453 -2.255624,0.008 -4.11126,0.005 -6.3668842,-0.003 -0.3168439,0 -0.6412312,-0.0251 -0.9480109,-0.09799 C 6.8732833,19.751034 6.3376667,19.441878 5.8976106,18.979399 5.6059072,18.670243 5.3896557,18.31334 5.2287177,17.926267 5.1607885,17.765404 5.125614,17.586953 5.0929302,17.41352 c -0.037716,-0.20359 -0.07043,-0.409691 -0.077933,-0.615792 0.080389,-1.126376 1.0511541,-2.658483 3.3419436,-2.714713 0.5507029,-0.0126 1.4043218,-0.003 1.9575362,-0.003 0.04782,-0.003 0.09804,-0.008 0.155906,-0.0101 z m 2.121199,-9.106069 c 0,0.003 0,0.003 0,0 -1.214564,0.003 -2.429137,-0.015099 -3.6437013,0.012599 -0.3394736,0.008 -0.6890115,0.097996 -1.0083665,0.2186701 -0.3746885,0.140754 -0.7066189,0.3669637 -1.0033444,0.648471 -0.5079549,0.4775583 -0.8097125,1.560682 -0.9354457,2.2317718 -0.090538,0.477558 -0.035214,0.9576261 0.1031037,1.4201051 0.1031035,0.344335 0.2640416,0.66355 0.4652067,0.965166 0.3721674,0.557985 0.8977297,0.922439 1.4685512,1.236614 0.276607,0.153323 0.5582461,0.299107 0.8348531,0.45243 0.8046335,0.305501 1.6087302,0.730416 2.3020412,1.113459 0.243924,0.133214 0.487837,0.226938 0.73176,0.362662 0.07293,0.0402 0.103103,0.005 0.113158,-0.0603 0.008,-0.0503 0.008,-0.100545 0.008,-0.153323 v -1.878379 c 0,-0.500177 0.003,-1.502875 0,-2.003052 0,-0.165882 0.04272,-0.321715 0.191111,-0.404661 0.08804,-0.0503 0.206207,-0.0704 0.311821,-0.0704 1.264855,-0.005 1.83184,-0.005 3.096704,-0.003 0.497891,0 0.963097,-0.1105951 1.385556,-0.3795331 0.280443,-0.179593 0.50286,-0.398439 0.67008,-0.65201 C 18.192336,7.2584869 17.967596,6.630521 17.721769,6.06482 17.27416,5.3736214 16.625386,4.9840391 15.798075,4.9689598 c -1.201998,-0.020099 -2.003989,-0.005 -3.205987,-0.005 z m -0.769476,14.067811 c 1.1341,0 1.868202,-0.005 3.002302,0.003 0.475261,0.003 0.920349,-0.098 1.355383,-0.278988 0.462696,-0.193541 0.844918,-0.497667 1.164273,-0.8772 0.228836,-0.271457 0.407371,-0.575584 0.523051,-0.917408 0.105615,-0.311676 0.186078,-1.063288 0.183567,-1.395073 -0.003,-0.258878 0.005,-0.515256 -0.08554,-0.766595 -0.210939,-1.080918 -1.006366,-1.749427 -1.840719,-2.262176 -1.064839,-0.549279 -2.09449,-1.438217 -2.97097,-2.121294 -0.123212,-0.0679 -0.153394,-0.0478 -0.160938,0.098 -0.003,0.0503 -0.003,0.103056 -0.003,0.153324 v 3.778365 c 0,0.371992 -0.140819,0.512746 -0.512987,0.512746 -1.196966,0.003 -2.6968381,0.039 -3.8938044,0.047 -0.2640317,0.003 -0.5305845,0.0352 -0.7946262,0.0704 -0.4149154,0.0553 -0.7669643,0.248829 -1.0762652,0.527826 -0.2254732,0.205484 -0.4019792,0.536646 -0.5273015,0.793507 -0.4474717,1.744784 0.7743589,2.289911 2.1291394,2.635025 1.1718156,0.003 2.3386089,0 3.5079139,0 z"/>
</svg>
