<svg xmlns="http://www.w3.org/2000/svg" width="24" height="24" version="1.1">
 <defs>
  <style id="current-color-scheme" type="text/css">
   .ColorScheme-Text { color:#e4e4e4; } .ColorScheme-Highlight { color:#4285f4; } .ColorScheme-NeutralText { color:#ff9800; } .ColorScheme-PositiveText { color:#4caf50; } .ColorScheme-NegativeText { color:#f44336; }
  </style>
 </defs>
 <path style="fill:currentColor" class="ColorScheme-Text" d="m 12.000005,3.9999714 c -0.1926,0 -0.383065,0.010178 -0.572265,0.023437 -0.0237,0.00175 -0.04651,0.00194 -0.07031,0.00391 -2.8577999,0.22552 -5.2791533,1.9428 -6.5019534,4.375 -0.079116,0.1574499 -0.1596861,0.3152656 -0.2285162,0.4785156 -0.37451,0.8457003 -0.5782944,1.74204 -0.6152344,2.68164 -0.00162,0.03035 -0.00262,0.06135 -0.00391,0.0918 -0.00247,0.08976 -0.00646,0.179012 -0.00586,0.269532 -2.321e-4,0.02539 -0.00195,0.05073 -0.00195,0.07617 0,0.93022 0.1657181,1.819337 0.4550781,2.648438 0.11645,0.371679 0.2502294,0.746683 0.4121094,1.126953 0.40323,0.94731 0.454075,1.204793 0.390625,1.996093 -0.044209,0.55135 -0.1940394,1.114741 -0.3808594,1.431641 -0.16938,0.28738 -0.3046875,0.584666 -0.3046875,0.660156 0,0.23342 1.3473157,0.151313 2.5410151,-0.154297 1.3984,-0.35802 1.521369,-0.357817 2.667969,0.002 0.5245303,0.1646 1.1215753,0.252873 1.7968753,0.277343 0.02825,0.0014 0.05761,0.0028 0.08594,0.0039 0.0924,0.003 0.181844,0.0078 0.277344,0.0078 0.0078,0 0.01373,5.7e-5 0.02148,0 0.01231,5.5e-5 0.02478,0 0.03711,0 0.22339,0 0.443449,-0.01152 0.662109,-0.0293 1.9778,-0.14065 3.566394,-0.871468 4.996094,-2.298828 1.178,-1.176 1.908766,-2.627284 2.197266,-4.146485 0.02658,-0.13883 0.04706,-0.280545 0.06641,-0.421875 0.0117,-0.08676 0.02438,-0.172725 0.0332,-0.259765 0.01939,-0.18667 0.03067,-0.376057 0.03711,-0.566407 0.0014,-0.04797 0.0034,-0.09459 0.0039,-0.142578 6.94e-4,-0.04469 0.0039,-0.08994 0.0039,-0.134789 0,-4.3580002 -3.450397,-7.8778408 -7.779297,-7.9941408 -0.0336,-0.0015 -0.06786,-0.00142 -0.101562,-0.00195 -0.04,-5.828e-4 -0.07904,-0.00391 -0.119141,-0.00391 z m -2.4999999,4 c 0.8284269,0 1.4999999,0.6715729 1.4999999,1.4999999 0,0.5 0,1.4999997 -1,1.4999997 0,1 2.031563,2.945724 3,3 0,-1 1,-1 1.5,-1 0.828427,0 1.5,0.671573 1.5,1.5 0,0.828427 -0.671573,1.5 -1.5,1.5 l -0.560547,0 C 13.643144,15.993479 13.297749,15.884022 12.812505,15.707002 11.189558,15.114942 10.062848,14.164505 8.908208,12.414034 8.2356131,11.394351 8.003605,10.780696 8.000005,10.017549 l 0,-0.5175777 c 0,-0.828427 0.671573,-1.4999999 1.5000001,-1.4999999 z"/>
</svg>
