<svg xmlns="http://www.w3.org/2000/svg" width="24" height="24" version="1.1">
 <defs>
  <style id="current-color-scheme" type="text/css">
   .ColorScheme-Text { color:#c6c6c6; } .ColorScheme-Highlight { color:#4285f4; } .ColorScheme-NeutralText { color:#ff9800; } .ColorScheme-PositiveText { color:#4caf50; } .ColorScheme-NegativeText { color:#f44336; }
  </style>
 </defs>
 <path style="fill:currentColor" class="ColorScheme-Text" d="m 20.000275,4.000389 a 2,2 0 0 0 -2,2 2,2 0 0 0 2,2 2,2 0 0 0 2,-2 2,2 0 0 0 -2,-2 z m -10.642578,3 C 9.1522643,7.0010721 8.9809488,7.0496559 8.8088689,7.141014 8.6051167,7.2492635 7.8505641,7.9286429 7.1291813,8.6488265 6.0327945,9.743083 5.7098748,9.995896 5.1682439,10.203514 c -0.8524218,0.327797 -1.57015,0.408048 -2.1601563,0.238281 -0.8008962,-0.230467 -1.2330131,0.200381 -0.8886719,0.884766 0.3283286,0.652546 1.6398875,1.244053 3.3789063,1.523437 2.4144011,0.387887 4.0137942,0.02882 5.710937,-1.283203 0.325315,-0.251506 0.686984,-0.457031 0.802735,-0.457031 0.115752,0 0.510848,0.232772 0.876953,0.515625 0.869522,0.671783 1.293334,0.884396 2.324219,1.175781 0.733646,0.207378 1.01723,0.231872 2.048828,0.169922 2.169024,-0.130283 3.620632,-0.570879 4.384765,-1.330078 0.257503,-0.255623 0.353516,-0.451573 0.353516,-0.716797 0,-0.532849 -0.299446,-0.666932 -1.064453,-0.478515 -0.463755,0.115209 -0.721948,0.116431 -1.189453,0.01563 -1.143763,-0.246029 -1.659674,-0.584989 -2.992188,-1.9589899 -1.036262,-1.0670142 -1.464836,-1.4800782 -2.027344,-1.5 -0.338752,-0.012001 -0.724759,0.118686 -1.322265,0.3339844 C 12.770815,7.5648267 12.117855,7.7503896 11.955353,7.750389 11.791602,7.7502696 11.291374,7.602334 10.840119,7.4183578 10.138236,7.1316823 9.7000848,6.9992505 9.357697,7.000389 Z m 2.142578,7 a 0.50010719,0.57161703 0 0 0 -0.490234,0.683594 l 0.5,2.857422 a 0.50010719,0.57161703 0 0 0 0.980468,0 l 0.5,-2.857422 a 0.50010719,0.57161703 0 0 0 -0.490234,-0.683594 z"/>
</svg>
