<svg xmlns="http://www.w3.org/2000/svg" width="22" height="22" version="1.1">
 <defs>
  <style id="current-color-scheme" type="text/css">
   .ColorScheme-Text { color:#a0a0a0; } .ColorScheme-Highlight { color:#4285f4; } .ColorScheme-NeutralText { color:#ff9800; } .ColorScheme-PositiveText { color:#4caf50; } .ColorScheme-NegativeText { color:#f44336; }
  </style>
 </defs>
 <path style="fill:currentColor" class="ColorScheme-Text" d="M 5.4453125 3 A 1.4120914 1.4364486 0 0 0 4 4.4355469 L 4 17.564453 A 1.4120914 1.4364486 0 0 0 6.1171875 18.808594 L 17.292969 12.244141 A 1.4120914 1.4364486 0 0 0 17.292969 9.7558594 L 6.1171875 3.1933594 A 1.4120914 1.4364486 0 0 0 5.4453125 3 z M 7 7.1914062 L 13.486328 11.001953 L 7 14.8125 L 7 7.1914062 z M 17.509766 14.001953 A 3.5 3.5 0 0 0 15.75 14.46875 A 3.5 3.5 0 0 0 14.251953 18.796875 L 16.027344 17.773438 A 1.5 1.5 0 0 1 16.75 16.201172 A 1.5 1.5 0 0 1 17.226562 16.027344 L 17.683594 16.816406 L 18.472656 16.361328 L 20.246094 15.337891 A 3.5 3.5 0 0 0 17.509766 14.001953 z M 20.748047 16.203125 L 18.972656 17.226562 A 1.5 1.5 0 0 1 18.25 18.798828 A 1.5 1.5 0 0 1 17.773438 18.972656 L 17.316406 18.183594 L 16.527344 18.638672 L 15.583984 19.183594 L 14.753906 19.662109 A 3.5 3.5 0 0 0 19.25 20.53125 A 3.5 3.5 0 0 0 20.748047 16.203125 z"/>
</svg>
