<svg xmlns="http://www.w3.org/2000/svg" width="16" height="16" version="1.1">
 <path style="fill:#c6c6c6" d="m 14,15 c 0.55,0 1,-0.45 1,-1 V 3 L 13,1 H 2 C 1.45,1 1,1.45 1,2 v 12 c 0,0.55 0.45,1 1,1 z M 13,13 H 3 V 3 h 1 v 5 h 8 V 3 h 1 z M 8,7 H 6 V 3 h 2 z"/>
</svg>
