<svg xmlns="http://www.w3.org/2000/svg" width="16" height="16" version="1.1">
 <path style="fill:#c6c6c6" d="M 10 0 L 10 0.828125 C 9.895342 1.4418576 10.398955 2.0088591 11.021484 2 L 12.599609 2 L 8.3261719 6.265625 C 7.5622299 6.9984494 8.2788319 8.0426359 9.0761719 7.9980469 C 9.2994279 7.9855619 9.529184 7.887732 9.734375 7.6738281 L 14 3.4003906 L 14 4.9785156 C 13.9922 5.5962819 14.552062 6.0976636 15.162109 6 L 16 6 L 16 4.9785156 L 15.994141 0.00390625 L 11.021484 0 L 10 0 z M 3.5 2 A 2.5 2.5 0 0 0 1 4.5 L 1 5 C 1 10.505 5.496 15 11 15 L 11.5 15 A 2.5 2.5 0 0 0 14 12.5 L 14 11 C 14 10.446 13.555 10 13 10 L 10 10 C 9.447 10 9 10.446 9 11 L 9 11.710938 A 6.972 6.972 0 0 1 4.2890625 7 L 5.0019531 7 C 5.5559531 7 6.0019531 6.554 6.0019531 6 L 6.0019531 3 C 6.0019531 2.446 5.5559531 2 5.0019531 2 L 3.5 2 z"/>
</svg>
