<svg xmlns="http://www.w3.org/2000/svg" width="16" height="16" version="1.1">
 <defs>
  <style id="current-color-scheme" type="text/css">
   .ColorScheme-Text { color:#a0a0a0; } .ColorScheme-Highlight { color:#4285f4; } .ColorScheme-NeutralText { color:#ff9800; } .ColorScheme-PositiveText { color:#4caf50; } .ColorScheme-NegativeText { color:#f44336; }
  </style>
 </defs>
 <path style="fill:currentColor" class="ColorScheme-Text" d="M 4.75 4 C 3.0125048 4 1.931914 4.9313146 1.4609375 5.8261719 C 1.0679482 6.5728533 1.0123668 7.2769461 1.0039062 7.5 L 1 7.5 C 1 7.5 1.0017985 7.5376379 1.0019531 7.5488281 C 1.0018008 7.5608305 1 7.5996094 1 7.5996094 L 1.0039062 7.5996094 C 1.0129901 7.820436 1.0709438 8.5086422 1.4667969 9.234375 C 1.9424454 10.1064 3.0208384 11 4.75 11 C 5.7291644 11 6.5634111 10.543852 7.25 9.9628906 C 7.7050291 9.5778651 8.1123775 9.1310051 8.5 8.6738281 C 8.8876225 9.1310051 9.2949709 9.5778651 9.75 9.9628906 C 10.436589 10.543852 11.270836 11 12.25 11 C 13.987495 11 15.068087 10.068685 15.539062 9.1738281 C 15.932052 8.4271467 15.987633 7.7230539 15.996094 7.5 L 16 7.5 C 16 7.5 15.998201 7.4623621 15.998047 7.4511719 C 15.998199 7.4391695 16 7.4003906 16 7.4003906 L 15.996094 7.4003906 C 15.98702 7.1795639 15.929097 6.4913574 15.533203 5.765625 C 15.057554 4.8936005 13.979162 4 12.25 4 C 11.270836 4 10.436589 4.4561482 9.75 5.0371094 C 9.2949709 5.4221349 8.8876226 5.8689949 8.5 6.3261719 C 8.1123775 5.8689949 7.7050291 5.4221349 7.25 5.0371094 C 6.5634111 4.4561482 5.7291644 4 4.75 4 z M 4.75 5.5 C 5.2708304 5.5 5.7490931 5.7313529 6.28125 6.1816406 C 6.6890683 6.5267185 7.104568 6.9919285 7.5292969 7.5 C 7.104568 8.0080715 6.6890683 8.4732815 6.28125 8.8183594 C 5.7490931 9.2686471 5.2708304 9.5 4.75 9.5 C 3.4791726 9.5 3.0575518 9.0185991 2.7832031 8.515625 C 2.5469921 8.0825702 2.5102958 7.6628535 2.5039062 7.5488281 C 2.5103715 7.4297975 2.5478591 6.9817242 2.7890625 6.5234375 C 3.0680835 5.9932964 3.4875054 5.5 4.75 5.5 z M 12.25 5.5 C 13.520828 5.5 13.942448 5.9814016 14.216797 6.484375 C 14.453008 6.9174292 14.489704 7.3371464 14.496094 7.4511719 C 14.489629 7.5702024 14.45214 8.0182757 14.210938 8.4765625 C 13.931915 9.0067037 13.512494 9.5 12.25 9.5 C 11.729169 9.5 11.250907 9.2686471 10.71875 8.8183594 C 10.310932 8.4732815 9.895432 8.0080715 9.4707031 7.5 C 9.895432 6.9919285 10.310932 6.5267185 10.71875 6.1816406 C 11.250907 5.7313529 11.72917 5.5 12.25 5.5 z M 4.5 6 A 0.5 0.5 0 0 0 4 6.5 L 4 7 L 3.5 7 A 0.5 0.5 0 0 0 3 7.5 A 0.5 0.5 0 0 0 3.5 8 L 4 8 L 4 8.5 A 0.5 0.5 0 0 0 4.5 9 A 0.5 0.5 0 0 0 5 8.5 L 5 8 L 5.5 8 A 0.5 0.5 0 0 0 6 7.5 A 0.5 0.5 0 0 0 5.5 7 L 5 7 L 5 6.5 A 0.5 0.5 0 0 0 4.5 6 z M 12.5 6 A 0.5 0.5 0 0 0 12 6.5 A 0.5 0.5 0 0 0 12.5 7 A 0.5 0.5 0 0 0 13 6.5 A 0.5 0.5 0 0 0 12.5 6 z M 11.5 7 A 0.5 0.5 0 0 0 11 7.5 A 0.5 0.5 0 0 0 11.5 8 A 0.5 0.5 0 0 0 12 7.5 A 0.5 0.5 0 0 0 11.5 7 z M 13.5 7 A 0.5 0.5 0 0 0 13 7.5 A 0.5 0.5 0 0 0 13.5 8 A 0.5 0.5 0 0 0 14 7.5 A 0.5 0.5 0 0 0 13.5 7 z M 12.5 8 A 0.5 0.5 0 0 0 12 8.5 A 0.5 0.5 0 0 0 12.5 9 A 0.5 0.5 0 0 0 13 8.5 A 0.5 0.5 0 0 0 12.5 8 z"/>
</svg>
