<svg xmlns="http://www.w3.org/2000/svg" width="22" height="22" version="1.1">
 <defs>
  <style id="current-color-scheme" type="text/css">
   .ColorScheme-Text { color:#c6c6c6; } .ColorScheme-Highlight { color:#4285f4; } .ColorScheme-NeutralText { color:#ff9800; } .ColorScheme-PositiveText { color:#4caf50; } .ColorScheme-NegativeText { color:#f44336; }
  </style>
 </defs>
 <g transform="translate(3,3)">
  <path style="fill:currentColor" class="ColorScheme-Text" d="M 12.5,8 A 3.5,3.5 0 0 0 9,11.5 3.5,3.5 0 0 0 12.5,15 3.5,3.5 0 0 0 16,11.5 3.5,3.5 0 0 0 12.5,8 Z m 0,1 0.75,1 0.75,1 h -1 v 1 h 1 L 13.25,13 12.5,14 11.75,13 11,12 h 1 v -1 h -1 l 0.75,-1 z"/>
  <path style="fill:currentColor" class="ColorScheme-Text" d="M 2.4003906,3 C 1.6247906,3 1,3.6363058 1,4.4277344 V 11.572266 C 1,12.363694 1.6247906,13 2.4003906,13 H 8.2675781 A 4.5,4.5 0 0 1 8,11.5 4.5,4.5 0 0 1 12.5,7 4.5,4.5 0 0 1 15,7.7578125 V 4.4277344 C 15,3.6363058 14.375209,3 13.599609,3 Z"/>
 </g>
</svg>
