<svg xmlns="http://www.w3.org/2000/svg" width="16" height="16" version="1.1">
 <defs>
  <style id="current-color-scheme" type="text/css">
   .ColorScheme-Text { color:#e4e4e4; } .ColorScheme-Highlight { color:#4285f4; } .ColorScheme-NeutralText { color:#ff9800; } .ColorScheme-PositiveText { color:#4caf50; } .ColorScheme-NegativeText { color:#f44336; }
  </style>
 </defs>
 <path style="opacity:.35;fill:currentColor" class="ColorScheme-Text" d="M 15,3 C 15,3 14.85,4.6389 11.99,5.9219 11.975,6.6591 11.884,7.4094 11.635,8.1309 11.251,9.2444 10.442,10.294 9.1621,10.828 7.6586,11.456 6.7381,12.21 6.1445,12.908 7.0598,12.402 8.368,11.95 10.256,11.756 14.538,11.316 15,3 15,3 Z"/>
 <path style="fill:currentColor" class="ColorScheme-Text" d="M 10.119,1 C 10.119,1 10.416,3.4145 7.7715,5.4785 7.9123,6.0096 8.0052,6.569 8,7.1523 7.9907,8.188 7.6476,9.3037 6.8145,10.213 V 10.215 C 6.1152,10.978 5.6816,11.65 5.4082,12.229 6.1064,11.422 7.1632,10.58 8.7773,9.9062 12.814,8.2222 10.119,1 10.119,1 Z"/>
 <path style="fill:currentColor" class="ColorScheme-Text" d="M 2.486,8.501 C 5.5186,4.6799 4.8365,2 4.8365,2 4.8365,2 8.7216,6.6551 6.0776,9.538 3.1245,12.759 4.1316,15 4.1316,15 4.1316,15 0.74659,10.692 2.486,8.501 Z"/>
</svg>
