<svg xmlns="http://www.w3.org/2000/svg" width="24" height="24" version="1.1">
 <defs>
  <style id="current-color-scheme" type="text/css">
   .ColorScheme-Text { color:#c6c6c6; } .ColorScheme-Highlight { color:#4285f4; } .ColorScheme-NeutralText { color:#ff9800; } .ColorScheme-PositiveText { color:#4caf50; } .ColorScheme-NegativeText { color:#f44336; }
  </style>
 </defs>
 <path style="fill:currentColor" class="ColorScheme-Text" d="m3.9998 6v12h2v-12h-2zm4 0v12l4.252-0.0332c2.9313-0.03263 3.208-0.07195 4.4473-0.67578 2.702-1.3165 3.9797-4.5047 2.9414-7.3438-0.686-1.8751-2.248-3.2628-4.237-3.7677-0.625-0.1586-1.021-0.1797-3.449-0.1797h-3.9552zm6.2637 1.918c0.79757 0.03798 1.6806 0.37002 2.5645 1.2539 1.0484 1.0484 1.3122 2.1015 1.2383 3.0059l0.882-0.885 0.707 0.707-1.414 1.414-0.707 0.707-0.707-0.707-1.414-1.414 0.70703-0.70703 0.92773 0.92773c0.08627-0.70145-0.10042-1.5145-0.92773-2.3418-2.1213-2.1213-4.2422 0-4.2422 0l-0.707-0.7073s1.3372-1.3375 3.0918-1.2539zm-3.799 1.9609 0.707 0.7071 1.414 1.414-0.707 0.707-0.928-0.928c-0.08582 0.70151 0.10041 1.5145 0.92774 2.3418 2.1213 2.1213 4.2422 0 4.2422 0l0.70703 0.70703s-2.8278 2.8284-5.6562 0c-1.0484-1.0484-1.3122-2.1015-1.2383-3.0059l-0.883 0.885-0.707-0.707 1.4141-1.414 0.7074-0.7071z"/>
</svg>
