<svg xmlns="http://www.w3.org/2000/svg" width="16" height="16" version="1.1">
 <path style="fill:#a0a0a0" d="M 7.9999998,0 C 3.5940002,0 1.5e-7,3.594 1.5e-7,8 c 0,4.406 3.59399995,8 7.99999965,8 C 12.406,16 16,12.406 16,8 16,3.594 12.406,0 7.9999998,0 Z m 0,2 c 0.038,0 0.075,0.005 0.1130001,0.006 a 4.993,4.993 0 0 0 1.428,4.604 A 4.999,4.999 0 0 0 13.994,7.893 C 13.994,7.929 14,7.963 14,8 c 0,3.326 -2.674,6 -6.0000002,6 -0.039,0 -0.076,-0.005 -0.115,-0.006 a 4.992,4.992 0 0 0 -1.2809997,-4.46 4.994,4.994 0 0 0 -3.35,-1.528 4.992,4.992 0 0 0 -1.248,0.1 c 0,-0.036 -0.006,-0.07 -0.006,-0.106 0,-3.326 2.674,-6 5.9999997,-6 z M 9.1129999,2.105 A 5.977,5.977 0 0 1 13.895,6.891 3.99,3.99 0 0 1 10.232,5.889 3.987,3.987 0 0 1 9.1129999,2.105 Z M 3.2050001,9.004 a 3.99,3.99 0 0 1 3.684,4.89 5.976,5.976 0 0 1 -4.784,-4.789 c 0.364,-0.083 0.734,-0.12 1.1,-0.101 z"/>
</svg>
