<svg xmlns="http://www.w3.org/2000/svg" width="24" height="24" version="1.1">
 <defs>
  <style id="current-color-scheme" type="text/css">
   .ColorScheme-Text { color:#e4e4e4; } .ColorScheme-Highlight { color:#4285f4; } .ColorScheme-NeutralText { color:#ff9800; } .ColorScheme-PositiveText { color:#4caf50; } .ColorScheme-NegativeText { color:#f44336; }
  </style>
 </defs>
 <path style="fill:currentColor" class="ColorScheme-Text" d="m 12.199979,4.0001759 c -0.07277,-8.44e-4 -0.145538,0.0023 -0.217969,0.0094 -4.0785133,0.01011 -7.5564686,3.136527 -7.9460942,7.2330081 -0.4008831,4.214839 2.5983297,8.047177 6.7859382,8.670545 4.095506,0.609659 7.989175,-2.051114 8.948436,-6.049381 L 16.954981,10.478827 C 16.555442,9.9923849 16.390985,10.000338 15.79867,10.000338 h -2.798681 c -2.704646,-0.03825 -2.704624,4.038358 2.2e-5,4.000107 h 2.465591 c -0.795245,1.394864 -2.371041,2.206931 -4.054686,1.956303 C 9.2874068,15.640642 7.8146619,13.758794 8.0179471,11.621475 8.2212323,9.4841569 10.022142,7.9135039 12.167166,8.0034089 c 0.08695,0.0046 0.174119,0.0036 0.260937,-0.0031 h 2.571655 c 1.115632,0.01578 2.028484,-0.884282 2.028484,-2.000054 0,-1.115773 -0.912852,-2.015833 -2.028484,-2.000054 z"/>
</svg>
