<svg xmlns="http://www.w3.org/2000/svg" width="24" height="24" version="1.1">
 <defs>
  <style id="current-color-scheme" type="text/css">
   .ColorScheme-Text { color:#a0a0a0; } .ColorScheme-Highlight { color:#4285f4; } .ColorScheme-NeutralText { color:#ff9800; } .ColorScheme-PositiveText { color:#4caf50; } .ColorScheme-NegativeText { color:#f44336; }
  </style>
 </defs>
 <g transform="translate(4,4)">
  <path style="fill:currentColor" class="ColorScheme-Text" d="M 9.5,1 C 5,3 3,7 3,9.75 3,12.5 5.0572,15 8,15 6.4124,15 5.4121,13.807 5.4121,12.375 5.4121,10.925 6.6402,8.875 8.6855,8 8.6855,11.063 10.882,11.505 10.322,13.25 10.005,14.239 9.201,15 8,15 10.581,15 13,13 13,10.5 13,8 9.4688,6 9.5,1 Z"/>
 </g>
</svg>
