<svg xmlns="http://www.w3.org/2000/svg" width="16" height="16" version="1.1">
 <defs>
  <style id="current-color-scheme" type="text/css">
   .ColorScheme-Text { color:#c6c6c6; } .ColorScheme-Highlight { color:#4285f4; } .ColorScheme-NeutralText { color:#ff9800; } .ColorScheme-PositiveText { color:#4caf50; } .ColorScheme-NegativeText { color:#f44336; }
  </style>
 </defs>
 <path style="fill:currentColor" class="ColorScheme-NegativeText" d="M 10.0625 2 C 9.978689 1.99904 9.8943524 2.0017903 9.8085938 2.0058594 C 9.0362927 2.0429065 8.3825087 2.3422015 7.7402344 2.7714844 C 7.4670666 2.9540296 7.0566269 3.6118136 6.875 3.8417969 C 6.7837453 3.9575639 6.784777 3.9576248 6.6445312 3.921875 C 6.5653597 3.9020325 6.2729301 3.8879312 5.9726562 3.8886719 C 5.5020104 3.8896919 5.4044218 3.899213 5.1367188 3.9707031 C 3.6245694 4.3740607 2.5753856 5.3591928 2.4921875 6.8867188 L 2.4746094 7.234375 L 2.3515625 7.2695312 C 1.9212488 7.3983752 1.3858152 7.6496198 1.0078125 8.0273438 C 0.55697604 8.4778198 0.25351435 9.0123618 0.08203125 9.6523438 C 0.00945525 9.9230718 0 10.011966 0 10.501953 C 0 10.991954 0.00948625 11.080796 0.08203125 11.351562 C 0.45507145 12.743737 1.5842725 13.766715 2.9707031 13.96875 C 3.0457532 13.97972 4.3770062 13.987015 6 13.992188 L 6 11.992188 C 5.4819116 11.99061 4.8594297 11.990831 4.4550781 11.988281 C 4.0269556 11.985581 3.675462 11.983669 3.4296875 11.980469 C 3.3426445 11.979369 3.2874437 11.977663 3.2304688 11.976562 C 2.6586283 11.880512 2.1855851 11.475559 2.0136719 10.833984 C 1.9589423 10.629712 2 10.967328 2 10.501953 C 2 10.284818 1.9923204 10.248044 1.9882812 10.244141 C 1.9921513 10.239741 1.9998679 10.221412 2.0136719 10.169922 C 2.1039789 9.8328912 2.2124942 9.6506196 2.421875 9.4414062 C 2.444062 9.4192352 2.7360497 9.2444952 2.921875 9.1875 C 2.923325 9.1870561 2.9243414 9.1859769 2.9257812 9.1855469 L 3.0292969 9.15625 C 3.8455692 8.9201701 4.4235882 8.1941218 4.4707031 7.3457031 L 4.4902344 6.9960938 C 4.5268514 6.3238059 4.8599847 6.113701 5.6523438 5.9023438 C 5.7009647 5.8893597 5.7158991 5.8805941 5.7207031 5.8769531 C 5.7219131 5.8801431 5.7544331 5.8891529 5.9765625 5.8886719 C 6.0721595 5.8884361 6.159557 5.8899081 6.234375 5.8925781 C 6.388106 5.9548161 6.7495802 6.0679209 7.4394531 5.8261719 C 8.2891175 5.528416 8.3979749 4.933245 8.4453125 4.8808594 C 9.0396825 4.2231061 9.5385465 4.1438613 10.039062 4 C 10.344031 4.00348 10.55624 4.052107 10.853516 4.1972656 C 11.350611 4.44009 11.553838 4.643877 11.796875 5.140625 C 11.959485 5.4729932 12.008469 5.7115142 11.992188 6.0800781 L 11.976562 6.4335938 C 11.945763 7.139316 12.289488 7.8089533 12.880859 8.1953125 L 13.134766 8.3613281 L 13.128906 8.359375 C 12.98935 8.267561 13.323969 8.5219705 13.408203 8.6054688 C 13.959992 9.1524012 14.131824 9.7759429 13.923828 10.560547 C 13.897758 10.658867 13.535024 11.299059 13.416016 11.417969 C 13.327476 11.506439 12.614576 11.911148 12.589844 11.917969 C 12.284387 12.002259 12.580944 11.967585 11.986328 11.984375 C 11.63121 11.994401 10.929792 11.997168 10 11.998047 L 10 13.998047 C 12.495614 13.995482 12.662671 13.972198 13.121094 13.845703 C 13.663067 13.696232 14.405666 13.258077 14.830078 12.833984 C 15.274282 12.390149 15.702967 11.654849 15.857422 11.072266 C 16.236064 9.64394 15.852749 8.2127689 14.816406 7.1855469 C 14.6333 7.0040409 14.368119 6.779345 14.228516 6.6875 L 13.974609 6.5214844 L 13.990234 6.1679688 C 14.020134 5.4911464 13.891705 4.8707249 13.59375 4.2617188 C 13.179368 3.4147545 12.578073 2.814434 11.730469 2.4003906 C 11.191383 2.1371562 10.649214 2.0066921 10.0625 2 z M 7 7 L 7 10 L 7.25 12 L 8.75 12 L 9 10 L 9 7 L 7 7 z M 7 13 L 7 15 L 9 15 L 9 13 L 7 13 z"/>
</svg>
