<svg xmlns="http://www.w3.org/2000/svg" width="22" height="22" version="1.1">
 <defs>
  <style id="current-color-scheme" type="text/css">
   .ColorScheme-Text { color:#c6c6c6; } .ColorScheme-Highlight { color:#4285f4; } .ColorScheme-NeutralText { color:#ff9800; } .ColorScheme-PositiveText { color:#4caf50; } .ColorScheme-NegativeText { color:#f44336; }
  </style>
 </defs>
 <g transform="matrix(1,0,0,1,3,3)">
  <path style="fill:currentColor" class="ColorScheme-Text" d="M 13.5 2 A 1.5 1.5 0 0 0 12 3.5 A 1.5 1.5 0 0 0 13.5 5 A 1.5 1.5 0 0 0 15 3.5 A 1.5 1.5 0 0 0 13.5 2 z M 6.5 3 A 1.5 1.5 0 0 0 5 4.5 A 1.5 1.5 0 0 0 6.5 6 A 1.5 1.5 0 0 0 8 4.5 A 1.5 1.5 0 0 0 6.5 3 z M 1.5 7 A 1.5 1.5 0 0 0 0 8.5 A 1.5 1.5 0 0 0 1.5 10 A 1.5 1.5 0 0 0 2.9121 9 L 16 9 L 16 8 L 2.9121 8 A 1.5 1.5 0 0 0 1.5 7 z M 14.5 10 A 1.5 1.5 0 0 0 13 11.5 A 1.5 1.5 0 0 0 14.5 13 A 1.5 1.5 0 0 0 16 11.5 A 1.5 1.5 0 0 0 14.5 10 z M 8.5 11 A 1.5 1.5 0 0 0 7 12.5 A 1.5 1.5 0 0 0 8.5 14 A 1.5 1.5 0 0 0 10 12.5 A 1.5 1.5 0 0 0 8.5 11 z"/>
 </g>
</svg>
