<svg xmlns="http://www.w3.org/2000/svg" width="22" height="22" version="1.1">
 <defs>
  <style id="current-color-scheme" type="text/css">
   .ColorScheme-Text { color:#e4e4e4; } .ColorScheme-Highlight { color:#4285f4; } .ColorScheme-NeutralText { color:#ff9800; } .ColorScheme-PositiveText { color:#4caf50; } .ColorScheme-NegativeText { color:#f44336; }
  </style>
 </defs>
 <path style="fill:currentColor" class="ColorScheme-Text" d="M 16 5 A 2 2 0 0 0 14 7 A 2 2 0 0 0 16 9 A 2 2 0 0 0 18 7 A 2 2 0 0 0 16 5 z M 11.052734 8.0019531 C 10.756773 7.9742231 10.405121 8.1709475 8.6894531 9.3203125 C 7.159898 10.344882 6.85266 10.520648 6.6171875 10.513672 C 6.4379458 10.508372 6.0986998 10.413937 4.9375 10.044922 C 3.2249287 9.5006787 2.7546655 9.373355 2.3085938 9.328125 C 2.0199874 9.298855 1.9498557 9.3592865 2.03125 9.5703125 C 2.2119434 10.03838 3.0045703 11.032286 4.0195312 12.0625 C 4.9231922 12.979736 5.6817831 13.607603 6.1953125 13.865234 C 6.5001783 14.018184 6.6119496 14.03126 6.9296875 13.951172 C 7.3418853 13.84731 8.1100593 13.468388 9.0839844 12.888672 C 9.4149815 12.691685 9.9184874 12.392299 10.203125 12.222656 C 10.487763 12.053013 10.782706 11.888642 10.857422 11.857422 C 10.981788 11.805392 10.999608 11.802504 11.085938 11.833984 C 11.245726 11.892214 11.451932 12.007903 12.207031 12.462891 C 14.018998 13.55469 14.704577 13.899216 15.244141 13.988281 C 15.49626 14.029901 15.780535 13.921054 16.220703 13.615234 C 17.437262 12.770009 19.520956 10.544859 19.927734 9.65625 C 20.069231 9.347266 20.016802 9.2905135 19.638672 9.3359375 C 19.195116 9.3891775 18.744595 9.5123117 17.171875 10.013672 C 15.979028 10.393893 15.559019 10.511768 15.378906 10.515625 C 15.147402 10.520625 14.841472 10.3439 13.333984 9.3320312 C 11.818269 8.3146572 11.327404 8.0276851 11.052734 8.0019531 z"/>
</svg>
