<svg xmlns="http://www.w3.org/2000/svg" width="24" height="24" version="1.1">
 <defs>
  <style id="current-color-scheme" type="text/css">
   .ColorScheme-Text { color:#c6c6c6; } .ColorScheme-Highlight { color:#4285f4; } .ColorScheme-NeutralText { color:#ff9800; } .ColorScheme-PositiveText { color:#4caf50; } .ColorScheme-NegativeText { color:#f44336; }
  </style>
 </defs>
 <path style="fill:currentColor" class="ColorScheme-Text" d="M 9.9898677,12 C 9.3133783,12.001344 8.6272953,12.174748 7.9996333,12.537109 6.0866573,13.641449 5.4323727,16.087251 6.5367427,18 c 1.104371,1.912649 3.5500143,2.567231 5.4628913,1.462891 1.912976,-1.104339 2.567262,-3.548188 1.46289,-5.460938 -0.690232,-1.195405 -1.902854,-1.901671 -3.183594,-1.992187 -0.09606,-0.0068 -0.192421,-0.01 -0.2890623,-0.0098 z m -1.9902344,2 h 1 v 4 h -1 z m 2.9999997,0 h 1.000001 v 4 h -1.000001 z"/>
 <path style="opacity:0.35;fill:currentColor" class="ColorScheme-Text" d="M 17.999634,4 C 13.094971,4 8.9288867,7.2299795 7.5152583,11.673828 A 5,5 0 0 1 9.9293208,11.005859 C 11.397452,8.0364771 14.45372,6 17.999634,6 Z m 0,4 c -2.546131,0 -4.782678,1.372955 -6.007813,3.416016 A 5,5 0 0 1 13.62854,12.5625 C 14.480378,11.030668 16.113174,10 17.999634,10 Z m -1.5,4 a 1.5,1.5 0 0 0 -1.5,1.5 1.5,1.5 0 0 0 1.5,1.5 1.5,1.5 0 0 0 1.5,-1.5 1.5,1.5 0 0 0 -1.5,-1.5 z m -1.5,4 v 4 h 3 v -4 z"/>
</svg>
