<svg xmlns="http://www.w3.org/2000/svg" width="16" height="16" version="1.1">
 <defs>
  <style id="current-color-scheme" type="text/css">
   .ColorScheme-Text { color:#c6c6c6; } .ColorScheme-Highlight { color:#4285f4; } .ColorScheme-NeutralText { color:#ff9800; } .ColorScheme-PositiveText { color:#4caf50; } .ColorScheme-NegativeText { color:#f44336; }
  </style>
 </defs>
 <path style="fill:currentColor;opacity:.35" class="ColorScheme-Text" d="M 10,11 A 5,5 0 0 1 5,16 5,5 0 0 1 0,11 5,5 0 0 1 5,6 5,5 0 0 1 10,11 Z"/>
 <path style="opacity:0.7;fill:currentColor" class="ColorScheme-Text" d="M 5,6 A 5,5 0 0 0 0,11 5,5 0 0 0 5,16 5,5 0 0 0 10,11 5,5 0 0 0 5,6 Z M 5,7 A 4,4 0 0 1 9,11 4,4 0 0 1 5,15 4,4 0 0 1 1,11 4,4 0 0 1 5,7 Z"/>
 <path style="fill:currentColor" class="ColorScheme-Text" d="M 4,0 V 12 H 16 V 10 H 6 V 0 Z"/>
</svg>
