<svg xmlns="http://www.w3.org/2000/svg" width="16" height="16" version="1.1">
 <defs>
  <style id="current-color-scheme" type="text/css">
   .ColorScheme-Text { color:#c6c6c6; } .ColorScheme-Highlight { color:#4285f4; } .ColorScheme-NeutralText { color:#ff9800; } .ColorScheme-PositiveText { color:#4caf50; } .ColorScheme-NegativeText { color:#f44336; }
  </style>
 </defs>
 <path style="fill:currentColor" class="ColorScheme-Text" d="M 8.5449226,5.3546825e-4 C 8.1958446,-0.00757453 7.8513246,0.07823047 7.5488286,0.24577577 L 1.9511726,3.3495364 C 1.7847483,3.4418236 1.6380177,3.557104 1.5117195,3.6889489 L 8.5000006,7.4656487 15.490234,3.6889489 C 15.362903,3.5572968 15.215599,3.4420159 15.048828,3.3495364 L 9.4511726,0.24381387 C 9.1751136,0.09092977 8.8634906,0.00760047 8.5449226,5.3546825e-4 Z M 1.0410163,4.5776996 c -0.024236,0.1154384 -0.041023,0.2327743 -0.041016,0.3531459 a 1.9023174,1.8273384 0 0 0 0,0.00196 v 6.2075215 c -1e-7,0.111088 0.014833,0.220543 0.035156,0.327641 a 1.9023174,1.8273384 0 0 0 0.019531,0.09417 c 0.025655,0.103745 0.059878,0.205041 0.1035156,0.302136 a 1.9023174,1.8273384 0 0 0 0.027344,0.05493 c 0.045907,0.09343 0.098509,0.182158 0.1601562,0.266822 a 1.9023174,1.8273384 0 0 0 0.027344,0.0412 c 0.067341,0.0874 0.1453277,0.168174 0.2285156,0.243278 a 1.9023174,1.8273384 0 0 0 0.066406,0.05493 c 0.088192,0.07258 0.1805318,0.141213 0.2832031,0.198154 l 5.5976564,3.10376 c 0.08936,0.04956 0.182642,0.09105 0.277344,0.125563 a 1.9023174,1.8273384 0 0 0 0.08594,0.0255 c 0.02902,0.0091 0.05875,0.01385 0.08789,0.02158 V 8.3367421 Z m 14.9101557,0.00392 -6.9511714,3.7551187 v 7.6593427 a 1.9023174,1.8273384 0 0 0 0.451172,-0.168725 l 5.5976554,-3.10376 A 1.9023174,1.8273384 0 0 0 16,11.140329 V 4.9328074 A 1.9023174,1.8273384 0 0 0 15.95117,4.5816234 Z M 13,11.954523 v 0.790654 l -2.999999,1.665671 v -0.74945 z"/>
</svg>
