<svg width="24" height="24" version="1.1" xmlns="http://www.w3.org/2000/svg">
 <defs>
  <style id="current-color-scheme" type="text/css">.ColorScheme-Text { color:#c6c6c6; } .ColorScheme-Highlight { color:#4285f4; } .ColorScheme-NeutralText { color:#ff9800; } .ColorScheme-PositiveText { color:#4caf50; } .ColorScheme-NegativeText { color:#f44336; }</style>
 </defs>
 <path d="m19.595563 5.0013008a2.9957488 2.9985693 0 0 0-1.878983 0.58789c-0.687796 0.511968-1.515486 1.105889-2.279391 1.689453-0.117053-0.145537-0.140649-0.269942-0.277355-0.416015-0.775207-0.828327-2.025432-1.621476-3.457173-1.804688-2.3588769-0.301685-4.5794589 0.713456-5.9553219 2.033203-1.375863 1.319748-2.182946 2.853545-2.810662 4.2128922-0.04341 0.09409-0.356621 0.73634-0.593774 1.527343-0.237153 0.791004-0.580265 1.823291-0.10352 3.361328 0.271454 0.874818 0.955363 1.724331 1.677803 2.166016s1.395672 0.565776 1.939533 0.611328c1.086847 0.09103 1.837819-0.104006 2.398535-0.238281 1.399784-0.333665 2.5286149-0.85091 3.6524939-1.417969 0.657188 0.70525 1.507437 1.333076 3.007936 1.578125 0.960878 0.183944 1.547409 0.101842 2.257905-0.01563 0.730148-0.120711 1.456599-0.274763 2.347752-0.796875a2.9957488 2.9985693 0 0 0 0.824253-0.714844l1.998128-2.498046a2.9957488 2.9985693 0 0 0 0.656277-1.875 2.9957488 2.9985693 0 0 0-1.6153-2.658204c0.0921-0.096 0.195858-0.173492 0.289074-0.271484a2.9957488 2.9985693 0 0 0-2.07821-5.0605422zm-8.820674 2.998046c0.171896 0.0015 0.347886 0.01393 0.529319 0.03711 1.803212 0.230521 2.491782 2.0949392 3.320448 3.6796882 1.953506-1.297192 3.625486-2.7874752 4.8752-3.7167972-1.521568 1.597949-2.675104 2.7459192-4.650582 4.1230472 0.386777 0.680359 0.819471 1.279552 1.421934 1.603515 1.018041 0.547001 1.776588 0.272438 3.728668-0.726562l-2.000082 2.5c-0.688218 0.40282-1.992081 0.578741-2.562605 0.462891-0.800032-0.118-1.675427-0.994328-2.318453-1.861329-0.137238-0.185337-0.261723-0.396318-0.388688-0.601561-0.479013 0.290576-0.99605 0.595096-1.564518 0.919922-1.147047 0.643-2.1550949 1.053297-3.6290549 1.404297-0.882136 0.211-2.180433 0.406234-2.464945-0.509766-0.296312-0.955 0.411311-2.427094 0.558617-2.746094 1.042449-2.25525 2.566314-4.5907792 5.1447419-4.5683612zm-1.6074879 1.503907c-0.382682-0.03666-0.778748 0.0541-1.166063 0.320312-0.510421 0.3514012-1.008073 0.9835572-1.394589 1.6601572-0.617225 1.079-0.260842 2.483063 1.355525 2.789063 1.562506-0.08227 3.0612669-0.58143 4.4611199-1.275391-0.500968-0.880756-0.964776-1.818149-1.537172-2.472656-0.477895-0.5465012-1.0810169-0.9603912-1.7188209-1.0214852z" style="fill:currentColor" class="ColorScheme-Text"/>
</svg>
