<svg xmlns="http://www.w3.org/2000/svg" width="22" height="22" version="1">
 <defs>
  <style id="current-color-scheme" type="text/css">
   .ColorScheme-Text { color:#a0a0a0; } .ColorScheme-Highlight { color:#4285f4; } .ColorScheme-NeutralText { color:#ff9800; } .ColorScheme-PositiveText { color:#4caf50; } .ColorScheme-NegativeText { color:#f44336; }
  </style>
 </defs>
 <path style="fill:currentColor" class="ColorScheme-Text" d="m5 4c-1.108 0-2 0.892-2 2v10c0 1.108 0.892 2 2 2h12c1.108 0 2-0.892 2-2v-10c0-1.108-0.892-2-2-2h-12zm9.0312 2c0.05517 0.00526 0.13563 0.03589 0.1875 0.0625l1.5625 0.78125c0.2075 0.10644 0.26963 0.36771 0.15625 0.5625l-4.875 8.375c-0.085 0.149-0.267 0.239-0.436 0.219-0.0517-0.0061-0.10762-0.0063-0.15625-0.03125-0.0052-0.0024-4.25-3.3125-4.25-3.3125-0.2075-0.106-0.2697-0.367-0.1563-0.562l1.0312-1.25c0.1134-0.195 0.3863-0.263 0.5938-0.156l2.3125 1.75 3.625-6.2192c0.085-0.1461 0.241-0.2346 0.406-0.2188z"/>
</svg>
