<svg xmlns="http://www.w3.org/2000/svg" width="16" height="16" version="1.1">
 <defs>
  <style id="current-color-scheme" type="text/css">
   .ColorScheme-Text { color:#a0a0a0; } .ColorScheme-Highlight { color:#4285f4; } .ColorScheme-NeutralText { color:#ff9800; } .ColorScheme-PositiveText { color:#4caf50; } .ColorScheme-NegativeText { color:#f44336; }
  </style>
 </defs>
 <circle style="fill:currentColor" class="ColorScheme-Highlight" cx="12.5" cy="5.5" r="1.5"/>
 <path style="fill:currentColor" class="ColorScheme-Text" d="m 4.382119,10.959642 c 0.3663,-0.08655 1.0491,-0.402245 1.9149,-0.885341 0.2942,-0.1641563 0.7419,-0.4141307 0.9949,-0.5554991 0.253,-0.1413694 0.5143,-0.2783216 0.5806,-0.3043381 0.1106,-0.043358 0.1277,-0.044917 0.2044,-0.018686 0.142,0.04853 0.3249,0.1447219 0.9961,0.5238789 1.6107,0.9098313 2.2198,1.1966023 2.6994,1.2708233 0.2242,0.03469 0.4773,-0.05586 0.8686,-0.310717 1.0814,-0.7043537 2.9334,-2.5586439 3.295,-3.2991519 0.1258,-0.2574865 0.079,-0.3059334 -0.257,-0.2680798 -0.3942,0.044365 -0.795,0.1477199 -2.1931,0.56552 -1.0602,0.3168503 -1.4339,0.4148611 -1.594,0.4180762 -0.2058,0.00417 -0.4765,-0.1427914 -1.8165,-0.986015 -1.3473,-0.8478122 -1.7845,-1.0866421 -2.0287,-1.1080865 -0.2631,-0.023112 -0.5749,0.1398912 -2.1,1.0976956 -1.3595,0.8538073 -1.6328,1.0015311 -1.8421,0.9957181 -0.1593,-0.00446 -0.461,-0.083412 -1.4931,-0.3909225 C 1.089219,7.250982 0.67061906,7.1438125 0.27411906,7.1061216 c -0.2565,-0.024391 -0.3183,0.026396 -0.2459,0.202255 0.1606,0.3900555 0.8656,1.2183354 1.76769994,2.0768475 0.8033,0.7643639 1.4772,1.2881319 1.9336,1.5028249 0.271,0.127458 0.3701,0.138331 0.6526,0.07159 z"/>
</svg>
