<svg xmlns="http://www.w3.org/2000/svg" width="24" height="24" version="1.1">
 <defs>
  <style id="current-color-scheme" type="text/css">
   .ColorScheme-Text { color:#a0a0a0; } .ColorScheme-Highlight { color:#4285f4; } .ColorScheme-NeutralText { color:#ff9800; } .ColorScheme-PositiveText { color:#4caf50; } .ColorScheme-NegativeText { color:#f44336; }
  </style>
 </defs>
 <path style="fill:currentColor" class="ColorScheme-Text" d="M 4.1425781,4.9998085 C 3.5093781,4.9998085 3,5.5342273 3,6.1990273 V 17.80059 c 0,0.665 0.5093781,1.199219 1.1425781,1.199219 H 16 v -1.996094 -2.384765 -0.002 c 5.94e-4,-0.85918 0.703969,-1.640686 1.615234,-1.617188 0.274901,0.007 0.54331,0.08844 0.773438,0.230469 L 20.3125,14.42559 21,14.851371 V 6.1990273 C 21,5.5344272 20.491422,4.9998085 19.857422,4.9998085 Z m 4.8574219,3 c 2.209,0 4,1.7909 4,4.0000005 0,2.209 -1.791,4 -4,4 -2.2091,0 -4,-1.791 -4,-4 C 5,9.7907085 6.7909,7.9998085 9,7.9998085 Z m 5,0 h 6 v 1 h -6 z m -5,2 c -1.1045264,0 -2,0.8954675 -2,2.0000005 0,1.104667 0.8954736,2 2,2 1.104526,0 2,-0.895333 2,-2 0,-1.104533 -0.895474,-2.0000005 -2,-2.0000005 z m 5,1.0000005 h 6 v 1 h -6 z m 3.589844,3 A 0.57611458,0.61782468 0 0 0 17,14.616997 v 2.382812 2.382812 a 0.57611458,0.61782468 0 0 0 0.863281,0.535157 l 1.923828,-1.191407 1.923829,-1.191406 a 0.57611458,0.61782468 0 0 0 0,-1.070312 L 19.787109,15.273247 17.863281,14.08184 a 0.57611458,0.61782468 0 0 0 -0.273437,-0.08203 z"/>
</svg>
