<svg xmlns="http://www.w3.org/2000/svg" width="16" height="16" version="1.1">
 <path style="fill:#a0a0a0" d="M 9,5 5,8 9,11 V 9 H 13 V 7 H 9 Z"/>
 <path style="fill:#a0a0a0" d="M 2,15 H 12 V 13 H 4 V 3 3 H 12 V 1 H 2 Z"/>
</svg>
