<svg xmlns="http://www.w3.org/2000/svg" width="16" height="16" version="1.1">
 <path style="fill:#c6c6c6;opacity:.35" d="M 4,1 V 15 H 15.199219 C 15.642419,15 16,14.653545 16,14.222656 V 13.445312 1.7773438 C 16,1.3464548 15.642419,1 15.199219,1 Z"/>
 <path style="fill:#c6c6c6" d="M 0.8007812,1 C 0.3575812,1 0,1.3464549 0,1.7773438 V 13.445312 14.222656 C 0,14.653545 0.3575812,15 0.8007812,15 H 4 V 1 Z M 1.25,2 h 1.5 C 2.8885,2 3,2.1115 3,2.25 v 1.5 C 3,3.8885 2.8885,4 2.75,4 H 1.25 C 1.1115,4 1,3.8885 1,3.75 V 2.25 C 1,2.1115 1.1115,2 1.25,2 Z m 0,3 h 1.5 C 2.8885,5 3,5.1115 3,5.25 v 1.5 C 3,6.8885 2.8885,7 2.75,7 H 1.25 C 1.1115,7 1,6.8885 1,6.75 V 5.25 C 1,5.1115 1.1115,5 1.25,5 Z m 0,3 h 1.5 C 2.8885,8 3,8.1115 3,8.25 v 1.5 C 3,9.8885 2.8885,10 2.75,10 H 1.25 C 1.1115,10 1,9.8885 1,9.75 V 8.25 C 1,8.1115 1.1115,8 1.25,8 Z m 0,3 h 1.5 C 2.8885,11 3,11.1115 3,11.25 v 1.5 C 3,12.8885 2.8885,13 2.75,13 H 1.25 C 1.1115,13 1,12.8885 1,12.75 v -1.5 C 1,11.1115 1.1115,11 1.25,11 Z"/>
</svg>
