<svg xmlns="http://www.w3.org/2000/svg" width="22" height="22" version="1.1">
 <defs>
  <style id="current-color-scheme" type="text/css">
   .ColorScheme-Text { color:#c6c6c6; } .ColorScheme-Highlight { color:#4285f4; } .ColorScheme-NeutralText { color:#ff9800; } .ColorScheme-PositiveText { color:#4caf50; } .ColorScheme-NegativeText { color:#f44336; }
  </style>
 </defs>
 <path style="fill:currentColor" class="ColorScheme-Text" d="M 10.544922,3.0004874 A 1.9023651,1.8191537 0 0 0 9.5488281,3.2426749 L 3.9511722,6.3344717 a 1.9023651,1.8191537 0 0 0 -0.951172,1.5761718 v 6.1796875 a 1.9023651,1.8191537 0 0 0 0.951172,1.576172 l 5.5976559,3.089843 a 1.9023651,1.8191537 0 0 0 1.9023439,0 l 5.597656,-3.089843 A 1.9023651,1.8191537 0 0 0 18,14.090331 V 7.9106435 A 1.9023651,1.8191537 0 0 0 17.048828,6.3344717 L 11.451172,3.2426749 A 1.9023651,1.8191537 0 0 0 10.544922,3.0004874 Z M 10.5,5.0004873 16,8.0395498 V 13.959471 L 10.5,17.000487 5.0000002,13.959471 V 8.0395498 Z m -1.4804688,3 c -1.115353,0 -2.019531,1.0295723 -2.019531,2.2988277 0,1.979326 3.1111108,3.534505 3.4999998,4.701172 C 10.888889,13.83382 14,12.278641 14,10.299315 14,9.0300596 13.095822,8.0004873 11.980469,8.0004873 11.395527,8.0004873 10.868919,8.3568457 10.5,8.8090811 10.131081,8.3568458 9.6044721,8.0004873 9.0195312,8.0004873 Z"/>
</svg>
