<svg xmlns="http://www.w3.org/2000/svg" width="22" height="22" version="1">
 <defs>
  <style id="current-color-scheme" type="text/css">
   .ColorScheme-Text { color:#c6c6c6; } .ColorScheme-Highlight { color:#4285f4; } .ColorScheme-NeutralText { color:#ff9800; } .ColorScheme-PositiveText { color:#4caf50; } .ColorScheme-NegativeText { color:#f44336; }
  </style>
 </defs>
 <circle style="fill:currentColor" class="ColorScheme-Text" cx="6" cy="17" r="2"/>
 <path style="fill:currentColor" class="ColorScheme-Text" d="M 18.687469,18.303647 C 18.988656,17.713495 20.719303,7.6225537 20.966707,5.0140234 21.234358,2.4291929 19.838794,2.9098641 18.554652,3.3465233 15.404153,4.4215289 5.4432767,8.2785986 2.7167917,9.7167145 c -0.671236,0.28127 -0.961371,0.7585015 -0.472969,1.1715565 0.420514,0.350114 1.95926,0.830984 3.200218,1.075015 1.057861,0.323857 1.87956,0.01365 2.638057,-0.418712 1.822812,-1.092109 7.2543803,-4.0650435 7.5468763,-4.2586459 0.292496,-0.1936024 0.612628,0.1656936 0.448928,0.3396304 -0.163701,0.173936 -4.010423,3.6599335 -5.27339,5.2360675 -0.669101,0.866629 -0.649059,1.329311 0.0383,1.8758 1.54204,1.221933 5.662057,4.007627 6.275101,4.176004 0.781724,0.214705 1.239555,0.03683 1.569559,-0.609783 z"/>
</svg>
