<svg xmlns="http://www.w3.org/2000/svg" width="22" height="22" version="1.1">
 <defs>
  <style id="current-color-scheme" type="text/css">
   .ColorScheme-Text { color:#a0a0a0; } .ColorScheme-Highlight { color:#4285f4; } .ColorScheme-NeutralText { color:#ff9800; } .ColorScheme-PositiveText { color:#4caf50; } .ColorScheme-NegativeText { color:#f44336; }
  </style>
 </defs>
 <path style="fill:currentColor" class="ColorScheme-Text" d="m 11,3 c -4.432,0 -8,3.568 -8,8 0,4.432 3.568,8 8,8 4.432,0 8,-3.568 8,-8 C 19,6.568 15.432,3 11,3 Z M 9,8 c 0.554,0 1,0.892 1,2 v 2 C 10,13.108 9.554,14 9,14 8.446,14 8,13.108 8,12 V 10 C 8,8.892 8.446,8 9,8 Z m 4,0 c 0.554,0 1,0.892 1,2 v 2 c 0,1.108 -0.446,2 -1,2 -0.554,0 -1,-0.892 -1,-2 v -2 c 0,-1.108 0.446,-2 1,-2 z"/>
</svg>
