<svg xmlns="http://www.w3.org/2000/svg" width="24" height="24" version="1.1">
 <defs>
  <style id="current-color-scheme" type="text/css">
   .ColorScheme-Text { color:#c6c6c6; } .ColorScheme-Highlight { color:#4285f4; } .ColorScheme-NeutralText { color:#ff9800; } .ColorScheme-PositiveText { color:#4caf50; } .ColorScheme-NegativeText { color:#f44336; }
  </style>
 </defs>
 <g transform="translate(4,-2.00044)">
  <path style="opacity:.35;fill:currentColor" class="ColorScheme-Text" d="M 8,6 C 6.3379,6 5,7.3381 5,9 l 0,5.002 C 5,15.6639 6.3379,17 8,17 c 1.6621,0 3,-1.336 3,-2.998 L 11,9 C 11,7.3381 9.6621,6 8,6 Z"/>
  <path style="fill:currentColor" class="ColorScheme-Text" d="m 2,13 0,0.99844 c 0,2.967 2,6.002 5,6.002 l 0,2 2,0 0,-2 c 3,0 5,-3.0351 5,-6.0015 l 0,-0.998 -2,0 0,0.99849 c 0,2.235 -1.767,4.002 -4,4.002 -2.2334,0 -4,-1.767 -4,-4.002 l 0,-0.998 -2,0 z"/>
 </g>
</svg>
