<svg xmlns="http://www.w3.org/2000/svg" width="16" height="16" version="1.1">
 <defs>
  <style id="current-color-scheme" type="text/css">
   .ColorScheme-Text { color:#c6c6c6; } .ColorScheme-Highlight { color:#4285f4; } .ColorScheme-NeutralText { color:#ff9800; } .ColorScheme-PositiveText { color:#4caf50; } .ColorScheme-NegativeText { color:#f44336; }
  </style>
 </defs>
 <path style="fill:currentColor" class="ColorScheme-Text" d="M 5.3339844 1 L 9.6777344 8.9960938 A 4.5 4.5 0 0 1 12.5 8 A 4.5 4.5 0 0 1 15.496094 9.1484375 L 10.666016 1 L 5.3339844 1 z M 4.8476562 1.9492188 L 0 10.625 L 2.6660156 15 L 7.4863281 6.8046875 L 4.8476562 1.9492188 z M 12.5 9 C 10.567037 9 9 10.567039 9 12.5 C 9 14.432964 10.567037 16 12.5 16 C 14.432963 16 16 14.432964 16 12.5 C 16 10.567039 14.432963 9 12.5 9 z M 12.5 10 A 2.5000001 2.5000001 0 0 1 15 12.5 L 14.166016 12.5 A 1.6666668 1.6666668 0 0 0 12.5 10.833984 L 12.5 10 z M 8.2617188 11.005859 L 6 11.007812 L 3.5546875 15 L 8.7617188 15 A 4.5 4.5 0 0 1 8 12.5 A 4.5 4.5 0 0 1 8.2617188 11.005859 z M 10 12.5 L 10.833984 12.5 A 1.6666668 1.6666668 0 0 0 12.5 14.166016 L 12.5 15 A 2.5000001 2.5000001 0 0 1 10 12.5 z"/>
</svg>
