<svg xmlns="http://www.w3.org/2000/svg" width="16" height="16" version="1.1">
 <defs>
  <style id="current-color-scheme" type="text/css">
   .ColorScheme-Text { color:#c6c6c6; } .ColorScheme-Highlight { color:#4285f4; } .ColorScheme-NeutralText { color:#ff9800; } .ColorScheme-PositiveText { color:#4caf50; } .ColorScheme-NegativeText { color:#f44336; }
  </style>
 </defs>
 <path style="fill:currentColor;opacity:0.35" class="ColorScheme-Text" d="M 1.8007812,2 C 1.3575812,2 1,2.3575812 1,2.8007812 V 12.199219 C 1,12.642419 1.3575812,13 1.8007812,13 H 5 v 0.199219 C 5,13.642419 5.3575812,14 5.8007812,14 h 4.3984378 c 0.02135,0 0.04157,-0.0042 0.0625,-0.0059 0.08022,-0.143644 0.176391,-0.279292 0.292969,-0.402344 0.0058,-0.0066 0.01163,-0.0131 0.01758,-0.01953 L 10.644531,13.5 10.572266,13.427734 C 10.182753,13.038222 10,12.518095 10,12 V 11 H 3 V 4 h 10 v 6.251953 c 0.153952,0.08478 0.297893,0.190475 0.427734,0.320313 0.0013,0.0019 0.0026,0.0039 0.0039,0.0059 l 0.06836,0.06836 0.06836,-0.06836 c 0.0013,-0.002 0.0026,-0.0039 0.0039,-0.0059 C 13.974873,10.169658 14.483087,10 15,10 V 2.8007812 C 15,2.3575813 14.64242,2 14.199219,2 Z"/>
 <path style="fill:currentColor" class="ColorScheme-Text" d="m 11,11 v 1 c 0,0.28 0.1,0.54 0.28,0.72 l 0.78,0.78 -0.78,0.78 C 11.1,14.47 11,14.73 11,15 v 1 h 1 c 0.28,0 0.54,-0.1 0.72,-0.28 l 0.78,-0.78 0.78,0.78 C 14.46,15.9 14.73,16 15,16 h 1 v -1 c 0,-0.27 -0.1,-0.53 -0.28,-0.72 L 14.94,13.5 15.72,12.72 C 15.9,12.54 16,12.28 16,12 v -1 h -1 c -0.27,0 -0.54,0.1 -0.72,0.28 L 13.5,12.07 12.72,11.28 C 12.54,11.1 12.28,11 12,11 Z"/>
</svg>
