<svg xmlns="http://www.w3.org/2000/svg" width="22" height="22" version="1.1">
 <defs>
  <style id="current-color-scheme" type="text/css">
   .ColorScheme-Text { color:#c6c6c6; } .ColorScheme-Highlight { color:#4285f4; } .ColorScheme-NeutralText { color:#ff9800; } .ColorScheme-PositiveText { color:#4caf50; } .ColorScheme-NegativeText { color:#f44336; }
  </style>
 </defs>
 <path style="fill:currentColor" class="ColorScheme-Text" d="M 19 3 A 2 2 0 0 0 17 5 A 2 2 0 0 0 19 7 A 2 2 0 0 0 21 5 A 2 2 0 0 0 19 3 z M 8.3574219 6 C 8.1519892 6.0006831 7.9806737 6.0492669 7.8085938 6.140625 C 7.6048416 6.2488745 6.850289 6.9282539 6.1289062 7.6484375 C 5.0325194 8.742694 4.7095997 8.995507 4.1679688 9.203125 C 3.315547 9.5309222 2.5978188 9.6111734 2.0078125 9.4414062 C 1.2069163 9.2109387 0.77479943 9.6417868 1.1191406 10.326172 C 1.4474692 10.978718 2.7590281 11.570225 4.4980469 11.849609 C 6.912448 12.237496 8.5118411 11.878433 10.208984 10.566406 C 10.534299 10.3149 10.895968 10.109375 11.011719 10.109375 C 11.127471 10.109375 11.522567 10.342147 11.888672 10.625 C 12.758194 11.296783 13.182006 11.509396 14.212891 11.800781 C 14.946537 12.008159 15.230121 12.032653 16.261719 11.970703 C 18.430743 11.84042 19.882351 11.399824 20.646484 10.640625 C 20.903987 10.385002 21 10.189052 21 9.9238281 C 21 9.3909791 20.700554 9.256896 19.935547 9.4453125 C 19.471792 9.5605224 19.213599 9.5617444 18.746094 9.4609375 C 17.602331 9.2149137 17.08642 8.8759541 15.753906 7.5019531 C 14.717644 6.4349389 14.28907 6.0218749 13.726562 6.0019531 C 13.38781 5.9899521 13.001803 6.1206391 12.404297 6.3359375 C 11.77054 6.5644377 11.11758 6.7500006 10.955078 6.75 C 10.791327 6.7498806 10.291099 6.601945 9.8398438 6.4179688 C 9.1379607 6.1312933 8.6998097 5.9988615 8.3574219 6 z M 10.5 13 A 0.50010719 0.57161703 0 0 0 10.009766 13.683594 L 10.509766 16.541016 A 0.50010719 0.57161703 0 0 0 11.490234 16.541016 L 11.990234 13.683594 A 0.50010719 0.57161703 0 0 0 11.5 13 L 10.5 13 z"/>
</svg>
