<svg xmlns="http://www.w3.org/2000/svg" width="48" height="48" version="1">
 <rect style="opacity:0.2" width="40" height="26" x="4" y="17" rx="2" ry="2"/>
 <path style="fill:#3b4b54" d="M 4,34 C 4,35.108 4.892,36 6,36 H 42 C 43.108,36 44,35.108 44,34 V 12 C 44,10.892 43.108,10 42,10 H 24 C 21,10 20,6 17,6 H 6 C 4.892,6 4,6.892 4,8"/>
 <rect style="opacity:0.2" width="40" height="26" x="4" y="15" rx="2" ry="2"/>
 <rect style="fill:#e4e4e4" width="36" height="16" x="6" y="13" rx="2" ry="2"/>
 <rect style="fill:#68767e" width="40" height="26" x="4" y="16" rx="2" ry="2"/>
 <path style="opacity:0.1;fill:#ffffff" d="M 6,6 C 4.892,6 4,6.892 4,8 V 9 C 4,7.892 4.892,7 6,7 H 17 C 20,7 21,11 24,11 H 42 C 43.108,11 44,11.892 44,13 V 12 C 44,10.892 43.108,10 42,10 H 24 C 21,10 20,6 17,6 Z"/>
 <path style="fill:#e5e5e5" d="M 28.779,22 C 25.819,22 25.262,26 26.929,26 28.593,26 31.741,22 28.779,22 Z M 24.23,23 C 24.183,23 24.131,23.005 24.079,23.01 22.384,23.214 22.979,25.949 23.882,26 24.755,26.05 25.711,23.008 24.231,23 Z M 21.14,24 C 21.019,23.995 20.884,24.011 20.735,24.049 19.149,24.45 20.494,26.106 21.382,25.994 22.188,25.893 22.305,24.047 21.14,24 Z M 18.929,26 C 18.787,25.998 18.633,26.029 18.47,26.105 17.166,26.721 18.91,28.207 19.677,27.977 20.348,27.775 19.92,26.023 18.929,26 Z M 25.011,27 C 22.677,26.963 19.599,28.065 19.073,30.279 18.505,32.676 21.416,36 24.45,36 25.943,36 27.665,35.329 27.987,33.721 28.232,32.495 24.896,33.023 25.009,33.834 25.144,34.807 24.446,34.652 23.571,34.025 21.001,32 28.181,31.034 27.694,28.307 27.543,27.458 26.411,27.024 25.011,27.002 Z"/>
</svg>
