<svg xmlns="http://www.w3.org/2000/svg" width="24" height="24" version="1.1">
 <defs>
  <style id="current-color-scheme" type="text/css">
   .ColorScheme-Text { color:#c6c6c6; } .ColorScheme-Highlight { color:#4285f4; } .ColorScheme-NeutralText { color:#ff9800; } .ColorScheme-PositiveText { color:#4caf50; } .ColorScheme-NegativeText { color:#f44336; }
  </style>
 </defs>
 <g transform="translate(4,4)">
  <path style="fill:currentColor" class="ColorScheme-Text" d="M 0,2.5 V 4.5 C 0,8.655 3.345,12 7.5,12 11.655,12 15,8.655 15,4.5 V 2.5 C 15,2 14.5,2 14.5,2 14.5,2 14,2 14,2.5 V 3.5 C 14,7.655 11.101,11 7.5,11 3.899,11 1,7.655 1,3.5 V 2.5 C 1,2 0.5,2 0.5,2 0.5,2 0,2 0,2.5 Z"/>
  <path style="fill:currentColor" class="ColorScheme-Text" d="M 11,10.5 A 3.5,3.5 0 0 1 7.5,14 3.5,3.5 0 0 1 4,10.5 3.5,3.5 0 0 1 7.5,7 3.5,3.5 0 0 1 11,10.5 Z"/>
 </g>
</svg>
