<svg xmlns="http://www.w3.org/2000/svg" width="22" height="22" version="1.1">
 <defs>
  <style id="current-color-scheme" type="text/css">
   .ColorScheme-Text { color:#c6c6c6; } .ColorScheme-Highlight { color:#4285f4; } .ColorScheme-NeutralText { color:#ff9800; } .ColorScheme-PositiveText { color:#4caf50; } .ColorScheme-NegativeText { color:#f44336; }
  </style>
 </defs>
 <path style="fill:currentColor" class="ColorScheme-Text" d="M 7.5,3 C 6.132132,3 5,4.1321324 5,5.5 V 8.050781 C 3.866938,8.28618 3,9.303116 3,10.5 v 6 C 3,17.867868 4.132132,19 5.5,19 h 6 c 0.338022,0 0.661266,-0.07055 0.957031,-0.195312 C 11.91982,18.308688 11.51156,17.689262 11.267578,17 H 5.5 C 5.205537,17 5,16.794463 5,16.5 v -6 C 5,10.205537 5.205537,10 5.5,10 h 2.5 2 1.5 c 0.294463,0 0.5,0.205537 0.5,0.5 v 2.185547 c 0.522581,-0.648651 1.214946,-1.139527 2,-1.417969 V 10.5 C 14,9.132132 12.867868,8 11.5,8 h 5 A 2.5,2.5 0 0 1 14,5.5 V 6 H 10.5 C 9.3031158,6 8.2861799,6.8669384 8.0507812,8 H 7 V 5.5 C 7,5.2055368 7.2055368,5 7.5,5 h 6 C 13.794463,5 14,5.2055368 14,5.5 A 2.5,2.5 0 0 1 14.998047,3.5097656 C 14.578517,3.1916146 14.060152,3 13.5,3 Z m 9,5 C 16.794463,8 17,8.205537 17,8.5 v 2.757813 c 0.784592,0.277359 1.476907,0.766848 2,1.414062 V 8.5 C 19,7.939848 18.808385,7.421483 18.490234,7.001953 A 2.5,2.5 0 0 1 16.5,8 Z m 0,-4 A 1.5,1.5 0 0 0 15,5.5 1.5,1.5 0 0 0 16.5,7 1.5,1.5 0 0 0 18,5.5 1.5,1.5 0 0 0 16.5,4 Z m -1,8 C 13.567003,12 12,13.567003 12,15.5 12,17.432997 13.567003,19 15.5,19 17.432997,19 19,17.432997 19,15.5 19,13.567003 17.432997,12 15.5,12 Z m 0,1 c 1.380712,0 2.5,1.119288 2.5,2.5 0,1.380712 -1.119288,2.5 -2.5,2.5 -0.168147,-0.002 -0.335662,-0.02099 -0.5,-0.05664 v -1.029297 c 0.160578,0.05683 0.329663,0.08589 0.5,0.08594 0.828427,0 1.5,-0.671573 1.5,-1.5 0,-0.828427 -0.671573,-1.5 -1.5,-1.5 -0.653033,0 -1.20809,0.41751 -1.414062,1 H 15 l -2,2 V 15.5 15 h 0.05078 C 13.282446,13.858918 14.290548,13 15.5,13 Z"/>
</svg>
