<svg xmlns="http://www.w3.org/2000/svg" width="16" height="16" version="1.1">
 <path style="fill:#c6c6c6" d="M 1,2 3,6 V 14 C 3,15 4,15 4,15 H 12 C 12,15 13,15 13,14 V 11 C 14.657,11 16,9.6569 16,8 16,6.3431 14.657,5 13,5 V 2 Z M 13,7 C 13.552,7 14,7.4477 14,8 14,8.5523 13.552,9 13,9 Z"/>
</svg>
