<svg xmlns="http://www.w3.org/2000/svg" width="16" height="16" version="1.1">
 <defs>
  <style id="current-color-scheme" type="text/css">
   .ColorScheme-Text { color:#c6c6c6; } .ColorScheme-Highlight { color:#4285f4; } .ColorScheme-NeutralText { color:#ff9800; } .ColorScheme-PositiveText { color:#4caf50; } .ColorScheme-NegativeText { color:#f44336; }
  </style>
 </defs>
 <path style="fill:currentColor" class="ColorScheme-Text" d="M 13,6.2 V 3 L 7,10 5,8 C 5,8 4,7 3.285,7.7845 2.535,8.5345 3.5,9.5 3.5,9.5 L 7,13 Z M 10.8,10 C 10,10 10,10.8 10,10.8 V 16 H 16 V 10.8 C 16,10 15.2,10 15.2,10 Z M 3,1 C 1,1 1,3 1,3 V 15 H 9 V 13 H 3 V 3 H 13 V 9 H 15 V 3 C 15,3 15,1 13,1 Z"/>
</svg>
