<svg xmlns="http://www.w3.org/2000/svg" width="16" height="16" version="1.1">
 <defs>
  <style id="current-color-scheme" type="text/css">
   .ColorScheme-Text { color:#e4e4e4; } .ColorScheme-Highlight { color:#4285f4; } .ColorScheme-NeutralText { color:#ff9800; } .ColorScheme-PositiveText { color:#4caf50; } .ColorScheme-NegativeText { color:#f44336; }
  </style>
 </defs>
 <path style="fill:currentColor" class="ColorScheme-Text" d="M 2,0 C 0.892,0 0,0.892 0,2 v 12 c 0,1.108 0.892,2 2,2 h 12 c 1.108,0 2,-0.892 2,-2 V 2 C 16,0.892 15.108,0 14,0 Z M 7,1.9746094 8,2.0253906 7.9023438,4 H 13 V 5 H 7.8535156 L 7.7460938,7.1621094 C 8.3196615,7.0788872 8.9214259,7.0484853 9.5214844,7.0585938 9.6739281,6.7331788 10.177734,5.8183594 10.177734,5.8183594 L 11.09375,6.21875 c 0,0 -0.383355,0.7035258 -0.457031,0.8652344 0.03436,0.00522 0.0713,-0.00373 0.105469,0.00195 0.767071,0.1274745 1.488384,0.3711074 2.076171,0.7871094 0.587787,0.4160019 1.036818,1.0271802 1.173829,1.7929687 0.21112,1.1800224 -0.375908,2.3192284 -1.31836,3.0996094 C 11.731376,13.546006 10.407364,14.109059 9,13.969071 l 0.099609,-0.994141 c 1.1269396,0.112093 2.2023816,-0.370133 2.9374996,-0.978836 0.735119,-0.608702 1.104994,-1.403708 0.970703,-2.1542971 C 12.918805,9.3443082 12.661039,8.9858929 12.242188,8.6894531 11.823334,8.3930133 11.23814,8.1819492 10.578125,8.0722656 10.432963,8.0481476 10.26828,8.0787551 10.117188,8.0644531 9.7093851,8.9035813 9.5643491,9.332463 8.8242188,10.503906 8.1742671,11.532619 7.4491305,12.521384 6.6679688,13.195312 6.2773879,13.532276 5.8685042,13.796295 5.4199219,13.921875 4.9713396,14.047455 4.4654949,14.007518 4.0371094,13.748047 3.4882724,13.415619 3.1383322,12.887561 3.0117188,12.3125 2.885105,11.737439 2.9622618,11.12104 3.1875,10.523438 3.6379764,9.3282301 4.6906974,8.1807723 6.1894531,7.5664062 6.3627595,7.4953651 6.545611,7.4356032 6.7324219,7.3808594 L 6.8496094,5 H 4 V 4 h 2.9003906 z m 1.6113281,6.0527344 c -0.042935,-7.007e-4 -0.085526,0.00111 -0.1289062,0.00586 -0.2684146,0.029386 -0.5314194,0.072446 -0.7851563,0.125 L 7.5761719,10.582031 C 7.7133902,10.382009 7.8490517,10.176751 7.9804688,9.96875 8.5583321,9.0541352 8.6142041,8.8086824 9,8.0429688 8.8682744,8.0494058 8.7401338,8.0294338 8.6113281,8.0273438 Z M 6.6796875,8.4492188 C 6.6425576,8.4634265 6.6043508,8.477434 6.5683594,8.4921875 5.326439,9.0012722 4.4642222,9.9697917 4.1230469,10.875 c -0.1705877,0.452604 -0.2097448,0.882112 -0.1347657,1.222656 0.074979,0.340544 0.2447437,0.598918 0.5683594,0.794922 0.1956482,0.11851 0.3544183,0.133406 0.59375,0.06641 0.2393318,-0.067 0.5426061,-0.24483 0.8632813,-0.521484 0.1609226,-0.138832 0.3257683,-0.301245 0.4921875,-0.482422 z"/>
</svg>
