<svg xmlns="http://www.w3.org/2000/svg" width="24" height="24" version="1.1">
 <defs>
  <style id="current-color-scheme" type="text/css">
   .ColorScheme-Text { color:#e4e4e4; } .ColorScheme-Highlight { color:#4285f4; } .ColorScheme-NeutralText { color:#ff9800; } .ColorScheme-PositiveText { color:#4caf50; } .ColorScheme-NegativeText { color:#f44336; }
  </style>
 </defs>
 <path style="fill:currentColor" class="ColorScheme-Text" d="m 12.000244,4 v 2 a 6,6 0 0 1 5.189453,3.003906 L 18.924072,8.0039062 A 8.0053718,7.9999998 0 0 0 18.87915,7.9277344 8.0053718,7.9999998 0 0 0 12.000244,4 Z M 5.0764162,8.0058594 A 8.0053718,7.9999998 0 0 0 5.0314943,8.0820312 8.0053718,7.9999998 0 0 0 5.0666505,16 L 6.8088381,14.994141 A 6,6 0 0 1 6.0002443,12 6,6 0 0 1 6.8068849,9.003906 Z M 10.000244,8.625 V 12 15.375 l 2.4375,-1.6875 2.4375,-1.6875 -2.4375,-1.6875 z m 7.191406,6.371094 A 6,6 0 0 1 12.000244,18 v 2 a 8.0053718,7.9999998 0 0 0 6.878906,-3.927734 8.0053718,7.9999998 0 0 0 0.04492,-0.07617 z"/>
 <path style="opacity:.35;fill:currentColor" class="ColorScheme-Text" d="M 12.000244,4 A 8.0053718,7.9999998 0 0 0 5.1213381,7.9277344 8.0053718,7.9999998 0 0 0 5.0764161,8.0039064 L 6.808838,9.003906 A 6,6 0 0 1 12.000244,6 Z M 18.933838,8 17.19165,9.005859 A 6,6 0 0 1 18.000244,12 6,6 0 0 1 17.193603,14.996094 l 1.730469,0.998047 a 8.0053718,7.9999998 0 0 0 0.04492,-0.07617 A 8.0053718,7.9999998 0 0 0 18.933838,8 Z m -12.1230468,6.996094 -1.734375,1 a 8.0053718,7.9999998 0 0 0 0.044922,0.07617 A 8.0053718,7.9999998 0 0 0 12.000244,20 V 18 A 6,6 0 0 1 6.8107912,14.996094 Z"/>
</svg>
