<svg xmlns="http://www.w3.org/2000/svg" width="32" height="32" version="1">
 <rect style="opacity:0.2" width="28" height="18" x="2" y="11" rx="1.4" ry="1.4"/>
 <path style="fill:#9f866f" d="M 2,22.6 C 2,23.376 2.6244,24 3.4,24 H 28.6 C 29.376,24 30,23.376 30,22.6 V 7.4 C 30,6.6244 29.376,6 28.6,6 H 16 C 13.9,6 13.2,3 11.1,3 H 3.4 C 2.6244,3 2,3.6244 2,4.4"/>
 <rect style="opacity:0.2" width="28" height="18" x="2" y="9" rx="1.4" ry="1.4"/>
 <rect style="fill:#e4e4e4" width="24" height="11" x="4" y="8" rx="1.4" ry="1.4"/>
 <rect style="fill:#ded4ca" width="28" height="18" x="2" y="10" rx="1.4" ry="1.4"/>
 <path style="opacity:0.1;fill:#ffffff" d="M 3.4004,3 C 2.6248,3 2,3.6248 2,4.4004 V 5.4004 C 2,4.6248 2.6248,4 3.4004,4 H 11.1 C 13.2,4 13.9,7 16,7 H 28.6 C 29.375,7 30,7.6248 30,8.4004 V 7.4004 C 30,6.6248 29.375,6 28.6,6 H 16 C 13.9,6 13.2,3 11.1,3 Z"/>
 <path style="fill:#9f866f" d="M 17,14 C 16.781,14.081 16.556,14.187 16.375,14.337 15.512,15.031 16.156,16.288 17,17 V 19 C 17.631,19.437 17.777,19.58 18.15,20 18.34,20.214 18.869,20.756 19,21 V 17 C 19.862,16.3 20.462,15.094 19.625,14.375 19.444,14.225 19.219,14.088 19,14 V 15.406 C 19,15.694 18.601,15.981 18.211,15.981 H 17.784 C 17.434,15.981 17,15.694 17,15.406 Z M 15,19 C 12.5,19 11,21.125 11,23 L 10.156,23.005 C 10,23.006 10,23.161 10,23.161 L 9.9963,23.844 C 9.9954,24 10.153,24 10.153,24 H 19.865 C 19.865,24 20.026,24 20.021,23.844 L 20,23.165 C 20,23.165 20,23.01 19.844,23.009 L 19.009,23 C 19.009,21.125 17.5,19 15,19 Z M 15,21 C 17,21 17,22.225 17,23 H 13 C 13,22.25 13,21 15,21 Z"/>
</svg>
