<svg xmlns="http://www.w3.org/2000/svg" width="16" height="16" version="1.1">
 <path style="fill:#c6c6c6" d="M 3.0019531 3 L 2.0019531 4 L 2 5 L 3 5 L 3 7 L 5 7 L 5 3 L 3.0019531 3 z M 7.5 4 C 7.223 4 7 4.223 7 4.5 L 7 5.5 A 0.499 0.499 0 0 0 7.5 6 L 14.5 6 C 14.777 6 15 5.777 15 5.5 L 15 4.5 C 15 4.223 14.777 4 14.5 4 L 7.5 4 z M 3.9453125 9 C 3.2088109 9.0046667 2.6465529 9.2257482 2.0195312 9.7480469 L 2.515625 10.675781 C 3.4113702 10.127459 4.3461746 9.7012314 4.3730469 10.394531 C 4.3929524 10.892667 2.5165464 11.141441 2 12.099609 L 2 13 L 6 13 L 6 12 L 4.0097656 12 C 5.5026743 11.535321 5.7772912 10.863494 5.8320312 10.40625 C 5.7971312 9.3766551 4.9415802 8.993494 3.9453125 9 z M 7.5 10 C 7.223 10 7 10.223 7 10.5 L 7 11.5 A 0.499 0.499 0 0 0 7.5 12 L 14.5 12 C 14.777 12 15 11.777 15 11.5 L 15 10.5 C 15 10.223 14.777 10 14.5 10 L 7.5 10 z"/>
</svg>
