<svg xmlns="http://www.w3.org/2000/svg" width="24" height="24" version="1.1">
 <defs>
  <style id="current-color-scheme" type="text/css">
   .ColorScheme-Text { color:#c6c6c6; } .ColorScheme-Highlight { color:#4285f4; } .ColorScheme-NeutralText { color:#ff9800; } .ColorScheme-PositiveText { color:#4caf50; } .ColorScheme-NegativeText { color:#f44336; }
  </style>
 </defs>
 <path style="fill:currentColor" class="ColorScheme-Text" d="M 12,4 A 8,8 0 0 0 4,12 8,8 0 0 0 12,20 8,8 0 0 0 20,12 8,8 0 0 0 12,4 Z M 12,6 A 6,6 0 0 1 17.959,11.363 C 17.793,11.099 17.603,10.846 17.367,10.613 16.71,9.9625 15.909,9.5761 14.963,9.4492 14.822,9.4303 14.704,9.3958 14.512,9.4668 14.319,9.5372 14.225,9.6908 14.168,9.7871 14.086,9.926 13.618,10.405 13.355,10.572 12.612,11.047 11.34,11.048 10.594,10.572 9.7111,10.01 9.2064,8.9074 9.3652,7.9355 9.4551,7.3855 9.6909,6.9083 10.078,6.498 10.159,6.4128 10.218,6.3461 10.268,6.291 10.279,6.2778 10.289,6.2611 10.299,6.25 A 6,6 0 0 1 12,6 Z M 8.2637,7.3047 C 8.0271,7.8241 7.8699,8.4921 7.8711,9.041 7.8723,9.5536 7.997,10.16 8.1914,10.646 8.2428,10.775 8.3046,10.947 8.4902,11.062 8.6758,11.178 8.8098,11.172 8.9961,11.193 9.158,11.212 9.4927,11.287 9.6406,11.338 11.13,11.85 11.83,13.556 11.131,14.984 10.662,15.942 9.5331,16.577 8.541,16.465 8.4126,16.45 8.3179,16.443 8.2305,16.443 8.1868,16.444 8.1556,16.437 8.0625,16.465 8.0515,16.468 8.0334,16.477 8.0195,16.482 A 6,6 0 0 1 6,12 6,6 0 0 1 8.2637,7.3047 Z M 8.7207,8.8301 8.7227,8.832 C 8.8277,9.4631 9.0808,9.9982 9.5059,10.49 9.36,10.457 9.2182,10.411 9.0879,10.396 8.9418,10.38 8.9347,10.376 8.9473,10.387 8.9425,10.375 8.9444,10.379 8.9316,10.35 8.7852,9.9829 8.6729,9.4118 8.6719,9.0371 8.6718,8.9817 8.7146,8.8967 8.7207,8.8301 Z M 14.822,10.229 C 14.832,10.229 14.797,10.236 14.855,10.244 15.182,10.288 15.381,10.516 15.65,10.625 15.312,10.574 15.006,10.379 14.66,10.438 14.591,10.448 14.571,10.53 14.504,10.545 14.606,10.431 14.75,10.345 14.822,10.229 Z M 15.238,11.193 C 16.277,11.218 17.301,11.912 17.676,12.91 17.706,12.99 17.727,13.05 17.746,13.098 17.756,13.122 17.766,13.142 17.777,13.166 17.784,13.179 17.788,13.19 17.799,13.209 17.804,13.219 17.812,13.231 17.822,13.246 17.829,13.256 17.843,13.269 17.857,13.285 A 6,6 0 0 1 12,18 6,6 0 0 1 9.4785,17.436 C 9.8427,17.436 10.204,17.41 10.504,17.318 L 10.535,17.309 10.557,17.297 10.562,17.293 C 11.372,17.028 12.223,16.434 12.693,15.773 L 12.945,15.424 12.713,14.727 C 12.174,13.096 13.124,11.507 14.795,11.225 14.942,11.2 15.089,11.19 15.238,11.193 Z M 13.248,11.396 C 12.669,11.867 12.208,12.452 11.973,13.113 11.75,12.475 11.329,11.887 10.785,11.418 11.592,11.72 12.451,11.719 13.248,11.396 Z M 11.969,15.021 12.057,15.291 12.041,15.312 C 11.95,15.442 11.701,15.522 11.545,15.66 11.629,15.534 11.782,15.475 11.85,15.338 11.901,15.233 11.931,15.127 11.969,15.021 Z"/>
</svg>
