<svg xmlns="http://www.w3.org/2000/svg" width="22" height="22" version="1.1">
 <defs>
  <style id="current-color-scheme" type="text/css">
   .ColorScheme-Text { color:#c6c6c6; } .ColorScheme-Highlight { color:#4285f4; } .ColorScheme-NeutralText { color:#ff9800; } .ColorScheme-PositiveText { color:#4caf50; } .ColorScheme-NegativeText { color:#f44336; }
  </style>
 </defs>
 <path style="fill:currentColor" class="ColorScheme-Text" d="M 9.203125,4 7.2792969,4.6210938 C 3.2136867,5.9333798 3.08235,5.9800563 3.03125,6.1347656 2.99261,6.2516853 3.1540525,6.4436189 3.8515625,7.115234 4.3288925,7.574842 4.71875,7.985193 4.71875,8.027344 c 0,0.04215 -0.386475,0.438281 -0.859375,0.880859 C 3.386485,9.35078 3,9.755735 3,9.808594 c 0,0.05286 0.054294,0.141109 0.1210938,0.195312 0.06676,0.0542 1.437935,0.524771 3.046875,1.044922 1.6089399,0.520151 2.9568406,0.948099 2.9941406,0.951172 0.03731,0.0031 0.466135,-0.372055 0.9531246,-0.833984 L 11,10.324219 l 0.894531,0.849609 c 0.492001,0.46669 0.937335,0.833142 0.990235,0.814453 0.05286,-0.01869 1.391439,-0.446554 2.974609,-0.951172 C 18.589975,10.166765 19,10.007551 19,9.820313 19,9.776423 18.613515,9.370838 18.140625,8.917969 17.667725,8.465099 17.28125,8.062976 17.28125,8.023438 c 0,-0.03954 0.389857,-0.448596 0.867188,-0.908204 C 18.844758,6.444756 19.00725,6.2511705 18.96875,6.1347656 18.93023,6.0182254 18.491018,5.8486278 16.736328,5.2734375 15.534898,4.8796107 14.155575,4.4315708 13.671875,4.2792969 L 12.792969,4.0039062 11.896484,4.8632812 11,5.7207031 10.101563,4.859375 Z m 1.810547,2 2.230469,0.7421875 C 14.470329,7.149746 15.485322,7.493346 15.5,7.507813 c 0.01472,0.01446 -0.968035,0.352439 -2.183594,0.75 C 12.100847,8.655373 11.074586,8.98939 11.035156,9 10.946043,9.023961 6.4594194,7.545799 6.5,7.505859 6.516204,7.489935 7.5402554,7.144377 8.7734375,6.7382812 Z M 11,11.705078 10.802734,11.890625 c -0.251564,0.238619 -0.48648,0.455024 -0.673828,0.619141 -0.09367,0.08206 -0.1735928,0.150428 -0.2499998,0.210937 -0.038203,0.03025 -0.072915,0.05625 -0.1289062,0.09375 -0.027996,0.01875 -0.057715,0.04106 -0.1230469,0.07422 -0.032666,0.01658 -0.073706,0.03653 -0.1464843,0.06055 -0.036389,0.01201 -0.081993,0.02422 -0.1445313,0.03516 -0.062065,0.01086 -0.2523894,0.01176 -0.2558594,0.01172 -0.00117,-9.6e-5 -0.1465876,-0.02252 -0.1660156,-0.02734 -0.019429,-0.0048 -0.0314,-0.0085 -0.042969,-0.01172 -0.023138,-0.0064 -0.043308,-0.01205 -0.068359,-0.01953 C 8.7526315,12.922553 8.687673,12.903833 8.607422,12.878923 8.4469196,12.829079 8.2237471,12.758428 7.9511719,12.671875 7.4060215,12.498769 6.6672235,12.260537 5.8613281,12 5.5337971,11.894113 5.3032741,11.813723 5.0039062,11.714844 c 0.0052,1.84717 0.037212,4.332653 0.076172,4.392578 0.039418,0.06062 1.3630086,0.533822 2.9394531,1.052734 h 0.00195 c 1.576504,0.518882 2.9804687,0.955078 2.9804687,0.955078 v -0.01367 c 0,0 1.456642,-0.447606 3,-0.949218 C 14.164576,17.099489 14.308677,17.051574 14.464844,17 L 14.167969,16.554688 C 13.725127,15.890134 14.201413,15.000171 15,15 v -2 c 0.0028,-0.288748 0.130263,-0.562195 0.349609,-0.75 -0.437021,0.139794 -0.92,0.294204 -1.246093,0.398438 -0.269359,0.0861 -0.491501,0.156652 -0.648438,0.207031 -0.156938,0.05038 -0.343607,0.114102 -0.236328,0.07617 -8.27e-4,2.92e-4 -0.16714,0.04577 -0.234375,0.05273 -0.06724,0.0069 -0.123587,0.0051 -0.171875,0.002 -0.09659,-0.0064 -0.161218,-0.02062 -0.212891,-0.03516 -0.103347,-0.02907 -0.156516,-0.05767 -0.201172,-0.08008 -0.08931,-0.04481 -0.137683,-0.07718 -0.1875,-0.111328 -0.09963,-0.06832 -0.187976,-0.137987 -0.291015,-0.222692 -0.206079,-0.169409 -0.452308,-0.389541 -0.712891,-0.636718 z"/>
 <path style="fill:currentColor" class="ColorScheme-PositiveText" d="m 16,13 v 3 h -1 l 1,1.5 1,1.5 1,-1.5 1,-1.5 h -1 v -3 z"/>
</svg>
