<svg xmlns="http://www.w3.org/2000/svg" width="24" height="24" version="1.1">
 <defs>
  <style id="current-color-scheme" type="text/css">
   .ColorScheme-Text { color:#c6c6c6; } .ColorScheme-Highlight { color:#4285f4; } .ColorScheme-NeutralText { color:#ff9800; } .ColorScheme-PositiveText { color:#4caf50; } .ColorScheme-NegativeText { color:#f44336; }
  </style>
 </defs>
 <path style="fill:currentColor" class="ColorScheme-PositiveText" d="m 15.766684,4.0052592 c -0.265312,0.01593 -0.534044,0.05939 -0.800781,0.1308601 -2.1339,0.5718 -3.399824,2.7645374 -2.828125,4.8984374 0.57174,2.1338003 2.764537,3.3999253 4.898437,2.8281253 2.1339,-0.5718 3.399825,-2.7645373 2.828125,-4.8984373 -0.500272,-1.867075 -2.24047,-3.0704765 -4.097656,-2.9589855 z m 1.710937,1.9882825 a 0.50005,0.50005 0 0 1 0.470704,0.728515 l -1.5,3 a 0.50005,0.50005 0 0 1 -0.72461,0.19336 l -1.5,-1.0000003 a 0.50005,0.50005 0 1 1 0.554688,-0.832032 l 1.029297,0.685547 1.246093,-2.4921867 a 0.50005,0.50005 0 0 1 0.423828,-0.283203 z"/>
 <path style="fill:currentColor" class="ColorScheme-Text" d="M 5.7322549,5.0005401 C 5.6904739,4.9995574 5.6500319,5.0007758 5.609208,5.0024901 4.3844909,5.0544581 3.5722126,6.3213842 4.2400674,7.3716308 l 0.064453,0.064453 6.7070316,0.7363286 a 5,5 0 0 1 -0.01172,-0.171872 5,5 0 0 1 0.611329,-2.3691409 L 5.859208,5.0083526 c -0.0425,-0.00389 -0.085172,-0.00683 -0.1269531,-0.00781 z m -0.84375,3.5058593 4.6601562,8.1328136 c 0.5841929,-0.09439 0.6931499,-0.245292 1.0546879,-0.748047 L 13.12288,12.076713 A 5,5 0 0 1 11.156083,9.1958527 Z m 9.1054691,4.0683606 -2.566406,3.884765 -0.582032,0.808594 c -0.259047,0.311185 -0.778371,0.310925 -0.9726561,-0.0625 l 0.5839841,0.996094 c 0.129524,0.18671 0.259149,0.311073 0.388672,0.435547 0.712379,0.560131 1.878083,0.498269 2.460938,-0.373047 l 3.666015,-5.371094 a 5,5 0 0 1 -0.972656,0.107422 5,5 0 0 1 -2.005859,-0.425781 z"/>
</svg>
