<svg xmlns="http://www.w3.org/2000/svg" width="24" height="24" version="1.1">
 <defs>
  <style id="current-color-scheme" type="text/css">
   .ColorScheme-Text { color:#c6c6c6; } .ColorScheme-Highlight { color:#4285f4; } .ColorScheme-NeutralText { color:#ff9800; } .ColorScheme-PositiveText { color:#4caf50; } .ColorScheme-NegativeText { color:#f44336; }
  </style>
 </defs>
 <path style="fill:currentColor" class="ColorScheme-Text" d="m 12,4 a 8,8 0 0 0 -8,8 8,8 0 0 0 8,8 8,8 0 0 0 4.121094,-1.158203 A 3,3 0 0 1 16,18 3,3 0 0 1 19,15 3,3 0 0 1 19.388672,15.025391 8,8 0 0 0 20,12 8,8 0 0 0 12,4 Z M 8.8671875,9 c 0.1902232,4.13e-4 0.4554285,0.01359 0.9257813,0.03906 1.8287582,0.09904 2.2082652,0.102371 3.2656252,0.0332 1.303588,-0.08528 2.548226,-0.086023 2.910156,-0.002 0.738419,0.171674 1.410256,0.745778 1.785156,1.527344 0.204715,0.426771 0.267705,0.767508 0.240235,1.285156 -0.02298,0.432933 -0.105614,0.836531 -0.238282,1.160156 -0.209679,0.511488 -0.711737,1.093947 -1.130859,1.3125 -0.475199,0.247798 -1.277477,0.450804 -2.269531,0.572265 -0.532586,0.06521 -3.327664,0.09821 -4.132813,0.04883 C 9.4220373,14.927514 8.4006163,14.76279 7.9082031,14.603516 7.1783127,14.367429 6.7043275,13.952002 6.3398438,13.234375 6.1062383,12.774432 6.0314175,12.469821 6.0078125,11.865234 5.9910385,11.435598 5.998483,11.340644 6.0625,11.089844 6.1929047,10.578942 6.4301685,10.169536 6.8398438,9.748047 7.2379331,9.338478 7.6707852,9.139272 8.3945312,9.035156 8.5619337,9.011076 8.6769638,8.9996 8.8671875,9 Z M 9.5,10 A 1.4988496,2 0 0 0 8,12 1.4988496,2 0 0 0 9.5,14 1.4988496,2 0 0 0 11,12 1.4988496,2 0 0 0 9.5,10 Z m 5,0 a 1.4988497,2 0 0 0 -1.5,2 1.4988497,2 0 0 0 1.5,2 1.4988497,2 0 0 0 1.5,-2 1.4988497,2 0 0 0 -1.5,-2 z"/>
 <circle style="fill:currentColor" class="ColorScheme-Highlight" cx="19" cy="18" r="2"/>
</svg>
