<svg xmlns="http://www.w3.org/2000/svg" width="22" height="22" version="1.1">
 <defs>
  <style id="current-color-scheme" type="text/css">
   .ColorScheme-Text { color:#e4e4e4; } .ColorScheme-Highlight { color:#4285f4; } .ColorScheme-NeutralText { color:#ff9800; } .ColorScheme-PositiveText { color:#4caf50; } .ColorScheme-NegativeText { color:#f44336; }
  </style>
 </defs>
 <path style="fill:currentColor" class="ColorScheme-Text" d="M 12.363281 3 A 0.99995354 0.99995354 0 0 0 11.542969 3.4863281 L 9.6386719 6.6601562 L 4.4414062 4.1035156 A 0.99995354 0.99995354 0 0 0 3.0214844 5.2011719 L 3.9882812 9.9003906 A 0.99995354 0.99995354 0 0 0 4 10.027344 L 4 13.173828 A 3 3 0 0 1 5 13 A 3 3 0 0 1 6 13.175781 L 6 11.373047 L 10 13.066406 L 10 16.441406 L 7.9589844 15.513672 A 3 3 0 0 1 8 16 A 3 3 0 0 1 7.5742188 17.535156 L 10.464844 18.851562 A 0.99995354 0.99995354 0 0 0 11.171875 18.980469 A 0.99995354 0.99995354 0 0 0 11.257812 18.962891 L 11.269531 18.958984 L 17.257812 17.363281 A 0.99995354 0.99995354 0 0 0 18 16.396484 L 18 11.113281 L 19.910156 6.9140625 A 0.99995354 0.99995354 0 0 0 19.353516 5.5644531 L 12.753906 3.0644531 A 0.99995354 0.99995354 0 0 0 12.363281 3 z M 12.828125 5.2304688 L 17.648438 7.0566406 L 16.490234 9.6035156 L 11.6875 7.6152344 A 0.99995354 0.99995354 0 0 0 11.482422 7.4707031 L 12.828125 5.2304688 z M 5.3886719 6.796875 L 7.9960938 8.0800781 L 5.7675781 8.640625 L 5.3886719 6.796875 z M 11.466797 9.6894531 L 13.822266 10.664062 L 11.771484 11.179688 L 11.466797 9.6894531 z M 9.4433594 9.7792969 L 9.6386719 10.742188 L 8.1386719 10.107422 L 9.4433594 9.7792969 z M 16 12.179688 L 16 15.628906 L 12 16.693359 L 12 13.183594 L 16 12.179688 z"/>
 <circle style="fill:currentColor" class="ColorScheme-Highlight" cx="5" cy="16" r="2"/>
</svg>
