<svg xmlns="http://www.w3.org/2000/svg" width="24" height="24" version="1.1">
 <defs>
  <style id="current-color-scheme" type="text/css">
   .ColorScheme-Text { color:#e4e4e4; } .ColorScheme-Highlight { color:#4285f4; } .ColorScheme-NeutralText { color:#ff9800; } .ColorScheme-PositiveText { color:#4caf50; } .ColorScheme-NegativeText { color:#f44336; }
  </style>
 </defs>
 <path style="fill:currentColor" class="ColorScheme-Text" d="m 9.5003816,6 c -0.8284271,0 -1.5,0.6715729 -1.5,1.5 0,0.8284271 0.6715729,1.5 1.5,1.5 1.5057924,0 2.9451514,0.322598 4.2441414,1.126953 0.58635,-0.77056 1.360446,-1.429315 2.3125,-1.9609374 C 14.073867,6.6926702 11.77786,6 9.5003816,6 Z m -4.984375,1 c -0.064596,-9.12e-4 -0.1291838,0.00235 -0.1933594,0.00977 -0.8232667,0.097745 -1.4111184,0.8448063 -1.3125,1.6679688 0.3147854,2.6526002 1.3501917,4.5426072 2.7011719,5.7890622 1.3509802,1.246454 2.8989615,1.86006 4.2011719,2.414062 0.762622,0.325159 1.6444,-0.03 1.96875,-0.792968 0.325159,-0.762623 -0.03,-1.6444 -0.792968,-1.96875 C 9.7664054,13.556771 8.5964953,13.047774 7.7445222,12.261719 6.8925491,11.475663 6.2399416,10.423257 5.990616,8.3222656 5.9013052,7.573518 5.270025,7.0074562 4.5160066,7 Z M 19.433976,8 c -0.09883,0.00463 -0.196969,0.019018 -0.292969,0.042969 -2.563932,0.6328895 -4.236447,1.825764 -5.070313,3.40625 -0.797218,1.511028 -0.874138,3.076085 -1.039062,4.667969 C 13.175956,16.0404 13.336902,16.000164 13.500382,16 h 1.5 v -3 c 5.5e-5,-0.552262 0.447738,-0.999945 1,-1 h 1.404297 C 17.87771,11.608111 18.604165,11.266966 19.859757,10.957031 20.6647,10.75889 21.156302,9.945384 20.957413,9.140625 20.795515,8.4836959 20.213875,8.0164641 19.537491,8 19.503001,7.99881 19.468471,7.99881 19.433976,8 Z M 8.8089754,9.890625 c -0.1089521,0.623926 -0.2262504,1.180409 -0.359375,1.658203 0.6124891,0.554598 1.5646146,1.008475 2.7011726,1.5 0.283611,-0.809623 0.468286,-1.730234 0.626953,-2.710937 C 11.059772,10.114247 10.30521,10 9.5003816,10 9.2595308,10 9.0302402,9.955794 8.8089754,9.890625 Z M 16.000382,13 v 4 h -2.5 l 1.75,2 1.75,2 1.75,-2 1.75,-2 h -2.5 V 13 Z M 4.740616,14.904297 c -0.1759756,0.03871 -0.3124185,0.08316 -0.5097656,0.119141 -0.8157945,0.148374 -1.3564511,0.930489 -1.2070313,1.746093 0.1483749,0.815795 0.9304899,1.356451 1.7460937,1.207031 C 5.9046332,17.769679 6.9027097,17.45024 7.7679597,17.013672 6.8712476,16.574821 5.924709,16.023349 5.0335847,15.201172 4.9326924,15.108086 4.8380079,15.003637 4.740616,14.904297 Z"/>
</svg>
