<svg xmlns="http://www.w3.org/2000/svg" width="16" height="16" version="1.1">
 <defs>
  <style id="current-color-scheme" type="text/css">
   .ColorScheme-Text { color:#c6c6c6; } .ColorScheme-Highlight { color:#4285f4; } .ColorScheme-NeutralText { color:#ff9800; } .ColorScheme-PositiveText { color:#4caf50; } .ColorScheme-NegativeText { color:#f44336; }
  </style>
 </defs>
 <path style="opacity:.35;fill:currentColor" class="ColorScheme-Text" d="M 10,9.01 15.5,4.51 10,0.01 C 10,0.01 10,1.34 10,2.01 H 7 V 7.01 H 10 Z"/>
 <path style="fill:currentColor" class="ColorScheme-Text" d="M 6,6.01 0.5,10.51 6,15.01 C 6,15.01 6,13.68 6,13.01 H 9 V 8.01 H 6 Z"/>
</svg>
