<svg xmlns="http://www.w3.org/2000/svg" width="16" height="16" version="1.1">
 <defs>
  <style id="current-color-scheme" type="text/css">
   .ColorScheme-Text { color:#c6c6c6; } .ColorScheme-Highlight { color:#4285f4; } .ColorScheme-NeutralText { color:#ff9800; } .ColorScheme-PositiveText { color:#4caf50; } .ColorScheme-NegativeText { color:#f44336; }
  </style>
 </defs>
 <path style="fill:currentColor" class="ColorScheme-Text" d="M 1,6 V 10 H 10 V 6 Z M 2,7 H 9 V 9 H 2 Z M 1,1 C 0,1 0,2 0,2 V 3 C 0,4 1,4 1,4 H 5 C 6,4 6,3 6,3 H 12 V 12 H 10 C 9,12 9,13 9,13 V 14 C 9,15 10,15 10,15 H 14 C 15,15 15,14 15,14 V 13 C 15,12 14,12 14,12 H 13 V 2 H 6 C 6,1 5,1 5,1 Z"/>
</svg>
