<svg xmlns="http://www.w3.org/2000/svg" width="16" height="16" version="1.1">
 <defs>
  <style id="current-color-scheme" type="text/css">
   .ColorScheme-Text { color:#e4e4e4; } .ColorScheme-Highlight { color:#4285f4; } .ColorScheme-NeutralText { color:#ff9800; } .ColorScheme-PositiveText { color:#4caf50; } .ColorScheme-NegativeText { color:#f44336; }
  </style>
 </defs>
 <path style="fill:none;stroke:currentColor;stroke-width:2;stroke-linecap:round;stroke-linejoin:bevel" class="ColorScheme-Text" d="m 9.0018995,3.9953573 -4e-6,5.9999999 c 0,1.0004488 -4e-6,2.0004488 -1.0000064,2.0004488 -0.3954481,0 -0.6109379,0.0096 -0.9999911,-4.48e-4 -0.3838564,0.0015 -7.6e-6,4.48e-4 -1.0000063,4.48e-4 -1.0000024,0 -0.9999949,-1 -0.9999949,-2.0004488 l 3.8e-6,-5.9999999 m 0,0 -3.8e-6,5.9999999 c 0,1.0004488 -3.8e-6,2.0004488 -1.0000062,2.0004488 -0.3954482,0 -0.610938,0.0096 -0.9999912,-4.48e-4 -0.3838563,0.0015 -7.5e-6,4.48e-4 -1.0000062,4.48e-4 -1.0000025,0 -0.999995,-1 -0.999995,-2.0004488 l 3.8e-6,-5.9999999"/>
 <path style="fill:none;stroke:currentColor;stroke-width:2;stroke-linecap:round;stroke-linejoin:bevel" class="ColorScheme-Text" d="m 13.043317,3.9987404 c 2.399679,0 2.000001,2.000001 2.000001,3.9999986 0,2.000001 0.355578,4.061102 -2.000001,4.000003 -2.348587,0 -1.999997,-2.000002 -1.999997,-4.000003 0,-1.9999976 -0.435451,-3.9999986 1.999997,-3.9999986"/>
</svg>
