<svg xmlns="http://www.w3.org/2000/svg" width="16" height="16" version="1.1">
 <defs>
  <style id="current-color-scheme" type="text/css">
   .ColorScheme-Text { color:#e4e4e4; } .ColorScheme-Highlight { color:#4285f4; } .ColorScheme-NeutralText { color:#ff9800; } .ColorScheme-PositiveText { color:#4caf50; } .ColorScheme-NegativeText { color:#f44336; }
  </style>
 </defs>
 <path style="fill:currentColor" class="ColorScheme-Text" d="M 4.4473,1 4.4492,1.0039 0.00781,3.5078 4,5.9863 0,9.0039 4.4492,11.5 8,9.0098 4,6 8,3.5078 12,6.0137 10.264,7.3145 C 10.819,7.1075 11.407,7.0011 12,7 12.613,7.0017 13.221,7.1162 13.793,7.3379 L 12,5.9961 15.99,3.5059 11.551,1 8,3.4922 Z M 12,8 C 9.7909,8 8,9.7909 8,12 8,14.209 9.7909,16 12,16 14.209,16 16,14.209 16,12 16,9.7909 14.209,8 12,8 Z M 14.635,9.6855 C 15.109,10.16 15.188,10.566 15.188,10.566 L 11.662,14.607 9.7695,12.73 C 9.5805,12.542 9.5805,12.199 9.7695,12.01 9.9575,11.822 10.3,11.822 10.488,12.01 L 11.615,13.137 Z M 7.2129,10.563 4.4492,12.502 3.5605,12.004 V 12.375 L 8,15 8.0059,14.998 C 7.3551,14.134 7.0021,13.082 7,12 7.0006,11.513 7.0723,11.029 7.2129,10.563 Z"/>
</svg>
