<svg xmlns="http://www.w3.org/2000/svg" width="16" height="16" version="1.1">
 <defs>
  <style id="current-color-scheme" type="text/css">
   .ColorScheme-Text { color:#c6c6c6; } .ColorScheme-Highlight { color:#4285f4; } .ColorScheme-NeutralText { color:#ff9800; } .ColorScheme-PositiveText { color:#4caf50; } .ColorScheme-NegativeText { color:#f44336; }
  </style>
 </defs>
 <path style="fill:currentColor" class="ColorScheme-Text" d="M 8 1 A 7 7 0 0 0 1 8 A 7 7 0 0 0 4.03125 13.755859 C 4.1045819 13.2038 4.4013283 12.686721 4.8125 12.388672 C 4.9489759 12.289744 5.0945037 12.223247 5.2421875 12.167969 A 5 5 0 0 1 3 8 A 5 5 0 0 1 8 3 A 5 5 0 0 1 13 8 A 5 5 0 0 1 12.863281 9.140625 C 12.993589 9.2711905 13.13035 9.3993618 13.232422 9.5410156 C 13.650508 10.121231 13.687278 10.65576 13.789062 11.193359 C 13.920767 11.217646 14.051766 11.245168 14.183594 11.269531 A 7 7 0 0 0 15 8 A 7 7 0 0 0 8 1 z M 8 4 A 4 4 0 0 0 4 8 A 4 4 0 0 0 6.1835938 11.5625 C 6.2184069 11.220725 6.2790751 10.872437 6.3828125 10.523438 A 3 3 0 0 1 5 8 A 3 3 0 0 1 8 5 A 3 3 0 0 1 11 8 A 3 3 0 0 1 10.994141 8.1113281 C 11.348918 8.1918744 11.675743 8.312267 11.96875 8.4648438 A 4 4 0 0 0 12 8 A 4 4 0 0 0 8 4 z M 10 9 C 7.5568513 9 7.0663331 10.973787 7.0175781 12.501953 C 7.0175669 12.676323 7.0343343 12.849755 7.0664062 13.021484 C 6.9064762 12.961274 6.5354959 12.930058 6.3632812 12.929688 C 5.6101655 12.92969 5 13.290122 5 14 C 5 14.709878 5.6101656 15 6.3632812 15 L 6.8183594 15 L 13.181641 15 C 14.185795 15 15 14.446503 15 13.5 C 15 12.553497 14.185795 12 13.181641 12 C 13.169821 11.999891 13.058695 11.999891 13.046875 12 C 13.000875 11 12.443149 9 10 9 z"/>
</svg>
