<svg xmlns="http://www.w3.org/2000/svg" width="22" height="22" version="1.1">
 <defs>
  <style id="current-color-scheme" type="text/css">
   .ColorScheme-Text { color:#c6c6c6; } .ColorScheme-Highlight { color:#4285f4; } .ColorScheme-NeutralText { color:#ff9800; } .ColorScheme-PositiveText { color:#4caf50; } .ColorScheme-NegativeText { color:#f44336; }
  </style>
 </defs>
 <path style="opacity:0.35;fill:currentColor" class="ColorScheme-Text" d="m 8.5996093,2.9994765 c -0.8864,0 -1.5996091,0.7444506 -1.5996091,1.6679688 V 5.9994765 H 13.400391 C 14.806168,5.9994765 16,7.1359133 16,8.5483044 v 4.4511716 h 1.400391 C 18.286791,12.999476 19,12.255025 19,11.331507 V 4.6674453 C 19,3.7439271 18.286791,2.9994765 17.400391,2.9994765 Z m -3.9999999,4 C 3.7132092,6.9994765 3,7.6905168 3,8.5483044 v 6.1933596 3.669921 c 0,0.523369 0.6523838,0.784543 1.033203,0.416016 l 2.5000003,-2.828125 h 6.8164057 c 1.35,0 1.650391,-1.099892 1.650391,-1.658203 V 13.999476 H 8.5996093 C 7.1540333,13.999476 6,12.770156 6,11.331507 V 6.9994765 Z m 2.4003908,0 v 1 3.3339835 c 1.251e-4,0.114754 0.01209,0.225862 0.0332,0.333985 1.21e-4,6.25e-4 -1.22e-4,0.0013 0,0.002 0.01055,0.05372 0.02371,0.106524 0.03906,0.158203 1.78e-4,6.02e-4 -1.789e-4,0.0014 0,0.002 0.01541,0.05166 0.03279,0.102994 0.05273,0.152344 2.279e-4,5.65e-4 -2.29e-4,0.0014 0,0.002 0.04023,0.09923 0.08943,0.193022 0.1464839,0.28125 3.06e-4,4.74e-4 -3.07e-4,0.0015 0,0.0019 0.05716,0.08821 0.123395,0.169126 0.195313,0.244141 0.1086571,0.113368 0.2326941,0.210124 0.36914,0.287109 0.226694,0.128159 0.486672,0.201184 0.763672,0.201184 h 5.4003909 1 v -1 -3.4511716 c 0,-0.8577876 -0.713209,-1.5488279 -1.599609,-1.5488279 H 7.9999903 Z"/>
</svg>
