<svg xmlns="http://www.w3.org/2000/svg" width="22" height="22" version="1.1">
 <defs>
  <style id="current-color-scheme" type="text/css">
   .ColorScheme-Text { color:#c6c6c6; } .ColorScheme-Highlight { color:#4285f4; } .ColorScheme-NeutralText { color:#ff9800; } .ColorScheme-PositiveText { color:#4caf50; } .ColorScheme-NegativeText { color:#f44336; }
  </style>
 </defs>
 <path style="fill:currentColor" class="ColorScheme-Text" d="m 14,3 c -1.1812,0.44881 -2,1.43 -2,2.6504 0,1.2204 0.8188,2.174 2,2.623 v 2.4278 c 1.274,0.6333 2.318,1.6588 3,2.9158 V 8.2734 C 18.181,7.8244 19,6.8708 19,5.6504 19,4.43 18.181,3.44881 17,3 v 2 c 0,1 -1,1 -1,1 h -1 c 0,0 -1,0 -1,-1 z m -3,8 C 7.676,11 5,13.676 5,17 H 3 v 2 h 16 v -2 h -2 c 0,-3.324 -2.676,-6 -6,-6 z m 0,3 c 1.662,0 3,1.338 3,3 H 8 c 0,-1.662 1.338,-3 3,-3 z"/>
</svg>
