<svg xmlns="http://www.w3.org/2000/svg" width="24" height="24" version="1.1">
 <defs>
  <style id="current-color-scheme" type="text/css">
   .ColorScheme-Text { color:#c6c6c6; } .ColorScheme-Highlight { color:#4285f4; } .ColorScheme-NeutralText { color:#ff9800; } .ColorScheme-PositiveText { color:#4caf50; } .ColorScheme-NegativeText { color:#f44336; }
  </style>
 </defs>
 <g transform="translate(4,4)">
  <path style="fill:currentColor" class="ColorScheme-Text" d="M 12.5,9 A 3.5,3.5 0 0 0 9,12.5 3.5,3.5 0 0 0 12.5,16 3.5,3.5 0 0 0 16,12.5 3.5,3.5 0 0 0 12.5,9 Z M 12,10 H 13 V 12 H 15 V 13 H 13 12 V 12 Z M 2,1 C 2,1 1,1 1,2 V 14 C 1,15 2,15 2,15 H 8.7617 A 4.5,4.5 0 0 1 8.0332,13 H 3 V 6 H 13 V 8.0312 A 4.5,4.5 0 0 1 15,8.7598 V 2 C 15,1 14,1 14,1 Z"/>
 </g>
</svg>
