<svg xmlns="http://www.w3.org/2000/svg" width="24" height="24" version="1.1">
 <defs>
  <style id="current-color-scheme" type="text/css">
   .ColorScheme-Text { color:#c6c6c6; } .ColorScheme-Highlight { color:#4285f4; } .ColorScheme-NeutralText { color:#ff9800; } .ColorScheme-PositiveText { color:#4caf50; } .ColorScheme-NegativeText { color:#f44336; }
  </style>
 </defs>
 <g transform="translate(4,4)">
  <path style="fill:currentColor;stroke:currentColor;stroke-width:2;stroke-linejoin:round" class="ColorScheme-Text" d="M 5,3.5 C 5,4.3284 4.3284,5 3.5,5 2.6716,5 2,4.3284 2,3.5 2,2.6716 2.6716,2 3.5,2 4.3284,2 5,2.6716 5,3.5 Z M 6,11 V 14 L 8,12.5 Z M 4,5 H 3 V 12 C 3,13 4,13 4,13 H 6 V 12 H 4 Z M 11,12.5 C 11,11.672 11.672,11 12.5,11 13.328,11 14,11.672 14,12.5 14,13.328 13.328,14 12.5,14 11.672,14 11,13.328 11,12.5 Z M 10,5 V 2 L 8,3.5 Z M 12,11 H 13 V 4 C 13,3 12,3 12,3 H 10 V 4 H 12 Z"/>
 </g>
</svg>
