/* XPM */
static char * title_3_inactive_xpm[] = {
"2 26 3 1",
" 	c None",
".	c #1c2023",
"+	c #1c2023",
"..",
"++",
"++",
"++",
"++",
"++",
"++",
"++",
"++",
"++",
"++",
"++",
"++",
"++",
"++",
"++",
"++",
"++",
"++",
"++",
"++",
"++",
"++",
"++",
"++",
"++"};
