<svg xmlns="http://www.w3.org/2000/svg" width="24" height="24" version="1.1">
 <defs>
  <style id="current-color-scheme" type="text/css">
   .ColorScheme-Text { color:#e4e4e4; } .ColorScheme-Highlight { color:#4285f4; } .ColorScheme-NeutralText { color:#ff9800; } .ColorScheme-PositiveText { color:#4caf50; } .ColorScheme-NegativeText { color:#f44336; }
  </style>
 </defs>
 <path style="fill:currentColor" class="ColorScheme-Text" d="M 10.565517,4.0992355 A 1.0001,1.0001 0 0 0 9.9991113,4.9996262 V 9.0660328 L 7.6123927,7.2105636 A 1,1 0 0 0 6.2100489,7.3863449 1,1 0 0 0 6.3858302,8.7886887 l 3.6132811,2.8105473 v 0.800781 l -3.6132811,2.810547 a 1,1 0 0 0 -0.1757813,1.402343 1,1 0 0 0 1.4023438,0.175782 L 9.9991113,14.93322 v 4.066407 a 1.0001,1.0001 0 0 0 1.6249997,0.78125 l 5.000001,-4.000001 a 1.0001,1.0001 0 0 0 -0.01172,-1.570312 l -2.841796,-2.210937 2.841797,-2.2109382 a 1.0001,1.0001 0 0 0 0.01172,-1.5703121 L 11.624112,4.2183762 A 1.0001,1.0001 0 0 0 10.565517,4.0992355 Z m 1.433594,2.9824219 2.384767,1.9082033 -2.242189,1.7441413 -0.142578,-0.111329 z m 0.142578,6.1835946 2.242189,1.74414 -2.384767,1.908204 V 13.37658 Z"/>
</svg>
