<svg xmlns="http://www.w3.org/2000/svg" width="16" height="16" version="1.1">
 <path style="fill:#a0a0a0" d="M 8 1 A 7 7 0 0 0 1 8 A 7 7 0 0 0 8 15 A 7 7 0 0 0 15 8 A 7 7 0 0 0 8 1 z M 5 5 L 6 5 C 6.28 5 6.5407 5.1002 6.7207 5.2812 L 8 6.5586 L 9.2793 5.2812 C 9.4593 5.1002 9.72 5 10 5 L 11 5 L 11 6 C 11 6.276 10.901 6.5377 10.721 6.7188 L 9.4395 8 L 10.721 9.2812 C 10.901 9.4621 11 9.7239 11 10 L 11 11 L 10 11 C 9.72 11 9.4593 10.9 9.2793 10.719 L 8 9.4336 L 6.7207 10.719 C 6.5407 10.9 6.28 11 6 11 L 5 11 L 5 10 C 5 9.7239 5.0993 9.4622 5.2793 9.2812 L 6.5605 8 L 5.2793 6.7188 C 5.0993 6.5377 5 6.276 5 6 L 5 5 z"/>
</svg>
