<svg xmlns="http://www.w3.org/2000/svg" width="24" height="24" version="1.1">
 <defs>
  <style id="current-color-scheme" type="text/css">
   .ColorScheme-Text { color:#c6c6c6; } .ColorScheme-Highlight { color:#4285f4; } .ColorScheme-NeutralText { color:#ff9800; } .ColorScheme-PositiveText { color:#4caf50; } .ColorScheme-NegativeText { color:#f44336; }
  </style>
 </defs>
 <path style="opacity:0.35;fill:currentColor" class="ColorScheme-Text" d="m 13.325107,16.098513 -2.42268,2.655385 c -0.301148,0.330081 -0.827622,0.326185 -1.1329871,0 L 7.0210458,15.918431 4.2276517,12.834258 c -0.2999491,-0.331172 -0.3071011,-0.823613 0,-1.148164 L 6.5507802,9.2309611 c 0.3070996,-0.3245519 0.8192187,-0.3181089 1.1329873,0 l 5.6413405,5.7193859 c 0.313768,0.31811 0.301152,0.818087 0,1.148165 z"/>
 <rect style="fill:currentColor" class="ColorScheme-Text" width="4.857" height="14.244" x="16.05" y="-8.12" ry=".774" transform="matrix(0.69970749,0.71442945,-0.69970749,0.71442945,0,0)"/>
</svg>
