<svg xmlns="http://www.w3.org/2000/svg" width="22" height="22" version="1.1">
 <defs>
  <style id="current-color-scheme" type="text/css">
   .ColorScheme-Text { color:#a0a0a0; } .ColorScheme-Highlight { color:#4285f4; } .ColorScheme-NeutralText { color:#ff9800; } .ColorScheme-PositiveText { color:#4caf50; } .ColorScheme-NegativeText { color:#f44336; }
  </style>
 </defs>
 <path style="fill:currentColor" class="ColorScheme-Text" d="m 10.863629,17.945583 h 1.314996 c 0,0 0.397109,-0.04526 0.600149,-0.271094 0.186619,-0.207578 0.180659,-0.597113 0.180659,-0.597113 0,0 -0.02573,-1.824064 0.793059,-2.092644 0.807477,-0.264765 1.744438,1.762783 2.843135,2.542572 0.830837,0.589836 1.462196,0.460726 1.462196,0.460726 l 2.937992,-0.04244 c 0,0 1.536797,-0.09803 0.808079,-1.347288 -0.05965,-0.102028 -0.42453,-0.924034 -2.184495,-2.61293 -1.842995,-1.766575 -1.595996,-2.479163 0.622999,-5.5366329 1.351996,-1.8620901 1.891994,-2.5992505 1.722995,-3.0861069 -0.161,-0.4639008 -1.154997,-0.3413383 -1.154997,-0.3413383 l -3.307992,0.021148 c 0,0 -0.245419,-0.034521 -0.427159,0.077929 -0.177789,0.109952 -0.291899,0.3668741 -0.291899,0.3668741 0,0 -0.523759,1.0412707 -1.221797,2.2668948 C 14.088553,10.339825 13.599112,11.474694 13.358312,11.313905 12.798134,10.93967 13,9.8108208 13,9.0085761 13,6.502634 13.305783,5.4578596 12.222155,5.1873838 11.862626,5.0976922 11.597757,5.0383468 10.678159,5.0286557 9.4977629,5.0162303 8.6987488,5.0323483 8.1330502,5.318883 7.7567112,5.5094035 7.466352,5.9338708 7.6432915,5.9582938 c 0.2186994,0.0301 0.7137181,0.138152 0.9761875,0.5073461 0.3390791,0.4769056 0.3805208,1.5475003 0.3805208,1.5475003 0,0 0.1415478,2.9497798 -0.5081905,3.3161688 C 8.0459805,11.580622 7.1348713,10.069552 5.8215748,7.723632 5.1488366,6.5220617 4.640678,5.59314 4.640678,5.59314 c 0,0 -0.097849,-0.2481889 -0.2726192,-0.3810515 C 4.1568593,5.0511009 3.86066,4.9999999 3.86066,4.9999999 l -3.14359173,0.021218 c 0,0 -0.4717787,0.013623 -0.6451683,0.2257625 -0.1542395,0.1888439 -0.01233,0.5789375 -0.01233,0.5789375 0,0 2.46089353,6.5506901 5.24758613,9.5503751 2.5554933,2.750467 5.5564429,2.569918 5.5564429,2.569918"/>
</svg>
