<svg xmlns="http://www.w3.org/2000/svg" width="22" height="22" version="1.1">
 <defs>
  <style id="current-color-scheme" type="text/css">
   .ColorScheme-Text { color:#c6c6c6; } .ColorScheme-Highlight { color:#4285f4; } .ColorScheme-NeutralText { color:#ff9800; } .ColorScheme-PositiveText { color:#4caf50; } .ColorScheme-NegativeText { color:#f44336; }
  </style>
 </defs>
 <path style="fill:currentColor" class="ColorScheme-Highlight" d="M 3,3.0000666 8,8 13.9896,7.9896 v 0.0208 h 0.0208 L 14,14 19,18.958333 V 3.0003332 Z M 8,8 3,12.8126 v 6.187333 H 9.541333 L 14,14 H 8 Z"/>
</svg>
