<svg xmlns="http://www.w3.org/2000/svg" width="24" height="24" version="1.1">
 <defs>
  <style id="current-color-scheme" type="text/css">
   .ColorScheme-Text { color:#a0a0a0; } .ColorScheme-Highlight { color:#4285f4; } .ColorScheme-NeutralText { color:#ff9800; } .ColorScheme-PositiveText { color:#4caf50; } .ColorScheme-NegativeText { color:#f44336; }
  </style>
 </defs>
 <path style="fill:currentColor" class="ColorScheme-Text" d="M 7.1992188,4 C 5.4264187,4 4,5.4264187 4,7.1992188 V 16.800781 C 4,18.573581 5.4264187,20 7.1992188,20 H 15.767578 A 3,3 0 0 1 15,18 3,3 0 0 1 15.179688,17 h -0.97461 L 11.923828,13.21875 9.6425781,17 H 7.4160156 L 10.673828,11.845703 7.6230469,7 H 9.9179688 L 12.035156,10.599609 14.109375,7 h 2.240234 l -3.078125,4.957031 2.591797,3.947266 A 3,3 0 0 1 18,15 3,3 0 0 1 20,15.763672 V 7.1992188 C 20,5.4264187 18.573581,4 16.800781,4 Z"/>
 <circle style="fill:currentColor" class="ColorScheme-NegativeText" cx="18" cy="18" r="2"/>
</svg>
