<svg xmlns="http://www.w3.org/2000/svg" width="16" height="16" version="1.1">
 <defs>
  <style id="current-color-scheme" type="text/css">
   .ColorScheme-Text { color:#e4e4e4; } .ColorScheme-Highlight { color:#4285f4; } .ColorScheme-NeutralText { color:#ff9800; } .ColorScheme-PositiveText { color:#4caf50; } .ColorScheme-NegativeText { color:#f44336; }
  </style>
 </defs>
 <path style="fill:none;stroke:currentColor;stroke-width:2;stroke-linecap:round" class="ColorScheme-Text" d="m 1.9999989,7.999998 h 4.0000022 m 0,4.000002 V 3.9999997 M 1.9999988,12 v -8.0000003 0"/>
 <path style="fill:none;stroke:currentColor;stroke-width:2;stroke-linecap:round;stroke-linejoin:bevel" class="ColorScheme-Text" d="m 10.001766,9.000001 h 4.000001 M 10.001867,12 V 6.0000011 M 14.001767,12 V 6.0000011 m -4.000001,0 -1.5e-5,-0.9995518 c 0,-1 0,-1 2.000016,-1.0004491 1.999984,-4.491e-4 1.999977,4.491e-4 1.999984,1.0004491 1.6e-5,1.9947407 1.6e-5,0.9995518 1.6e-5,0.9995518"/>
</svg>
