<svg xmlns="http://www.w3.org/2000/svg" width="16" height="16" version="1.1">
 <defs>
  <style id="current-color-scheme" type="text/css">
   .ColorScheme-Text { color:#a0a0a0; } .ColorScheme-Highlight { color:#4285f4; } .ColorScheme-NeutralText { color:#ff9800; } .ColorScheme-PositiveText { color:#4caf50; } .ColorScheme-NegativeText { color:#f44336; }
  </style>
 </defs>
 <path style="fill:currentColor" class="ColorScheme-Text" d="M 12.997,11.471 C 12.539,11.59 11.523,11.842 10.772,11.946 9.788,12.083 8.65,12.159 7.8,12.144 7.192,12.133 6.3897,12.005 5.9997,11.853 5.6267,11.7 5.2868,11.497 4.9998,11.243 L 4.9998,15 3,15 3,1.001 l 1.9998,0 0,5.181 c 0,0.729 0.043,1.348 0.128,1.857 0.102,0.508 0.254,0.923 0.4579,1.245 0.22,0.322 0.5,0.56 0.839,0.712 0.3559,0.136 1.1493,0.25 1.6573,0.25 0.22,0 1.191,-0.055 1.411,-0.072 0.237,-0.017 0.453,-0.034 0.657,-0.051 0.203,-0.017 0.343,-0.045 0.496,-0.062 0.153,-0.034 0.293,-0.048 0.344,-0.065 L 10.99,1 13,1 Z"/>
</svg>
