<svg xmlns="http://www.w3.org/2000/svg" width="22" height="22" version="1.1">
 <defs>
  <style id="current-color-scheme" type="text/css">
   .ColorScheme-Text { color:#c6c6c6; } .ColorScheme-Highlight { color:#4285f4; } .ColorScheme-NeutralText { color:#ff9800; } .ColorScheme-PositiveText { color:#4caf50; } .ColorScheme-NegativeText { color:#f44336; }
  </style>
 </defs>
 <path style="fill:currentColor" class="ColorScheme-Text" d="M 0 7 L 3.0351562 15 L 5.3105469 15 L 8.3457031 7 L 6.0683594 7 L 4.171875 11.800781 L 2.2753906 7 L 0 7 z M 10.621094 7 L 12.517578 12 L 13.65625 9 L 12.896484 7 L 10.621094 7 z M 16.689453 7 L 19.724609 15 L 22 15 L 18.964844 7 L 16.689453 7 z M 9.4824219 10.199219 L 7.5859375 15 L 9.8613281 15 L 10.621094 13.080078 L 9.4824219 10.199219 z M 15.550781 10.199219 L 13.654297 15 L 13.65625 15 L 15.931641 15 L 16.689453 13.080078 L 15.550781 10.199219 z"/>
 <path style="fill:currentColor;opacity:.35" class="ColorScheme-Text" d="M 8.3457031 7 L 5.3105469 15 L 7.5859375 15 L 9.4824219 10.199219 L 11.378906 15 L 13.654297 15 L 15.550781 10.199219 L 17.449219 15 L 19.724609 15 L 16.689453 7 L 14.414062 7 L 12.517578 12 L 10.621094 7 L 8.3457031 7 z"/>
</svg>
