<svg xmlns="http://www.w3.org/2000/svg" width="22" height="22" version="1.1">
 <defs>
  <style id="current-color-scheme" type="text/css">
   .ColorScheme-Text { color:#a0a0a0; } .ColorScheme-Highlight { color:#4285f4; } .ColorScheme-NeutralText { color:#ff9800; } .ColorScheme-PositiveText { color:#4caf50; } .ColorScheme-NegativeText { color:#f44336; }
  </style>
 </defs>
 <path style="fill:currentColor;opacity:.35" class="ColorScheme-Text" d="M 20,4 C 20,4 19.798,6.1521 15.979,7.8574 15.944,8.7744 15.815,9.6979 15.496,10.576 14.971,12.023 13.898,13.342 12.193,14.018 9.4396,15.109 8.1062,16.479 7.416,17.619 8.5676,16.787 10.444,15.984 13.529,15.674 19.37,15.088 20,4 20,4 Z"/>
 <path style="fill:currentColor" class="ColorScheme-Text" d="M 13.742,1 C 13.742,1 14.165,4.2186 10.5,7.002 10.802,7.8534 11.01,8.7761 11,9.7363 10.987,11.045 10.529,12.432 9.4238,13.559 8.6802,14.316 8.1313,15.016 7.7227,15.65 8.6315,14.745 9.9314,13.838 11.824,13.088 17.59,10.803 13.742,1 13.742,1 Z"/>
 <path style="fill:currentColor" class="ColorScheme-Text" d="M 3.681,11.501 C 7.9272,6.504 6.9722,3 6.9722,3 6.9722,3 12.411,9.087 8.7102,12.858 4.575,17.07 5.7252,20 5.7252,20 5.7252,20 1.246,14.367 3.681,11.501 Z"/>
</svg>
