<svg xmlns="http://www.w3.org/2000/svg" width="48" height="48" version="1">
 <rect style="opacity:0.2" width="40" height="26" x="4" y="17" rx="2" ry="2"/>
 <path style="fill:#9f866f" d="M 4,34 C 4,35.108 4.892,36 6,36 H 42 C 43.108,36 44,35.108 44,34 V 12 C 44,10.892 43.108,10 42,10 H 24 C 21,10 20,6 17,6 H 6 C 4.892,6 4,6.892 4,8"/>
 <rect style="opacity:0.2" width="40" height="26" x="4" y="15" rx="2" ry="2"/>
 <rect style="fill:#e4e4e4" width="36" height="16" x="6" y="13" rx="2" ry="2"/>
 <rect style="fill:#c7b6a5" width="40" height="26" x="4" y="16" rx="2" ry="2"/>
 <path style="opacity:0.1;fill:#ffffff" d="M 6,6 C 4.892,6 4,6.892 4,8 V 9 C 4,7.892 4.892,7 6,7 H 17 C 20,7 21,11 24,11 H 42 C 43.108,11 44,11.892 44,13 V 12 C 44,10.892 43.108,10 42,10 H 24 C 21,10 20,6 17,6 Z"/>
 <path style="fill:#66605a" d="M 19.707,22 19,22.708 20.408,24.117 A 2.5005,2.5027 0 0 0 19.998,25.488 2.5005,2.5027 0 0 0 21.999,27.94 V 32.05 A 2.5005,2.5027 0 0 0 19.999,34.497 2.5005,2.5027 0 0 0 22.5,37 2.5005,2.5027 0 0 0 25,34.497 2.5005,2.5027 0 0 0 23,32.046 V 27.936 A 2.5005,2.5027 0 0 0 23.869,27.582 L 25.41,29.125 A 2.5005,2.5027 0 0 0 25,30.493 2.5005,2.5027 0 0 0 27.501,32.996 2.5005,2.5027 0 0 0 30.002,30.492 2.5005,2.5027 0 0 0 27.502,27.989 2.5005,2.5027 0 0 0 26.114,28.412 L 24.58,26.875 A 2.5005,2.5027 0 0 0 25,25.487 2.5005,2.5027 0 0 0 22.5,22.984 2.5005,2.5027 0 0 0 21.114,23.407 L 19.708,22 Z"/>
</svg>
