<svg xmlns="http://www.w3.org/2000/svg" width="16" height="16" viewBox="0 0 16 16">
 <defs>
  <style id="current-color-scheme" type="text/css">
   .ColorScheme-Text { color:#c6c6c6; } .ColorScheme-Highlight { color:#4285f4; } .ColorScheme-NeutralText { color:#ff9800; } .ColorScheme-PositiveText { color:#4caf50; } .ColorScheme-NegativeText { color:#f44336; }
  </style>
 </defs>
 <path style="fill:currentColor" class="ColorScheme-Text" d="M 7 1 C 4.2473 1 2 3.2473 2 6 L 2 11 L 4 11 L 4 6 C 4 4.3207 5.3207 3 7 3 C 8.6793 3 10 4.3207 10 6 L 10 9 L 8 9 L 11 14 L 14 9 L 12 9 L 12 6 C 12 3.2473 9.7527 1 7 1 z"/>
</svg>
