{
    "current_scene": "3b. Intro with display",
    "current_program_scene": "3b. Intro with display",
    "scene_order": [
        {
            "name": "1. Intro"
        },
        {
            "name": "2. Intro Title"
        },
        {
            "name": "3a. Intro Topic with display"
        },
        {
            "name": "3b. Intro with display"
        },
        {
            "name": "4. main"
        },
        {
            "name": "5. side"
        },
        {
            "name": "6. cams01"
        },
        {
            "name": "6a. cams01"
        },
        {
            "name": "7. outtro"
        }
    ],
    "name": "simtransmission_color",
    "groups": [],
    "quick_transitions": [
        {
            "name": "Cut",
            "duration": 300,
            "hotkeys": [],
            "id": 1,
            "fade_to_black": false
        },
        {
            "name": "Fade",
            "duration": 300,
            "hotkeys": [],
            "id": 2,
            "fade_to_black": false
        },
        {
            "name": "Fade",
            "duration": 300,
            "hotkeys": [],
            "id": 3,
            "fade_to_black": true
        }
    ],
    "transitions": [],
    "saved_projectors": [],
    "current_transition": "Fade",
    "transition_duration": 2805,
    "preview_locked": false,
    "scaling_enabled": false,
    "scaling_level": 0,
    "scaling_off_x": 0.0,
    "scaling_off_y": 0.0,
    "modules": {
        "scripts-tool": [],
        "output-timer": {
            "streamTimerHours": 0,
            "streamTimerMinutes": 0,
            "streamTimerSeconds": 30,
            "recordTimerHours": 0,
            "recordTimerMinutes": 25,
            "recordTimerSeconds": 20,
            "autoStartStreamTimer": false,
            "autoStartRecordTimer": false,
            "pauseRecordTimer": true
        },
        "auto-scene-switcher": {
            "interval": 300,
            "non_matching_scene": "",
            "switch_if_not_matching": false,
            "active": false,
            "switches": []
        }
    },
    "sources": [
        {
            "prev_ver": 486604803,
            "name": "1. Intro",
            "uuid": "a8aa1f95-4b2e-433b-88d5-21fda2b132f1",
            "id": "scene",
            "versioned_id": "scene",
            "settings": {
                "id_counter": 2,
                "custom_size": false,
                "items": [
                    {
                        "name": "JACK Input Client",
                        "source_uuid": "a6283f34-d2e3-4625-873a-d7060d416c4f",
                        "visible": true,
                        "locked": false,
                        "rot": 0.0,
                        "pos": {
                            "x": 0.0,
                            "y": 0.0
                        },
                        "scale": {
                            "x": 1.0,
                            "y": 1.0
                        },
                        "align": 5,
                        "bounds_type": 0,
                        "bounds_align": 0,
                        "bounds": {
                            "x": 0.0,
                            "y": 0.0
                        },
                        "crop_left": 0,
                        "crop_top": 0,
                        "crop_right": 0,
                        "crop_bottom": 0,
                        "id": 1,
                        "group_item_backup": false,
                        "scale_filter": "disable",
                        "blend_method": "default",
                        "blend_type": "normal",
                        "show_transition": {
                            "duration": 0
                        },
                        "hide_transition": {
                            "duration": 0
                        },
                        "private_settings": {}
                    }
                ]
            },
            "mixers": 0,
            "sync": 0,
            "flags": 0,
            "volume": 1.0,
            "balance": 0.5,
            "enabled": true,
            "muted": false,
            "push-to-mute": false,
            "push-to-mute-delay": 0,
            "push-to-talk": false,
            "push-to-talk-delay": 0,
            "hotkeys": {
                "OBSBasic.SelectScene": [
                    {
                        "shift": true,
                        "control": true,
                        "key": "OBS_KEY_1"
                    }
                ],
                "libobs.show_scene_item.JACK Input Client": [],
                "libobs.hide_scene_item.JACK Input Client": []
            },
            "deinterlace_mode": 0,
            "deinterlace_field_order": 0,
            "monitoring_type": 0,
            "private_settings": {}
        },
        {
            "prev_ver": 486604803,
            "name": "2. Intro Title",
            "uuid": "1cfe8db9-e39f-498c-beb2-286d83d9f5c3",
            "id": "scene",
            "versioned_id": "scene",
            "settings": {
                "id_counter": 2,
                "custom_size": false,
                "items": [
                    {
                        "name": "JACK Input Client",
                        "source_uuid": "a6283f34-d2e3-4625-873a-d7060d416c4f",
                        "visible": true,
                        "locked": false,
                        "rot": 0.0,
                        "pos": {
                            "x": 0.0,
                            "y": 0.0
                        },
                        "scale": {
                            "x": 1.0,
                            "y": 1.0
                        },
                        "align": 5,
                        "bounds_type": 0,
                        "bounds_align": 0,
                        "bounds": {
                            "x": 0.0,
                            "y": 0.0
                        },
                        "crop_left": 0,
                        "crop_top": 0,
                        "crop_right": 0,
                        "crop_bottom": 0,
                        "id": 1,
                        "group_item_backup": false,
                        "scale_filter": "disable",
                        "blend_method": "default",
                        "blend_type": "normal",
                        "show_transition": {
                            "duration": 0
                        },
                        "hide_transition": {
                            "duration": 0
                        },
                        "private_settings": {}
                    },
                    {
                        "name": "title",
                        "source_uuid": "39853712-7dbd-4169-b244-72df32786467",
                        "visible": true,
                        "locked": false,
                        "rot": 0.0,
                        "pos": {
                            "x": 1466.0,
                            "y": 689.0
                        },
                        "scale": {
                            "x": 1.2376111745834351,
                            "y": 1.2380952835083008
                        },
                        "align": 5,
                        "bounds_type": 0,
                        "bounds_align": 0,
                        "bounds": {
                            "x": 703.0,
                            "y": 123.0
                        },
                        "crop_left": 0,
                        "crop_top": 0,
                        "crop_right": 0,
                        "crop_bottom": 0,
                        "id": 2,
                        "group_item_backup": false,
                        "scale_filter": "disable",
                        "blend_method": "default",
                        "blend_type": "normal",
                        "show_transition": {
                            "duration": 0
                        },
                        "hide_transition": {
                            "duration": 0
                        },
                        "private_settings": {}
                    }
                ]
            },
            "mixers": 0,
            "sync": 0,
            "flags": 0,
            "volume": 1.0,
            "balance": 0.5,
            "enabled": true,
            "muted": false,
            "push-to-mute": false,
            "push-to-mute-delay": 0,
            "push-to-talk": false,
            "push-to-talk-delay": 0,
            "hotkeys": {
                "OBSBasic.SelectScene": [
                    {
                        "shift": true,
                        "control": true,
                        "key": "OBS_KEY_2"
                    }
                ],
                "libobs.show_scene_item.JACK Input Client": [],
                "libobs.hide_scene_item.JACK Input Client": [],
                "libobs.show_scene_item.title": [],
                "libobs.hide_scene_item.title": []
            },
            "deinterlace_mode": 0,
            "deinterlace_field_order": 0,
            "monitoring_type": 0,
            "private_settings": {}
        },
        {
            "prev_ver": 486604803,
            "name": "3a. Intro Topic with display",
            "uuid": "fab0ae3b-30ff-460d-bd94-d00010ec8ca1",
            "id": "scene",
            "versioned_id": "scene",
            "settings": {
                "id_counter": 7,
                "custom_size": false,
                "items": [
                    {
                        "name": "main dimmed",
                        "source_uuid": "7fc2ecbf-5616-45b9-bae0-66cbb58c3bde",
                        "visible": false,
                        "locked": true,
                        "rot": 0.0,
                        "pos": {
                            "x": 0.0,
                            "y": 0.0
                        },
                        "scale": {
                            "x": 1.0,
                            "y": 1.0
                        },
                        "align": 5,
                        "bounds_type": 0,
                        "bounds_align": 0,
                        "bounds": {
                            "x": 0.0,
                            "y": 0.0
                        },
                        "crop_left": 0,
                        "crop_top": 0,
                        "crop_right": 0,
                        "crop_bottom": 0,
                        "id": 1,
                        "group_item_backup": false,
                        "scale_filter": "disable",
                        "blend_method": "default",
                        "blend_type": "normal",
                        "show_transition": {
                            "duration": 0
                        },
                        "hide_transition": {
                            "duration": 0
                        },
                        "private_settings": {}
                    },
                    {
                        "name": "JACK Input Client",
                        "source_uuid": "a6283f34-d2e3-4625-873a-d7060d416c4f",
                        "visible": true,
                        "locked": false,
                        "rot": 0.0,
                        "pos": {
                            "x": 0.0,
                            "y": 0.0
                        },
                        "scale": {
                            "x": 1.0,
                            "y": 1.0
                        },
                        "align": 5,
                        "bounds_type": 0,
                        "bounds_align": 0,
                        "bounds": {
                            "x": 0.0,
                            "y": 0.0
                        },
                        "crop_left": 0,
                        "crop_top": 0,
                        "crop_right": 0,
                        "crop_bottom": 0,
                        "id": 2,
                        "group_item_backup": false,
                        "scale_filter": "disable",
                        "blend_method": "default",
                        "blend_type": "normal",
                        "show_transition": {
                            "duration": 0
                        },
                        "hide_transition": {
                            "duration": 0
                        },
                        "private_settings": {}
                    },
                    {
                        "name": "Video Capture Device (V4L2)",
                        "source_uuid": "23dd5a91-8cd2-402d-ad6b-30dcdc69d0ea",
                        "visible": true,
                        "locked": false,
                        "rot": 0.0,
                        "pos": {
                            "x": 0.0,
                            "y": 0.0
                        },
                        "scale": {
                            "x": 1.0,
                            "y": 1.0
                        },
                        "align": 5,
                        "bounds_type": 1,
                        "bounds_align": 0,
                        "bounds": {
                            "x": 4225.0,
                            "y": 2966.0
                        },
                        "crop_left": 0,
                        "crop_top": 0,
                        "crop_right": 0,
                        "crop_bottom": 0,
                        "id": 5,
                        "group_item_backup": false,
                        "scale_filter": "disable",
                        "blend_method": "default",
                        "blend_type": "normal",
                        "show_transition": {
                            "duration": 0
                        },
                        "hide_transition": {
                            "duration": 0
                        },
                        "private_settings": {}
                    },
                    {
                        "name": "title",
                        "source_uuid": "39853712-7dbd-4169-b244-72df32786467",
                        "visible": false,
                        "locked": false,
                        "rot": 0.0,
                        "pos": {
                            "x": 123.0,
                            "y": 1296.0
                        },
                        "scale": {
                            "x": 1.0,
                            "y": 1.0
                        },
                        "align": 5,
                        "bounds_type": 2,
                        "bounds_align": 0,
                        "bounds": {
                            "x": 588.0,
                            "y": 88.0
                        },
                        "crop_left": 0,
                        "crop_top": 0,
                        "crop_right": 0,
                        "crop_bottom": 0,
                        "id": 3,
                        "group_item_backup": false,
                        "scale_filter": "disable",
                        "blend_method": "default",
                        "blend_type": "normal",
                        "show_transition": {
                            "duration": 0
                        },
                        "hide_transition": {
                            "duration": 0
                        },
                        "private_settings": {}
                    },
                    {
                        "name": "Color Source",
                        "source_uuid": "362ac7ef-6a7a-471f-bdb3-f166022b361d",
                        "visible": false,
                        "locked": false,
                        "rot": 0.0,
                        "pos": {
                            "x": 19.0,
                            "y": 42.0
                        },
                        "scale": {
                            "x": 1.0,
                            "y": 1.0
                        },
                        "align": 5,
                        "bounds_type": 1,
                        "bounds_align": 0,
                        "bounds": {
                            "x": 2560.0,
                            "y": 1440.0
                        },
                        "crop_left": 0,
                        "crop_top": 0,
                        "crop_right": 0,
                        "crop_bottom": 0,
                        "id": 7,
                        "group_item_backup": false,
                        "scale_filter": "disable",
                        "blend_method": "default",
                        "blend_type": "normal",
                        "show_transition": {
                            "duration": 0
                        },
                        "hide_transition": {
                            "duration": 0
                        },
                        "private_settings": {}
                    },
                    {
                        "name": "topic",
                        "source_uuid": "54cb777a-1996-4a2e-a108-db26503a90c2",
                        "visible": false,
                        "locked": false,
                        "rot": 0.0,
                        "pos": {
                            "x": 1038.0,
                            "y": 1362.0
                        },
                        "scale": {
                            "x": 1.2376111745834351,
                            "y": 1.2380952835083008
                        },
                        "align": 5,
                        "bounds_type": 0,
                        "bounds_align": 0,
                        "bounds": {
                            "x": 703.0,
                            "y": 123.0
                        },
                        "crop_left": 0,
                        "crop_top": 0,
                        "crop_right": 0,
                        "crop_bottom": 0,
                        "id": 6,
                        "group_item_backup": false,
                        "scale_filter": "disable",
                        "blend_method": "default",
                        "blend_type": "normal",
                        "show_transition": {
                            "duration": 0
                        },
                        "hide_transition": {
                            "duration": 0
                        },
                        "private_settings": {}
                    }
                ]
            },
            "mixers": 0,
            "sync": 0,
            "flags": 0,
            "volume": 1.0,
            "balance": 0.5,
            "enabled": true,
            "muted": false,
            "push-to-mute": false,
            "push-to-mute-delay": 0,
            "push-to-talk": false,
            "push-to-talk-delay": 0,
            "hotkeys": {
                "OBSBasic.SelectScene": [
                    {
                        "shift": true,
                        "control": true,
                        "key": "OBS_KEY_3"
                    }
                ],
                "libobs.show_scene_item.main dimmed": [],
                "libobs.hide_scene_item.main dimmed": [],
                "libobs.show_scene_item.JACK Input Client": [],
                "libobs.hide_scene_item.JACK Input Client": [],
                "libobs.show_scene_item.Video Capture Device (V4L2)": [],
                "libobs.hide_scene_item.Video Capture Device (V4L2)": [],
                "libobs.show_scene_item.title": [],
                "libobs.hide_scene_item.title": [],
                "libobs.show_scene_item.Color Source": [],
                "libobs.hide_scene_item.Color Source": [],
                "libobs.show_scene_item.topic": [],
                "libobs.hide_scene_item.topic": []
            },
            "deinterlace_mode": 0,
            "deinterlace_field_order": 0,
            "monitoring_type": 0,
            "private_settings": {
                "transition": "Fade",
                "transition_duration": 14150
            }
        },
        {
            "prev_ver": 486604803,
            "name": "3b. Intro with display",
            "uuid": "488d855a-2cbe-40a5-929a-c02b83e82387",
            "id": "scene",
            "versioned_id": "scene",
            "settings": {
                "id_counter": 5,
                "custom_size": false,
                "items": [
                    {
                        "name": "main dimmed",
                        "source_uuid": "7fc2ecbf-5616-45b9-bae0-66cbb58c3bde",
                        "visible": false,
                        "locked": true,
                        "rot": 0.0,
                        "pos": {
                            "x": 0.0,
                            "y": 0.0
                        },
                        "scale": {
                            "x": 1.0,
                            "y": 1.0
                        },
                        "align": 5,
                        "bounds_type": 0,
                        "bounds_align": 0,
                        "bounds": {
                            "x": 0.0,
                            "y": 0.0
                        },
                        "crop_left": 0,
                        "crop_top": 0,
                        "crop_right": 0,
                        "crop_bottom": 0,
                        "id": 1,
                        "group_item_backup": false,
                        "scale_filter": "disable",
                        "blend_method": "default",
                        "blend_type": "normal",
                        "show_transition": {
                            "duration": 0
                        },
                        "hide_transition": {
                            "duration": 0
                        },
                        "private_settings": {}
                    },
                    {
                        "name": "JACK Input Client",
                        "source_uuid": "a6283f34-d2e3-4625-873a-d7060d416c4f",
                        "visible": true,
                        "locked": false,
                        "rot": 0.0,
                        "pos": {
                            "x": 0.0,
                            "y": 0.0
                        },
                        "scale": {
                            "x": 1.0,
                            "y": 1.0
                        },
                        "align": 5,
                        "bounds_type": 0,
                        "bounds_align": 0,
                        "bounds": {
                            "x": 0.0,
                            "y": 0.0
                        },
                        "crop_left": 0,
                        "crop_top": 0,
                        "crop_right": 0,
                        "crop_bottom": 0,
                        "id": 2,
                        "group_item_backup": false,
                        "scale_filter": "disable",
                        "blend_method": "default",
                        "blend_type": "normal",
                        "show_transition": {
                            "duration": 0
                        },
                        "hide_transition": {
                            "duration": 0
                        },
                        "private_settings": {}
                    },
                    {
                        "name": "Video Capture Device (V4L2)",
                        "source_uuid": "23dd5a91-8cd2-402d-ad6b-30dcdc69d0ea",
                        "visible": true,
                        "locked": false,
                        "rot": 0.0,
                        "pos": {
                            "x": -1759.0,
                            "y": -279.0
                        },
                        "scale": {
                            "x": 1.0,
                            "y": 1.0
                        },
                        "align": 5,
                        "bounds_type": 1,
                        "bounds_align": 0,
                        "bounds": {
                            "x": 4842.0,
                            "y": 1719.0
                        },
                        "crop_left": 0,
                        "crop_top": 0,
                        "crop_right": 0,
                        "crop_bottom": 0,
                        "id": 3,
                        "group_item_backup": false,
                        "scale_filter": "disable",
                        "blend_method": "default",
                        "blend_type": "normal",
                        "show_transition": {
                            "duration": 0
                        },
                        "hide_transition": {
                            "duration": 0
                        },
                        "private_settings": {}
                    },
                    {
                        "name": "title",
                        "source_uuid": "39853712-7dbd-4169-b244-72df32786467",
                        "visible": true,
                        "locked": false,
                        "rot": 0.0,
                        "pos": {
                            "x": 121.0,
                            "y": 1296.0
                        },
                        "scale": {
                            "x": 1.0,
                            "y": 1.0
                        },
                        "align": 5,
                        "bounds_type": 2,
                        "bounds_align": 0,
                        "bounds": {
                            "x": 588.0,
                            "y": 88.0
                        },
                        "crop_left": 0,
                        "crop_top": 0,
                        "crop_right": 0,
                        "crop_bottom": 0,
                        "id": 4,
                        "group_item_backup": false,
                        "scale_filter": "disable",
                        "blend_method": "default",
                        "blend_type": "normal",
                        "show_transition": {
                            "duration": 0
                        },
                        "hide_transition": {
                            "duration": 0
                        },
                        "private_settings": {}
                    },
                    {
                        "name": "topic",
                        "source_uuid": "54cb777a-1996-4a2e-a108-db26503a90c2",
                        "visible": true,
                        "locked": false,
                        "rot": 0.0,
                        "pos": {
                            "x": 367.0,
                            "y": 1361.0
                        },
                        "scale": {
                            "x": 1.0,
                            "y": 1.0
                        },
                        "align": 5,
                        "bounds_type": 0,
                        "bounds_align": 0,
                        "bounds": {
                            "x": 0.0,
                            "y": 0.0
                        },
                        "crop_left": 0,
                        "crop_top": 0,
                        "crop_right": 0,
                        "crop_bottom": 0,
                        "id": 5,
                        "group_item_backup": false,
                        "scale_filter": "disable",
                        "blend_method": "default",
                        "blend_type": "normal",
                        "show_transition": {
                            "duration": 0
                        },
                        "hide_transition": {
                            "duration": 0
                        },
                        "private_settings": {}
                    }
                ]
            },
            "mixers": 0,
            "sync": 0,
            "flags": 0,
            "volume": 1.0,
            "balance": 0.5,
            "enabled": true,
            "muted": false,
            "push-to-mute": false,
            "push-to-mute-delay": 0,
            "push-to-talk": false,
            "push-to-talk-delay": 0,
            "hotkeys": {
                "OBSBasic.SelectScene": [
                    {
                        "shift": true,
                        "control": true,
                        "alt": true,
                        "key": "OBS_KEY_3"
                    }
                ],
                "libobs.show_scene_item.main dimmed": [],
                "libobs.hide_scene_item.main dimmed": [],
                "libobs.show_scene_item.JACK Input Client": [],
                "libobs.hide_scene_item.JACK Input Client": [],
                "libobs.show_scene_item.Video Capture Device (V4L2)": [],
                "libobs.hide_scene_item.Video Capture Device (V4L2)": [],
                "libobs.show_scene_item.title": [],
                "libobs.hide_scene_item.title": [],
                "libobs.show_scene_item.topic": [],
                "libobs.hide_scene_item.topic": []
            },
            "deinterlace_mode": 0,
            "deinterlace_field_order": 0,
            "monitoring_type": 0,
            "private_settings": {
                "transition": "Fade",
                "transition_duration": 7900
            }
        },
        {
            "prev_ver": 486604803,
            "name": "4. main",
            "uuid": "c8fa5b0c-532e-4b08-9dfa-5289c2a81e23",
            "id": "scene",
            "versioned_id": "scene",
            "settings": {
                "id_counter": 3,
                "custom_size": false,
                "items": [
                    {
                        "name": "main screen",
                        "source_uuid": "ed1f6529-ae01-40d3-8156-18de1ce20e5a",
                        "visible": true,
                        "locked": false,
                        "rot": 0.0,
                        "pos": {
                            "x": 0.0,
                            "y": 0.0
                        },
                        "scale": {
                            "x": 1.0,
                            "y": 1.0
                        },
                        "align": 5,
                        "bounds_type": 0,
                        "bounds_align": 0,
                        "bounds": {
                            "x": 0.0,
                            "y": 0.0
                        },
                        "crop_left": 0,
                        "crop_top": 0,
                        "crop_right": 0,
                        "crop_bottom": 0,
                        "id": 3,
                        "group_item_backup": false,
                        "scale_filter": "disable",
                        "blend_method": "default",
                        "blend_type": "normal",
                        "show_transition": {
                            "duration": 0
                        },
                        "hide_transition": {
                            "duration": 0
                        },
                        "private_settings": {}
                    },
                    {
                        "name": "JACK Input Client",
                        "source_uuid": "a6283f34-d2e3-4625-873a-d7060d416c4f",
                        "visible": true,
                        "locked": false,
                        "rot": 0.0,
                        "pos": {
                            "x": 0.0,
                            "y": 0.0
                        },
                        "scale": {
                            "x": 1.0,
                            "y": 1.0
                        },
                        "align": 5,
                        "bounds_type": 0,
                        "bounds_align": 0,
                        "bounds": {
                            "x": 0.0,
                            "y": 0.0
                        },
                        "crop_left": 0,
                        "crop_top": 0,
                        "crop_right": 0,
                        "crop_bottom": 0,
                        "id": 2,
                        "group_item_backup": false,
                        "scale_filter": "disable",
                        "blend_method": "default",
                        "blend_type": "normal",
                        "show_transition": {
                            "duration": 0
                        },
                        "hide_transition": {
                            "duration": 0
                        },
                        "private_settings": {}
                    }
                ]
            },
            "mixers": 0,
            "sync": 0,
            "flags": 0,
            "volume": 1.0,
            "balance": 0.5,
            "enabled": true,
            "muted": false,
            "push-to-mute": false,
            "push-to-mute-delay": 0,
            "push-to-talk": false,
            "push-to-talk-delay": 0,
            "hotkeys": {
                "OBSBasic.SelectScene": [
                    {
                        "shift": true,
                        "control": true,
                        "key": "OBS_KEY_4"
                    }
                ],
                "libobs.show_scene_item.main screen": [],
                "libobs.hide_scene_item.main screen": [],
                "libobs.show_scene_item.JACK Input Client": [],
                "libobs.hide_scene_item.JACK Input Client": []
            },
            "deinterlace_mode": 0,
            "deinterlace_field_order": 0,
            "monitoring_type": 0,
            "private_settings": {}
        },
        {
            "prev_ver": 486604803,
            "name": "5. side",
            "uuid": "1c42dc08-8a8b-4b4c-9ad6-e3f156faea16",
            "id": "scene",
            "versioned_id": "scene",
            "settings": {
                "id_counter": 3,
                "custom_size": false,
                "items": [
                    {
                        "name": "JACK Input Client",
                        "source_uuid": "a6283f34-d2e3-4625-873a-d7060d416c4f",
                        "visible": true,
                        "locked": false,
                        "rot": 0.0,
                        "pos": {
                            "x": 0.0,
                            "y": 0.0
                        },
                        "scale": {
                            "x": 1.0,
                            "y": 1.0
                        },
                        "align": 5,
                        "bounds_type": 0,
                        "bounds_align": 0,
                        "bounds": {
                            "x": 0.0,
                            "y": 0.0
                        },
                        "crop_left": 0,
                        "crop_top": 0,
                        "crop_right": 0,
                        "crop_bottom": 0,
                        "id": 1,
                        "group_item_backup": false,
                        "scale_filter": "disable",
                        "blend_method": "default",
                        "blend_type": "normal",
                        "show_transition": {
                            "duration": 0
                        },
                        "hide_transition": {
                            "duration": 0
                        },
                        "private_settings": {}
                    },
                    {
                        "name": "side screen",
                        "source_uuid": "703a7617-b3b1-43de-a311-a8dcf3411eef",
                        "visible": true,
                        "locked": false,
                        "rot": 0.0,
                        "pos": {
                            "x": 0.0,
                            "y": 0.0
                        },
                        "scale": {
                            "x": 1.0,
                            "y": 1.0
                        },
                        "align": 5,
                        "bounds_type": 2,
                        "bounds_align": 0,
                        "bounds": {
                            "x": 2560.0,
                            "y": 1440.0
                        },
                        "crop_left": 0,
                        "crop_top": 0,
                        "crop_right": 0,
                        "crop_bottom": 0,
                        "id": 3,
                        "group_item_backup": false,
                        "scale_filter": "disable",
                        "blend_method": "default",
                        "blend_type": "normal",
                        "show_transition": {
                            "duration": 0
                        },
                        "hide_transition": {
                            "duration": 0
                        },
                        "private_settings": {}
                    }
                ]
            },
            "mixers": 0,
            "sync": 0,
            "flags": 0,
            "volume": 1.0,
            "balance": 0.5,
            "enabled": true,
            "muted": false,
            "push-to-mute": false,
            "push-to-mute-delay": 0,
            "push-to-talk": false,
            "push-to-talk-delay": 0,
            "hotkeys": {
                "OBSBasic.SelectScene": [
                    {
                        "shift": true,
                        "control": true,
                        "key": "OBS_KEY_5"
                    }
                ],
                "libobs.show_scene_item.JACK Input Client": [],
                "libobs.hide_scene_item.JACK Input Client": [],
                "libobs.show_scene_item.side screen": [],
                "libobs.hide_scene_item.side screen": []
            },
            "deinterlace_mode": 0,
            "deinterlace_field_order": 0,
            "monitoring_type": 0,
            "private_settings": {
                "transition": "Fade",
                "transition_duration": 650
            }
        },
        {
            "prev_ver": 486604803,
            "name": "6. cams01",
            "uuid": "2b50a601-3192-4f3e-a919-94b27927b290",
            "id": "scene",
            "versioned_id": "scene",
            "settings": {
                "id_counter": 5,
                "custom_size": false,
                "items": [
                    {
                        "name": "JACK Input Client",
                        "source_uuid": "a6283f34-d2e3-4625-873a-d7060d416c4f",
                        "visible": true,
                        "locked": false,
                        "rot": 0.0,
                        "pos": {
                            "x": 0.0,
                            "y": 0.0
                        },
                        "scale": {
                            "x": 1.0,
                            "y": 1.0
                        },
                        "align": 5,
                        "bounds_type": 0,
                        "bounds_align": 0,
                        "bounds": {
                            "x": 0.0,
                            "y": 0.0
                        },
                        "crop_left": 0,
                        "crop_top": 0,
                        "crop_right": 0,
                        "crop_bottom": 0,
                        "id": 1,
                        "group_item_backup": false,
                        "scale_filter": "disable",
                        "blend_method": "default",
                        "blend_type": "normal",
                        "show_transition": {
                            "duration": 0
                        },
                        "hide_transition": {
                            "duration": 0
                        },
                        "private_settings": {}
                    },
                    {
                        "name": "Video Capture Device (V4L2)",
                        "source_uuid": "23dd5a91-8cd2-402d-ad6b-30dcdc69d0ea",
                        "visible": true,
                        "locked": false,
                        "rot": 0.0,
                        "pos": {
                            "x": -749.0,
                            "y": 0.0
                        },
                        "scale": {
                            "x": 1.0,
                            "y": 1.0
                        },
                        "align": 5,
                        "bounds_type": 3,
                        "bounds_align": 0,
                        "bounds": {
                            "x": 3451.0,
                            "y": 1892.0
                        },
                        "crop_left": 0,
                        "crop_top": 0,
                        "crop_right": 0,
                        "crop_bottom": 0,
                        "id": 3,
                        "group_item_backup": false,
                        "scale_filter": "disable",
                        "blend_method": "default",
                        "blend_type": "normal",
                        "show_transition": {
                            "duration": 0
                        },
                        "hide_transition": {
                            "duration": 0
                        },
                        "private_settings": {}
                    },
                    {
                        "name": "Color Source 2",
                        "source_uuid": "ba88c62c-7c0c-4e8c-b016-64b053d765ca",
                        "visible": true,
                        "locked": false,
                        "rot": 0.0,
                        "pos": {
                            "x": 0.0,
                            "y": 0.0
                        },
                        "scale": {
                            "x": 1.0,
                            "y": 1.0
                        },
                        "align": 5,
                        "bounds_type": 1,
                        "bounds_align": 0,
                        "bounds": {
                            "x": 2560.0,
                            "y": 1440.0
                        },
                        "crop_left": 0,
                        "crop_top": 0,
                        "crop_right": 0,
                        "crop_bottom": 0,
                        "id": 5,
                        "group_item_backup": false,
                        "scale_filter": "disable",
                        "blend_method": "default",
                        "blend_type": "normal",
                        "show_transition": {
                            "duration": 0
                        },
                        "hide_transition": {
                            "duration": 0
                        },
                        "private_settings": {}
                    },
                    {
                        "name": "topic 2",
                        "source_uuid": "5338cb06-1133-43bf-9011-9b185eb6b502",
                        "visible": true,
                        "locked": false,
                        "rot": 0.0,
                        "pos": {
                            "x": 963.0,
                            "y": 1174.0
                        },
                        "scale": {
                            "x": 1.2376111745834351,
                            "y": 1.2380952835083008
                        },
                        "align": 5,
                        "bounds_type": 0,
                        "bounds_align": 0,
                        "bounds": {
                            "x": 703.0,
                            "y": 123.0
                        },
                        "crop_left": 0,
                        "crop_top": 0,
                        "crop_right": 0,
                        "crop_bottom": 0,
                        "id": 4,
                        "group_item_backup": false,
                        "scale_filter": "disable",
                        "blend_method": "default",
                        "blend_type": "normal",
                        "show_transition": {
                            "duration": 0
                        },
                        "hide_transition": {
                            "duration": 0
                        },
                        "private_settings": {}
                    }
                ]
            },
            "mixers": 0,
            "sync": 0,
            "flags": 0,
            "volume": 1.0,
            "balance": 0.5,
            "enabled": true,
            "muted": false,
            "push-to-mute": false,
            "push-to-mute-delay": 0,
            "push-to-talk": false,
            "push-to-talk-delay": 0,
            "hotkeys": {
                "OBSBasic.SelectScene": [
                    {
                        "shift": true,
                        "control": true,
                        "alt": true,
                        "key": "OBS_KEY_5"
                    }
                ],
                "libobs.show_scene_item.JACK Input Client": [],
                "libobs.hide_scene_item.JACK Input Client": [],
                "libobs.show_scene_item.Video Capture Device (V4L2)": [],
                "libobs.hide_scene_item.Video Capture Device (V4L2)": [],
                "libobs.show_scene_item.Color Source 2": [],
                "libobs.hide_scene_item.Color Source 2": [],
                "libobs.show_scene_item.topic 2": [],
                "libobs.hide_scene_item.topic 2": []
            },
            "deinterlace_mode": 0,
            "deinterlace_field_order": 0,
            "monitoring_type": 0,
            "private_settings": {
                "transition_duration": 8450
            }
        },
        {
            "prev_ver": 486604803,
            "name": "6a. cams01",
            "uuid": "dd34fd6a-ff02-4701-b3b3-5eafabe767e4",
            "id": "scene",
            "versioned_id": "scene",
            "settings": {
                "id_counter": 4,
                "custom_size": false,
                "items": [
                    {
                        "name": "JACK Input Client",
                        "source_uuid": "a6283f34-d2e3-4625-873a-d7060d416c4f",
                        "visible": true,
                        "locked": false,
                        "rot": 0.0,
                        "pos": {
                            "x": 0.0,
                            "y": 0.0
                        },
                        "scale": {
                            "x": 1.0,
                            "y": 1.0
                        },
                        "align": 5,
                        "bounds_type": 0,
                        "bounds_align": 0,
                        "bounds": {
                            "x": 0.0,
                            "y": 0.0
                        },
                        "crop_left": 0,
                        "crop_top": 0,
                        "crop_right": 0,
                        "crop_bottom": 0,
                        "id": 1,
                        "group_item_backup": false,
                        "scale_filter": "disable",
                        "blend_method": "default",
                        "blend_type": "normal",
                        "show_transition": {
                            "duration": 0
                        },
                        "hide_transition": {
                            "duration": 0
                        },
                        "private_settings": {}
                    },
                    {
                        "name": "Video Capture Device (V4L2)",
                        "source_uuid": "23dd5a91-8cd2-402d-ad6b-30dcdc69d0ea",
                        "visible": true,
                        "locked": false,
                        "rot": 0.0,
                        "pos": {
                            "x": -509.0,
                            "y": 688.0
                        },
                        "scale": {
                            "x": 1.0,
                            "y": 1.0
                        },
                        "align": 5,
                        "bounds_type": 3,
                        "bounds_align": 0,
                        "bounds": {
                            "x": 8985.0,
                            "y": 2708.0
                        },
                        "crop_left": 0,
                        "crop_top": 0,
                        "crop_right": 0,
                        "crop_bottom": 0,
                        "id": 2,
                        "group_item_backup": false,
                        "scale_filter": "disable",
                        "blend_method": "default",
                        "blend_type": "normal",
                        "show_transition": {
                            "duration": 0
                        },
                        "hide_transition": {
                            "duration": 0
                        },
                        "private_settings": {}
                    },
                    {
                        "name": "Color Source 2",
                        "source_uuid": "ba88c62c-7c0c-4e8c-b016-64b053d765ca",
                        "visible": false,
                        "locked": true,
                        "rot": 0.0,
                        "pos": {
                            "x": 0.0,
                            "y": 0.0
                        },
                        "scale": {
                            "x": 1.0,
                            "y": 1.0
                        },
                        "align": 5,
                        "bounds_type": 1,
                        "bounds_align": 0,
                        "bounds": {
                            "x": 2560.0,
                            "y": 1440.0
                        },
                        "crop_left": 0,
                        "crop_top": 0,
                        "crop_right": 0,
                        "crop_bottom": 0,
                        "id": 3,
                        "group_item_backup": false,
                        "scale_filter": "disable",
                        "blend_method": "default",
                        "blend_type": "normal",
                        "show_transition": {
                            "duration": 0
                        },
                        "hide_transition": {
                            "duration": 0
                        },
                        "private_settings": {}
                    },
                    {
                        "name": "topic 2",
                        "source_uuid": "5338cb06-1133-43bf-9011-9b185eb6b502",
                        "visible": true,
                        "locked": false,
                        "rot": 0.0,
                        "pos": {
                            "x": 377.0,
                            "y": 1054.0
                        },
                        "scale": {
                            "x": 2.3062827587127686,
                            "y": 2.3015873432159424
                        },
                        "align": 5,
                        "bounds_type": 0,
                        "bounds_align": 0,
                        "bounds": {
                            "x": 703.0,
                            "y": 123.0
                        },
                        "crop_left": 0,
                        "crop_top": 0,
                        "crop_right": 0,
                        "crop_bottom": 0,
                        "id": 4,
                        "group_item_backup": false,
                        "scale_filter": "disable",
                        "blend_method": "default",
                        "blend_type": "normal",
                        "show_transition": {
                            "duration": 0
                        },
                        "hide_transition": {
                            "duration": 0
                        },
                        "private_settings": {}
                    }
                ]
            },
            "mixers": 0,
            "sync": 0,
            "flags": 0,
            "volume": 1.0,
            "balance": 0.5,
            "enabled": true,
            "muted": false,
            "push-to-mute": false,
            "push-to-mute-delay": 0,
            "push-to-talk": false,
            "push-to-talk-delay": 0,
            "hotkeys": {
                "OBSBasic.SelectScene": [],
                "libobs.show_scene_item.JACK Input Client": [],
                "libobs.hide_scene_item.JACK Input Client": [],
                "libobs.show_scene_item.Video Capture Device (V4L2)": [],
                "libobs.hide_scene_item.Video Capture Device (V4L2)": [],
                "libobs.show_scene_item.Color Source 2": [],
                "libobs.hide_scene_item.Color Source 2": [],
                "libobs.show_scene_item.topic 2": [],
                "libobs.hide_scene_item.topic 2": []
            },
            "deinterlace_mode": 0,
            "deinterlace_field_order": 0,
            "monitoring_type": 0,
            "private_settings": {
                "transition_duration": 8450
            }
        },
        {
            "prev_ver": 486604803,
            "name": "7. outtro",
            "uuid": "037301a2-41e8-44b7-80b8-0e3fa9a7f984",
            "id": "scene",
            "versioned_id": "scene",
            "settings": {
                "id_counter": 1,
                "custom_size": false,
                "items": [
                    {
                        "name": "JACK Input Client",
                        "source_uuid": "a6283f34-d2e3-4625-873a-d7060d416c4f",
                        "visible": true,
                        "locked": false,
                        "rot": 0.0,
                        "pos": {
                            "x": 0.0,
                            "y": 0.0
                        },
                        "scale": {
                            "x": 1.0,
                            "y": 1.0
                        },
                        "align": 5,
                        "bounds_type": 0,
                        "bounds_align": 0,
                        "bounds": {
                            "x": 0.0,
                            "y": 0.0
                        },
                        "crop_left": 0,
                        "crop_top": 0,
                        "crop_right": 0,
                        "crop_bottom": 0,
                        "id": 1,
                        "group_item_backup": false,
                        "scale_filter": "disable",
                        "blend_method": "default",
                        "blend_type": "normal",
                        "show_transition": {
                            "duration": 0
                        },
                        "hide_transition": {
                            "duration": 0
                        },
                        "private_settings": {}
                    }
                ]
            },
            "mixers": 0,
            "sync": 0,
            "flags": 0,
            "volume": 1.0,
            "balance": 0.5,
            "enabled": true,
            "muted": false,
            "push-to-mute": false,
            "push-to-mute-delay": 0,
            "push-to-talk": false,
            "push-to-talk-delay": 0,
            "hotkeys": {
                "OBSBasic.SelectScene": [
                    {
                        "shift": true,
                        "control": true,
                        "key": "OBS_KEY_6"
                    }
                ],
                "libobs.show_scene_item.JACK Input Client": [],
                "libobs.hide_scene_item.JACK Input Client": []
            },
            "deinterlace_mode": 0,
            "deinterlace_field_order": 0,
            "monitoring_type": 0,
            "private_settings": {}
        },
        {
            "prev_ver": 486604803,
            "name": "Color Source",
            "uuid": "362ac7ef-6a7a-471f-bdb3-f166022b361d",
            "id": "color_source",
            "versioned_id": "color_source_v3",
            "settings": {
                "color": 4286513152
            },
            "mixers": 0,
            "sync": 0,
            "flags": 0,
            "volume": 1.0,
            "balance": 0.5,
            "enabled": true,
            "muted": false,
            "push-to-mute": false,
            "push-to-mute-delay": 0,
            "push-to-talk": false,
            "push-to-talk-delay": 0,
            "hotkeys": {},
            "deinterlace_mode": 0,
            "deinterlace_field_order": 0,
            "monitoring_type": 0,
            "private_settings": {},
            "filters": [
                {
                    "prev_ver": 486604803,
                    "name": "Color Correction",
                    "uuid": "417435ea-b468-4c10-815d-ec2c754fa6ff",
                    "id": "color_filter",
                    "versioned_id": "color_filter_v2",
                    "settings": {
                        "gamma": -3.0,
                        "contrast": -4.0,
                        "brightness": -0.98219999999999996,
                        "saturation": 0.0,
                        "hue_shift": -42.399999999999999,
                        "opacity": 0.84719999999999995
                    },
                    "mixers": 0,
                    "sync": 0,
                    "flags": 0,
                    "volume": 1.0,
                    "balance": 0.5,
                    "enabled": true,
                    "muted": false,
                    "push-to-mute": false,
                    "push-to-mute-delay": 0,
                    "push-to-talk": false,
                    "push-to-talk-delay": 0,
                    "hotkeys": {},
                    "deinterlace_mode": 0,
                    "deinterlace_field_order": 0,
                    "monitoring_type": 0,
                    "private_settings": {}
                }
            ]
        },
        {
            "prev_ver": 486604803,
            "name": "Color Source 2",
            "uuid": "ba88c62c-7c0c-4e8c-b016-64b053d765ca",
            "id": "color_source",
            "versioned_id": "color_source_v3",
            "settings": {
                "color": 4286513152
            },
            "mixers": 0,
            "sync": 0,
            "flags": 0,
            "volume": 1.0,
            "balance": 0.5,
            "enabled": true,
            "muted": false,
            "push-to-mute": false,
            "push-to-mute-delay": 0,
            "push-to-talk": false,
            "push-to-talk-delay": 0,
            "hotkeys": {},
            "deinterlace_mode": 0,
            "deinterlace_field_order": 0,
            "monitoring_type": 0,
            "private_settings": {},
            "filters": [
                {
                    "prev_ver": 486604803,
                    "name": "Color Correction",
                    "uuid": "2f06724c-6560-4913-ae22-dbea4aa5e679",
                    "id": "color_filter",
                    "versioned_id": "color_filter_v2",
                    "settings": {
                        "gamma": -3.0,
                        "contrast": -4.0,
                        "brightness": -0.98219999999999996,
                        "saturation": 0.57999999999999996,
                        "hue_shift": -8.8000000000000007,
                        "opacity": 0.56769999999999998
                    },
                    "mixers": 0,
                    "sync": 0,
                    "flags": 0,
                    "volume": 1.0,
                    "balance": 0.5,
                    "enabled": true,
                    "muted": false,
                    "push-to-mute": false,
                    "push-to-mute-delay": 0,
                    "push-to-talk": false,
                    "push-to-talk-delay": 0,
                    "hotkeys": {},
                    "deinterlace_mode": 0,
                    "deinterlace_field_order": 0,
                    "monitoring_type": 0,
                    "private_settings": {}
                }
            ]
        },
        {
            "prev_ver": 486604803,
            "name": "JACK Input Client",
            "uuid": "a6283f34-d2e3-4625-873a-d7060d416c4f",
            "id": "jack_output_capture",
            "versioned_id": "jack_output_capture",
            "settings": {},
            "mixers": 255,
            "sync": 0,
            "flags": 0,
            "volume": 0.78212708234786987,
            "balance": 0.5,
            "enabled": true,
            "muted": false,
            "push-to-mute": false,
            "push-to-mute-delay": 0,
            "push-to-talk": false,
            "push-to-talk-delay": 0,
            "hotkeys": {
                "libobs.mute": [
                    {
                        "key": "OBS_KEY_VK_VOLUME_MUTE"
                    }
                ],
                "libobs.unmute": [
                    {
                        "key": "OBS_KEY_VK_VOLUME_MUTE"
                    }
                ],
                "libobs.push-to-mute": [],
                "libobs.push-to-talk": []
            },
            "deinterlace_mode": 0,
            "deinterlace_field_order": 0,
            "monitoring_type": 0,
            "private_settings": {},
            "filters": [
                {
                    "prev_ver": 486604803,
                    "name": "Gain",
                    "uuid": "e2e133b1-4fbf-4a23-b09d-9576745641c8",
                    "id": "gain_filter",
                    "versioned_id": "gain_filter",
                    "settings": {
                        "db": 3.0
                    },
                    "mixers": 255,
                    "sync": 0,
                    "flags": 0,
                    "volume": 1.0,
                    "balance": 0.5,
                    "enabled": true,
                    "muted": false,
                    "push-to-mute": false,
                    "push-to-mute-delay": 0,
                    "push-to-talk": false,
                    "push-to-talk-delay": 0,
                    "hotkeys": {},
                    "deinterlace_mode": 0,
                    "deinterlace_field_order": 0,
                    "monitoring_type": 0,
                    "private_settings": {}
                }
            ]
        },
        {
            "prev_ver": 486604803,
            "name": "main dimmed",
            "uuid": "7fc2ecbf-5616-45b9-bae0-66cbb58c3bde",
            "id": "xshm_input",
            "versioned_id": "xshm_input",
            "settings": {
                "show_cursor": false,
                "advanced": true
            },
            "mixers": 0,
            "sync": 0,
            "flags": 0,
            "volume": 1.0,
            "balance": 0.5,
            "enabled": true,
            "muted": false,
            "push-to-mute": false,
            "push-to-mute-delay": 0,
            "push-to-talk": false,
            "push-to-talk-delay": 0,
            "hotkeys": {},
            "deinterlace_mode": 0,
            "deinterlace_field_order": 0,
            "monitoring_type": 0,
            "private_settings": {},
            "filters": [
                {
                    "prev_ver": 486604803,
                    "name": "Apply LUT",
                    "uuid": "7694529b-fd7f-4614-9c31-b0d9edb9b0d5",
                    "id": "clut_filter",
                    "versioned_id": "clut_filter",
                    "settings": {
                        "image_path": "/usr/share/obs/obs-plugins/obs-filters/LUTs/posterize.png"
                    },
                    "mixers": 0,
                    "sync": 0,
                    "flags": 0,
                    "volume": 1.0,
                    "balance": 0.5,
                    "enabled": true,
                    "muted": false,
                    "push-to-mute": false,
                    "push-to-mute-delay": 0,
                    "push-to-talk": false,
                    "push-to-talk-delay": 0,
                    "hotkeys": {},
                    "deinterlace_mode": 0,
                    "deinterlace_field_order": 0,
                    "monitoring_type": 0,
                    "private_settings": {}
                },
                {
                    "prev_ver": 486604803,
                    "name": "Color Correction",
                    "uuid": "57ceedfe-0691-49ad-a746-e29ecd7e2200",
                    "id": "color_filter",
                    "versioned_id": "color_filter_v2",
                    "settings": {
                        "gamma": 2.4500000000000002,
                        "contrast": -1.8999999999999999,
                        "brightness": -0.075600000000000001,
                        "saturation": -1.0,
                        "hue_shift": -47.200000000000003,
                        "opacity": 0.3362
                    },
                    "mixers": 0,
                    "sync": 0,
                    "flags": 0,
                    "volume": 1.0,
                    "balance": 0.5,
                    "enabled": true,
                    "muted": false,
                    "push-to-mute": false,
                    "push-to-mute-delay": 0,
                    "push-to-talk": false,
                    "push-to-talk-delay": 0,
                    "hotkeys": {},
                    "deinterlace_mode": 0,
                    "deinterlace_field_order": 0,
                    "monitoring_type": 0,
                    "private_settings": {}
                },
                {
                    "prev_ver": 486604803,
                    "name": "Chroma Key",
                    "uuid": "34f06df9-e864-4174-8616-9871fceb34c1",
                    "id": "chroma_key_filter",
                    "versioned_id": "chroma_key_filter_v2",
                    "settings": {
                        "contrast": 2.0299999999999998,
                        "brightness": 0.057599999999999998,
                        "gamma": -0.29999999999999999
                    },
                    "mixers": 0,
                    "sync": 0,
                    "flags": 0,
                    "volume": 1.0,
                    "balance": 0.5,
                    "enabled": true,
                    "muted": false,
                    "push-to-mute": false,
                    "push-to-mute-delay": 0,
                    "push-to-talk": false,
                    "push-to-talk-delay": 0,
                    "hotkeys": {},
                    "deinterlace_mode": 0,
                    "deinterlace_field_order": 0,
                    "monitoring_type": 0,
                    "private_settings": {}
                },
                {
                    "prev_ver": 486604803,
                    "name": "Luma Key",
                    "uuid": "96dbcd2c-cbe2-4af7-9df4-5158234be06b",
                    "id": "luma_key_filter",
                    "versioned_id": "luma_key_filter_v2",
                    "settings": {
                        "luma_max": 0.76000000000000001,
                        "luma_min": 0.0,
                        "luma_min_smooth": 0.28499999999999998
                    },
                    "mixers": 0,
                    "sync": 0,
                    "flags": 0,
                    "volume": 1.0,
                    "balance": 0.5,
                    "enabled": true,
                    "muted": false,
                    "push-to-mute": false,
                    "push-to-mute-delay": 0,
                    "push-to-talk": false,
                    "push-to-talk-delay": 0,
                    "hotkeys": {},
                    "deinterlace_mode": 0,
                    "deinterlace_field_order": 0,
                    "monitoring_type": 0,
                    "private_settings": {}
                }
            ]
        },
        {
            "prev_ver": 486604803,
            "name": "main screen",
            "uuid": "ed1f6529-ae01-40d3-8156-18de1ce20e5a",
            "id": "xshm_input",
            "versioned_id": "xshm_input",
            "settings": {
                "show_cursor": false
            },
            "mixers": 0,
            "sync": 0,
            "flags": 0,
            "volume": 1.0,
            "balance": 0.5,
            "enabled": true,
            "muted": false,
            "push-to-mute": false,
            "push-to-mute-delay": 0,
            "push-to-talk": false,
            "push-to-talk-delay": 0,
            "hotkeys": {},
            "deinterlace_mode": 0,
            "deinterlace_field_order": 0,
            "monitoring_type": 0,
            "private_settings": {},
            "filters": [
                {
                    "prev_ver": 486604803,
                    "name": "Sharpen",
                    "uuid": "9e0b80e5-7cd5-4747-9f46-734caea85db1",
                    "id": "sharpness_filter",
                    "versioned_id": "sharpness_filter_v2",
                    "settings": {
                        "sharpness": 0.029999999999999999
                    },
                    "mixers": 0,
                    "sync": 0,
                    "flags": 0,
                    "volume": 1.0,
                    "balance": 0.5,
                    "enabled": true,
                    "muted": false,
                    "push-to-mute": false,
                    "push-to-mute-delay": 0,
                    "push-to-talk": false,
                    "push-to-talk-delay": 0,
                    "hotkeys": {},
                    "deinterlace_mode": 0,
                    "deinterlace_field_order": 0,
                    "monitoring_type": 0,
                    "private_settings": {}
                },
                {
                    "prev_ver": 486604803,
                    "name": "Color Correction",
                    "uuid": "a66d20a6-1ca6-412c-b18a-97557afb0e5a",
                    "id": "color_filter",
                    "versioned_id": "color_filter_v2",
                    "settings": {
                        "gamma": 0.089999999999999997,
                        "contrast": 0.5,
                        "brightness": -0.0115,
                        "saturation": 0.10000000000000001
                    },
                    "mixers": 0,
                    "sync": 0,
                    "flags": 0,
                    "volume": 1.0,
                    "balance": 0.5,
                    "enabled": true,
                    "muted": false,
                    "push-to-mute": false,
                    "push-to-mute-delay": 0,
                    "push-to-talk": false,
                    "push-to-talk-delay": 0,
                    "hotkeys": {},
                    "deinterlace_mode": 0,
                    "deinterlace_field_order": 0,
                    "monitoring_type": 0,
                    "private_settings": {}
                }
            ]
        },
        {
            "prev_ver": 486604803,
            "name": "side screen",
            "uuid": "703a7617-b3b1-43de-a311-a8dcf3411eef",
            "id": "xshm_input",
            "versioned_id": "xshm_input",
            "settings": {
                "screen": 1,
                "show_cursor": false
            },
            "mixers": 0,
            "sync": 0,
            "flags": 0,
            "volume": 1.0,
            "balance": 0.5,
            "enabled": true,
            "muted": false,
            "push-to-mute": false,
            "push-to-mute-delay": 0,
            "push-to-talk": false,
            "push-to-talk-delay": 0,
            "hotkeys": {},
            "deinterlace_mode": 0,
            "deinterlace_field_order": 0,
            "monitoring_type": 0,
            "private_settings": {}
        },
        {
            "prev_ver": 486604803,
            "name": "title",
            "uuid": "39853712-7dbd-4169-b244-72df32786467",
            "id": "text_ft2_source",
            "versioned_id": "text_ft2_source_v2",
            "settings": {
                "undo_sname": "topic",
                "text": "syncopated notes",
                "font": {
                    "face": "mononoki Nerd Font Mono",
                    "style": "Regular",
                    "size": 48,
                    "flags": 0
                },
                "outline": true,
                "drop_shadow": false,
                "color1": 4278234841,
                "color2": 4278234841
            },
            "mixers": 0,
            "sync": 0,
            "flags": 0,
            "volume": 1.0,
            "balance": 0.5,
            "enabled": true,
            "muted": false,
            "push-to-mute": false,
            "push-to-mute-delay": 0,
            "push-to-talk": false,
            "push-to-talk-delay": 0,
            "hotkeys": {},
            "deinterlace_mode": 0,
            "deinterlace_field_order": 0,
            "monitoring_type": 0,
            "private_settings": {}
        },
        {
            "prev_ver": 486604803,
            "name": "topic",
            "uuid": "54cb777a-1996-4a2e-a108-db26503a90c2",
            "id": "text_ft2_source",
            "versioned_id": "text_ft2_source_v2",
            "settings": {
                "text": "",
                "from_file": true,
                "text_file": "/home/b08x/Recordings/topic.txt",
                "font": {
                    "face": "mononoki Nerd Font Mono",
                    "style": "Regular",
                    "size": 48,
                    "flags": 0
                },
                "outline": true,
                "color1": 4278233855,
                "color2": 4278233855
            },
            "mixers": 0,
            "sync": 0,
            "flags": 0,
            "volume": 1.0,
            "balance": 0.5,
            "enabled": true,
            "muted": false,
            "push-to-mute": false,
            "push-to-mute-delay": 0,
            "push-to-talk": false,
            "push-to-talk-delay": 0,
            "hotkeys": {},
            "deinterlace_mode": 0,
            "deinterlace_field_order": 0,
            "monitoring_type": 0,
            "private_settings": {}
        },
        {
            "prev_ver": 486604803,
            "name": "topic 2",
            "uuid": "5338cb06-1133-43bf-9011-9b185eb6b502",
            "id": "text_ft2_source",
            "versioned_id": "text_ft2_source_v2",
            "settings": {
                "text": "",
                "from_file": true,
                "text_file": "/home/b08x/Recordings/topic.txt",
                "font": {
                    "face": "mononoki Nerd Font Mono",
                    "style": "Regular",
                    "size": 48,
                    "flags": 0
                },
                "outline": true,
                "color1": 4278233770,
                "color2": 4278233770
            },
            "mixers": 0,
            "sync": 0,
            "flags": 0,
            "volume": 1.0,
            "balance": 0.5,
            "enabled": true,
            "muted": false,
            "push-to-mute": false,
            "push-to-mute-delay": 0,
            "push-to-talk": false,
            "push-to-talk-delay": 0,
            "hotkeys": {},
            "deinterlace_mode": 0,
            "deinterlace_field_order": 0,
            "monitoring_type": 0,
            "private_settings": {}
        },
        {
            "prev_ver": 486604803,
            "name": "Video Capture Device (V4L2)",
            "uuid": "23dd5a91-8cd2-402d-ad6b-30dcdc69d0ea",
            "id": "v4l2_input",
            "versioned_id": "v4l2_input",
            "settings": {
                "device_id": "/dev/video0",
                "input": 0,
                "pixelformat": 1196444237,
                "Brightness": -42
            },
            "mixers": 0,
            "sync": 0,
            "flags": 0,
            "volume": 1.0,
            "balance": 0.5,
            "enabled": true,
            "muted": false,
            "push-to-mute": false,
            "push-to-mute-delay": 0,
            "push-to-talk": false,
            "push-to-talk-delay": 0,
            "hotkeys": {},
            "deinterlace_mode": 0,
            "deinterlace_field_order": 0,
            "monitoring_type": 0,
            "private_settings": {},
            "filters": [
                {
                    "prev_ver": 486604803,
                    "name": "Apply LUT",
                    "uuid": "dabe3df4-e3a4-47ac-bd8c-eb8f2677bbc6",
                    "id": "clut_filter",
                    "versioned_id": "clut_filter",
                    "settings": {
                        "image_path": "/usr/share/obs/obs-plugins/obs-filters/LUTs/grayscale.cube",
                        "clut_amount": 1.0
                    },
                    "mixers": 0,
                    "sync": 0,
                    "flags": 0,
                    "volume": 1.0,
                    "balance": 0.5,
                    "enabled": false,
                    "muted": false,
                    "push-to-mute": false,
                    "push-to-mute-delay": 0,
                    "push-to-talk": false,
                    "push-to-talk-delay": 0,
                    "hotkeys": {},
                    "deinterlace_mode": 0,
                    "deinterlace_field_order": 0,
                    "monitoring_type": 0,
                    "private_settings": {}
                },
                {
                    "prev_ver": 486604803,
                    "name": "Color Key",
                    "uuid": "8b42f571-613e-4b64-b527-d472c814bf82",
                    "id": "color_key_filter",
                    "versioned_id": "color_key_filter_v2",
                    "settings": {
                        "contrast": 0.050000000000000003,
                        "brightness": -0.046399999999999997,
                        "gamma": 0.52000000000000002,
                        "similarity": 278
                    },
                    "mixers": 0,
                    "sync": 0,
                    "flags": 0,
                    "volume": 1.0,
                    "balance": 0.5,
                    "enabled": false,
                    "muted": false,
                    "push-to-mute": false,
                    "push-to-mute-delay": 0,
                    "push-to-talk": false,
                    "push-to-talk-delay": 0,
                    "hotkeys": {},
                    "deinterlace_mode": 0,
                    "deinterlace_field_order": 0,
                    "monitoring_type": 0,
                    "private_settings": {}
                },
                {
                    "prev_ver": 486604803,
                    "name": "Chroma Key",
                    "uuid": "a751a598-06c4-44ed-9828-097aa5a03499",
                    "id": "chroma_key_filter",
                    "versioned_id": "chroma_key_filter_v2",
                    "settings": {
                        "contrast": 0.22,
                        "brightness": 0.078899999999999998,
                        "gamma": 0.84999999999999998
                    },
                    "mixers": 0,
                    "sync": 0,
                    "flags": 0,
                    "volume": 1.0,
                    "balance": 0.5,
                    "enabled": false,
                    "muted": false,
                    "push-to-mute": false,
                    "push-to-mute-delay": 0,
                    "push-to-talk": false,
                    "push-to-talk-delay": 0,
                    "hotkeys": {},
                    "deinterlace_mode": 0,
                    "deinterlace_field_order": 0,
                    "monitoring_type": 0,
                    "private_settings": {}
                },
                {
                    "prev_ver": 486604803,
                    "name": "Luma Key",
                    "uuid": "9d1d66ef-7079-46ab-8f82-366991bf09f2",
                    "id": "luma_key_filter",
                    "versioned_id": "luma_key_filter_v2",
                    "settings": {
                        "luma_max": 0.71719999999999995,
                        "luma_min": 0.0,
                        "luma_max_smooth": 1.0,
                        "luma_min_smooth": 0.0
                    },
                    "mixers": 0,
                    "sync": 0,
                    "flags": 0,
                    "volume": 1.0,
                    "balance": 0.5,
                    "enabled": true,
                    "muted": false,
                    "push-to-mute": false,
                    "push-to-mute-delay": 0,
                    "push-to-talk": false,
                    "push-to-talk-delay": 0,
                    "hotkeys": {},
                    "deinterlace_mode": 0,
                    "deinterlace_field_order": 0,
                    "monitoring_type": 0,
                    "private_settings": {}
                },
                {
                    "prev_ver": 486604803,
                    "name": "Color Correction",
                    "uuid": "ec9e5ce1-65f8-46cd-a393-614813b4c0b9",
                    "id": "color_filter",
                    "versioned_id": "color_filter_v2",
                    "settings": {
                        "gamma": -1.9099999999999999,
                        "contrast": -4.0,
                        "brightness": -0.2268,
                        "saturation": 3.6499999999999999,
                        "hue_shift": 180.0
                    },
                    "mixers": 0,
                    "sync": 0,
                    "flags": 0,
                    "volume": 1.0,
                    "balance": 0.5,
                    "enabled": false,
                    "muted": false,
                    "push-to-mute": false,
                    "push-to-mute-delay": 0,
                    "push-to-talk": false,
                    "push-to-talk-delay": 0,
                    "hotkeys": {},
                    "deinterlace_mode": 0,
                    "deinterlace_field_order": 0,
                    "monitoring_type": 0,
                    "private_settings": {}
                },
                {
                    "prev_ver": 486604803,
                    "name": "Color Correction 2",
                    "uuid": "2f3d86fa-650d-46ce-9c0a-67ddac377127",
                    "id": "color_filter",
                    "versioned_id": "color_filter_v2",
                    "settings": {
                        "gamma": 3.0,
                        "contrast": 4.0,
                        "brightness": -1.0,
                        "saturation": 4.2000000000000002,
                        "hue_shift": -180.0,
                        "opacity": 0.93010000000000004
                    },
                    "mixers": 0,
                    "sync": 0,
                    "flags": 0,
                    "volume": 1.0,
                    "balance": 0.5,
                    "enabled": true,
                    "muted": false,
                    "push-to-mute": false,
                    "push-to-mute-delay": 0,
                    "push-to-talk": false,
                    "push-to-talk-delay": 0,
                    "hotkeys": {},
                    "deinterlace_mode": 0,
                    "deinterlace_field_order": 0,
                    "monitoring_type": 0,
                    "private_settings": {}
                }
            ]
        }
    ]
}