{
    "current_scene": "3b. Intro with display",
    "current_program_scene": "3b. Intro with display",
    "scene_order": [
        {
            "name": "1. Intro"
        },
        {
            "name": "2. Intro Title"
        },
        {
            "name": "3a. Intro Topic with display"
        },
        {
            "name": "3b. Intro with display"
        },
        {
            "name": "4. main"
        },
        {
            "name": "5. side"
        },
        {
            "name": "6. cams01"
        },
        {
            "name": "6a. cams01"
        },
        {
            "name": "7. outtro"
        }
    ],
    "name": "simtranmission",
    "groups": [],
    "quick_transitions": [
        {
            "name": "Cut",
            "duration": 300,
            "hotkeys": [],
            "id": 1,
            "fade_to_black": false
        },
        {
            "name": "Fade",
            "duration": 300,
            "hotkeys": [],
            "id": 2,
            "fade_to_black": false
        },
        {
            "name": "Fade",
            "duration": 300,
            "hotkeys": [],
            "id": 3,
            "fade_to_black": true
        }
    ],
    "transitions": [],
    "saved_projectors": [],
    "current_transition": "Fade",
    "transition_duration": 2805,
    "preview_locked": false,
    "scaling_enabled": false,
    "scaling_level": 0,
    "scaling_off_x": 0.0,
    "scaling_off_y": 0.0,
    "modules": {
        "scripts-tool": [],
        "output-timer": {
            "streamTimerHours": 0,
            "streamTimerMinutes": 0,
            "streamTimerSeconds": 30,
            "recordTimerHours": 0,
            "recordTimerMinutes": 25,
            "recordTimerSeconds": 20,
            "autoStartStreamTimer": false,
            "autoStartRecordTimer": false,
            "pauseRecordTimer": true
        },
        "auto-scene-switcher": {
            "interval": 300,
            "non_matching_scene": "",
            "switch_if_not_matching": false,
            "active": false,
            "switches": []
        }
    },
    "sources": [
        {
            "prev_ver": 486604803,
            "name": "1. Intro",
            "uuid": "63d38c47-8176-4de1-a415-4969ac6c9273",
            "id": "scene",
            "versioned_id": "scene",
            "settings": {
                "id_counter": 2,
                "custom_size": false,
                "items": [
                    {
                        "name": "JACK Input Client",
                        "source_uuid": "f9f91ab0-cbbf-4cd4-b8f9-39c90712c935",
                        "visible": true,
                        "locked": false,
                        "rot": 0.0,
                        "pos": {
                            "x": 0.0,
                            "y": 0.0
                        },
                        "scale": {
                            "x": 1.0,
                            "y": 1.0
                        },
                        "align": 5,
                        "bounds_type": 0,
                        "bounds_align": 0,
                        "bounds": {
                            "x": 0.0,
                            "y": 0.0
                        },
                        "crop_left": 0,
                        "crop_top": 0,
                        "crop_right": 0,
                        "crop_bottom": 0,
                        "id": 1,
                        "group_item_backup": false,
                        "scale_filter": "disable",
                        "blend_method": "default",
                        "blend_type": "normal",
                        "show_transition": {
                            "duration": 0
                        },
                        "hide_transition": {
                            "duration": 0
                        },
                        "private_settings": {}
                    }
                ]
            },
            "mixers": 0,
            "sync": 0,
            "flags": 0,
            "volume": 1.0,
            "balance": 0.5,
            "enabled": true,
            "muted": false,
            "push-to-mute": false,
            "push-to-mute-delay": 0,
            "push-to-talk": false,
            "push-to-talk-delay": 0,
            "hotkeys": {
                "OBSBasic.SelectScene": [
                    {
                        "shift": true,
                        "control": true,
                        "key": "OBS_KEY_1"
                    }
                ],
                "libobs.show_scene_item.JACK Input Client": [],
                "libobs.hide_scene_item.JACK Input Client": []
            },
            "deinterlace_mode": 0,
            "deinterlace_field_order": 0,
            "monitoring_type": 0,
            "private_settings": {}
        },
        {
            "prev_ver": 486604803,
            "name": "2. Intro Title",
            "uuid": "7f790811-11e5-492b-a867-f86075c0a8cc",
            "id": "scene",
            "versioned_id": "scene",
            "settings": {
                "id_counter": 2,
                "custom_size": false,
                "items": [
                    {
                        "name": "JACK Input Client",
                        "source_uuid": "f9f91ab0-cbbf-4cd4-b8f9-39c90712c935",
                        "visible": true,
                        "locked": false,
                        "rot": 0.0,
                        "pos": {
                            "x": 0.0,
                            "y": 0.0
                        },
                        "scale": {
                            "x": 1.0,
                            "y": 1.0
                        },
                        "align": 5,
                        "bounds_type": 0,
                        "bounds_align": 0,
                        "bounds": {
                            "x": 0.0,
                            "y": 0.0
                        },
                        "crop_left": 0,
                        "crop_top": 0,
                        "crop_right": 0,
                        "crop_bottom": 0,
                        "id": 1,
                        "group_item_backup": false,
                        "scale_filter": "disable",
                        "blend_method": "default",
                        "blend_type": "normal",
                        "show_transition": {
                            "duration": 0
                        },
                        "hide_transition": {
                            "duration": 0
                        },
                        "private_settings": {}
                    },
                    {
                        "name": "title",
                        "source_uuid": "6b29efc2-fe25-43bc-a519-0470372bc807",
                        "visible": true,
                        "locked": false,
                        "rot": 0.0,
                        "pos": {
                            "x": 1466.0,
                            "y": 689.0
                        },
                        "scale": {
                            "x": 1.2376111745834351,
                            "y": 1.2380952835083008
                        },
                        "align": 5,
                        "bounds_type": 0,
                        "bounds_align": 0,
                        "bounds": {
                            "x": 703.0,
                            "y": 123.0
                        },
                        "crop_left": 0,
                        "crop_top": 0,
                        "crop_right": 0,
                        "crop_bottom": 0,
                        "id": 2,
                        "group_item_backup": false,
                        "scale_filter": "disable",
                        "blend_method": "default",
                        "blend_type": "normal",
                        "show_transition": {
                            "duration": 0
                        },
                        "hide_transition": {
                            "duration": 0
                        },
                        "private_settings": {}
                    }
                ]
            },
            "mixers": 0,
            "sync": 0,
            "flags": 0,
            "volume": 1.0,
            "balance": 0.5,
            "enabled": true,
            "muted": false,
            "push-to-mute": false,
            "push-to-mute-delay": 0,
            "push-to-talk": false,
            "push-to-talk-delay": 0,
            "hotkeys": {
                "OBSBasic.SelectScene": [
                    {
                        "shift": true,
                        "control": true,
                        "key": "OBS_KEY_2"
                    }
                ],
                "libobs.show_scene_item.JACK Input Client": [],
                "libobs.hide_scene_item.JACK Input Client": [],
                "libobs.show_scene_item.title": [],
                "libobs.hide_scene_item.title": []
            },
            "deinterlace_mode": 0,
            "deinterlace_field_order": 0,
            "monitoring_type": 0,
            "private_settings": {}
        },
        {
            "prev_ver": 486604803,
            "name": "3a. Intro Topic with display",
            "uuid": "5a6f2025-03b5-462f-90ec-b1ad9bf5b13d",
            "id": "scene",
            "versioned_id": "scene",
            "settings": {
                "id_counter": 7,
                "custom_size": false,
                "items": [
                    {
                        "name": "main dimmed",
                        "source_uuid": "b9287355-e2ac-44e6-8bec-5d4e7106c9fc",
                        "visible": false,
                        "locked": true,
                        "rot": 0.0,
                        "pos": {
                            "x": 0.0,
                            "y": 0.0
                        },
                        "scale": {
                            "x": 1.0,
                            "y": 1.0
                        },
                        "align": 5,
                        "bounds_type": 0,
                        "bounds_align": 0,
                        "bounds": {
                            "x": 0.0,
                            "y": 0.0
                        },
                        "crop_left": 0,
                        "crop_top": 0,
                        "crop_right": 0,
                        "crop_bottom": 0,
                        "id": 1,
                        "group_item_backup": false,
                        "scale_filter": "disable",
                        "blend_method": "default",
                        "blend_type": "normal",
                        "show_transition": {
                            "duration": 0
                        },
                        "hide_transition": {
                            "duration": 0
                        },
                        "private_settings": {}
                    },
                    {
                        "name": "JACK Input Client",
                        "source_uuid": "f9f91ab0-cbbf-4cd4-b8f9-39c90712c935",
                        "visible": true,
                        "locked": false,
                        "rot": 0.0,
                        "pos": {
                            "x": 0.0,
                            "y": 0.0
                        },
                        "scale": {
                            "x": 1.0,
                            "y": 1.0
                        },
                        "align": 5,
                        "bounds_type": 0,
                        "bounds_align": 0,
                        "bounds": {
                            "x": 0.0,
                            "y": 0.0
                        },
                        "crop_left": 0,
                        "crop_top": 0,
                        "crop_right": 0,
                        "crop_bottom": 0,
                        "id": 2,
                        "group_item_backup": false,
                        "scale_filter": "disable",
                        "blend_method": "default",
                        "blend_type": "normal",
                        "show_transition": {
                            "duration": 0
                        },
                        "hide_transition": {
                            "duration": 0
                        },
                        "private_settings": {}
                    },
                    {
                        "name": "Video Capture Device (V4L2)",
                        "source_uuid": "b2cebbbb-1d07-43c8-8000-0c53bc9b0a5f",
                        "visible": true,
                        "locked": false,
                        "rot": 0.0,
                        "pos": {
                            "x": 0.0,
                            "y": 0.0
                        },
                        "scale": {
                            "x": 1.0,
                            "y": 1.0
                        },
                        "align": 5,
                        "bounds_type": 1,
                        "bounds_align": 0,
                        "bounds": {
                            "x": 4225.0,
                            "y": 2966.0
                        },
                        "crop_left": 0,
                        "crop_top": 0,
                        "crop_right": 0,
                        "crop_bottom": 0,
                        "id": 5,
                        "group_item_backup": false,
                        "scale_filter": "disable",
                        "blend_method": "default",
                        "blend_type": "normal",
                        "show_transition": {
                            "duration": 0
                        },
                        "hide_transition": {
                            "duration": 0
                        },
                        "private_settings": {}
                    },
                    {
                        "name": "title",
                        "source_uuid": "6b29efc2-fe25-43bc-a519-0470372bc807",
                        "visible": false,
                        "locked": false,
                        "rot": 0.0,
                        "pos": {
                            "x": 123.0,
                            "y": 1296.0
                        },
                        "scale": {
                            "x": 1.0,
                            "y": 1.0
                        },
                        "align": 5,
                        "bounds_type": 2,
                        "bounds_align": 0,
                        "bounds": {
                            "x": 588.0,
                            "y": 88.0
                        },
                        "crop_left": 0,
                        "crop_top": 0,
                        "crop_right": 0,
                        "crop_bottom": 0,
                        "id": 3,
                        "group_item_backup": false,
                        "scale_filter": "disable",
                        "blend_method": "default",
                        "blend_type": "normal",
                        "show_transition": {
                            "duration": 0
                        },
                        "hide_transition": {
                            "duration": 0
                        },
                        "private_settings": {}
                    },
                    {
                        "name": "Color Source",
                        "source_uuid": "d6b8b830-d994-4448-9bd9-dbce65686de2",
                        "visible": false,
                        "locked": false,
                        "rot": 0.0,
                        "pos": {
                            "x": 19.0,
                            "y": 42.0
                        },
                        "scale": {
                            "x": 1.0,
                            "y": 1.0
                        },
                        "align": 5,
                        "bounds_type": 1,
                        "bounds_align": 0,
                        "bounds": {
                            "x": 2560.0,
                            "y": 1440.0
                        },
                        "crop_left": 0,
                        "crop_top": 0,
                        "crop_right": 0,
                        "crop_bottom": 0,
                        "id": 7,
                        "group_item_backup": false,
                        "scale_filter": "disable",
                        "blend_method": "default",
                        "blend_type": "normal",
                        "show_transition": {
                            "duration": 0
                        },
                        "hide_transition": {
                            "duration": 0
                        },
                        "private_settings": {}
                    },
                    {
                        "name": "topic",
                        "source_uuid": "df5f081f-5415-4928-a17f-6114b4326258",
                        "visible": false,
                        "locked": false,
                        "rot": 0.0,
                        "pos": {
                            "x": 1038.0,
                            "y": 1362.0
                        },
                        "scale": {
                            "x": 1.2376111745834351,
                            "y": 1.2380952835083008
                        },
                        "align": 5,
                        "bounds_type": 0,
                        "bounds_align": 0,
                        "bounds": {
                            "x": 703.0,
                            "y": 123.0
                        },
                        "crop_left": 0,
                        "crop_top": 0,
                        "crop_right": 0,
                        "crop_bottom": 0,
                        "id": 6,
                        "group_item_backup": false,
                        "scale_filter": "disable",
                        "blend_method": "default",
                        "blend_type": "normal",
                        "show_transition": {
                            "duration": 0
                        },
                        "hide_transition": {
                            "duration": 0
                        },
                        "private_settings": {}
                    }
                ]
            },
            "mixers": 0,
            "sync": 0,
            "flags": 0,
            "volume": 1.0,
            "balance": 0.5,
            "enabled": true,
            "muted": false,
            "push-to-mute": false,
            "push-to-mute-delay": 0,
            "push-to-talk": false,
            "push-to-talk-delay": 0,
            "hotkeys": {
                "OBSBasic.SelectScene": [
                    {
                        "shift": true,
                        "control": true,
                        "key": "OBS_KEY_3"
                    }
                ],
                "libobs.show_scene_item.main dimmed": [],
                "libobs.hide_scene_item.main dimmed": [],
                "libobs.show_scene_item.JACK Input Client": [],
                "libobs.hide_scene_item.JACK Input Client": [],
                "libobs.show_scene_item.Video Capture Device (V4L2)": [],
                "libobs.hide_scene_item.Video Capture Device (V4L2)": [],
                "libobs.show_scene_item.title": [],
                "libobs.hide_scene_item.title": [],
                "libobs.show_scene_item.Color Source": [],
                "libobs.hide_scene_item.Color Source": [],
                "libobs.show_scene_item.topic": [],
                "libobs.hide_scene_item.topic": []
            },
            "deinterlace_mode": 0,
            "deinterlace_field_order": 0,
            "monitoring_type": 0,
            "private_settings": {
                "transition": "Fade",
                "transition_duration": 14150
            }
        },
        {
            "prev_ver": 486604803,
            "name": "3b. Intro with display",
            "uuid": "5b016131-37aa-4a6f-9a42-f1ded32999dc",
            "id": "scene",
            "versioned_id": "scene",
            "settings": {
                "id_counter": 5,
                "custom_size": false,
                "items": [
                    {
                        "name": "main dimmed",
                        "source_uuid": "b9287355-e2ac-44e6-8bec-5d4e7106c9fc",
                        "visible": false,
                        "locked": true,
                        "rot": 0.0,
                        "pos": {
                            "x": 0.0,
                            "y": 0.0
                        },
                        "scale": {
                            "x": 1.0,
                            "y": 1.0
                        },
                        "align": 5,
                        "bounds_type": 0,
                        "bounds_align": 0,
                        "bounds": {
                            "x": 0.0,
                            "y": 0.0
                        },
                        "crop_left": 0,
                        "crop_top": 0,
                        "crop_right": 0,
                        "crop_bottom": 0,
                        "id": 1,
                        "group_item_backup": false,
                        "scale_filter": "disable",
                        "blend_method": "default",
                        "blend_type": "normal",
                        "show_transition": {
                            "duration": 0
                        },
                        "hide_transition": {
                            "duration": 0
                        },
                        "private_settings": {}
                    },
                    {
                        "name": "JACK Input Client",
                        "source_uuid": "f9f91ab0-cbbf-4cd4-b8f9-39c90712c935",
                        "visible": true,
                        "locked": false,
                        "rot": 0.0,
                        "pos": {
                            "x": 0.0,
                            "y": 0.0
                        },
                        "scale": {
                            "x": 1.0,
                            "y": 1.0
                        },
                        "align": 5,
                        "bounds_type": 0,
                        "bounds_align": 0,
                        "bounds": {
                            "x": 0.0,
                            "y": 0.0
                        },
                        "crop_left": 0,
                        "crop_top": 0,
                        "crop_right": 0,
                        "crop_bottom": 0,
                        "id": 2,
                        "group_item_backup": false,
                        "scale_filter": "disable",
                        "blend_method": "default",
                        "blend_type": "normal",
                        "show_transition": {
                            "duration": 0
                        },
                        "hide_transition": {
                            "duration": 0
                        },
                        "private_settings": {}
                    },
                    {
                        "name": "Video Capture Device (V4L2)",
                        "source_uuid": "b2cebbbb-1d07-43c8-8000-0c53bc9b0a5f",
                        "visible": true,
                        "locked": false,
                        "rot": 0.0,
                        "pos": {
                            "x": -1152.0,
                            "y": 78.0
                        },
                        "scale": {
                            "x": 1.0,
                            "y": 1.0
                        },
                        "align": 5,
                        "bounds_type": 1,
                        "bounds_align": 0,
                        "bounds": {
                            "x": 4842.0,
                            "y": 1719.0
                        },
                        "crop_left": 0,
                        "crop_top": 0,
                        "crop_right": 0,
                        "crop_bottom": 0,
                        "id": 3,
                        "group_item_backup": false,
                        "scale_filter": "disable",
                        "blend_method": "default",
                        "blend_type": "normal",
                        "show_transition": {
                            "duration": 0
                        },
                        "hide_transition": {
                            "duration": 0
                        },
                        "private_settings": {}
                    },
                    {
                        "name": "title",
                        "source_uuid": "6b29efc2-fe25-43bc-a519-0470372bc807",
                        "visible": false,
                        "locked": false,
                        "rot": 0.0,
                        "pos": {
                            "x": 121.0,
                            "y": 1296.0
                        },
                        "scale": {
                            "x": 1.0,
                            "y": 1.0
                        },
                        "align": 5,
                        "bounds_type": 2,
                        "bounds_align": 0,
                        "bounds": {
                            "x": 588.0,
                            "y": 88.0
                        },
                        "crop_left": 0,
                        "crop_top": 0,
                        "crop_right": 0,
                        "crop_bottom": 0,
                        "id": 4,
                        "group_item_backup": false,
                        "scale_filter": "disable",
                        "blend_method": "default",
                        "blend_type": "normal",
                        "show_transition": {
                            "duration": 0
                        },
                        "hide_transition": {
                            "duration": 0
                        },
                        "private_settings": {}
                    },
                    {
                        "name": "topic",
                        "source_uuid": "df5f081f-5415-4928-a17f-6114b4326258",
                        "visible": true,
                        "locked": false,
                        "rot": 0.0,
                        "pos": {
                            "x": 367.0,
                            "y": 1361.0
                        },
                        "scale": {
                            "x": 1.0,
                            "y": 1.0
                        },
                        "align": 5,
                        "bounds_type": 0,
                        "bounds_align": 0,
                        "bounds": {
                            "x": 0.0,
                            "y": 0.0
                        },
                        "crop_left": 0,
                        "crop_top": 0,
                        "crop_right": 0,
                        "crop_bottom": 0,
                        "id": 5,
                        "group_item_backup": false,
                        "scale_filter": "disable",
                        "blend_method": "default",
                        "blend_type": "normal",
                        "show_transition": {
                            "duration": 0
                        },
                        "hide_transition": {
                            "duration": 0
                        },
                        "private_settings": {}
                    }
                ]
            },
            "mixers": 0,
            "sync": 0,
            "flags": 0,
            "volume": 1.0,
            "balance": 0.5,
            "enabled": true,
            "muted": false,
            "push-to-mute": false,
            "push-to-mute-delay": 0,
            "push-to-talk": false,
            "push-to-talk-delay": 0,
            "hotkeys": {
                "OBSBasic.SelectScene": [
                    {
                        "shift": true,
                        "control": true,
                        "alt": true,
                        "key": "OBS_KEY_3"
                    }
                ],
                "libobs.show_scene_item.main dimmed": [],
                "libobs.hide_scene_item.main dimmed": [],
                "libobs.show_scene_item.JACK Input Client": [],
                "libobs.hide_scene_item.JACK Input Client": [],
                "libobs.show_scene_item.Video Capture Device (V4L2)": [],
                "libobs.hide_scene_item.Video Capture Device (V4L2)": [],
                "libobs.show_scene_item.title": [],
                "libobs.hide_scene_item.title": [],
                "libobs.show_scene_item.topic": [],
                "libobs.hide_scene_item.topic": []
            },
            "deinterlace_mode": 0,
            "deinterlace_field_order": 0,
            "monitoring_type": 0,
            "private_settings": {
                "transition": "Fade",
                "transition_duration": 7900
            }
        },
        {
            "prev_ver": 486604803,
            "name": "4. main",
            "uuid": "a939f746-4870-43f1-a382-c295574db5ef",
            "id": "scene",
            "versioned_id": "scene",
            "settings": {
                "id_counter": 3,
                "custom_size": false,
                "items": [
                    {
                        "name": "main screen",
                        "source_uuid": "305a7493-cee0-4757-8365-a298a1018548",
                        "visible": true,
                        "locked": false,
                        "rot": 0.0,
                        "pos": {
                            "x": 0.0,
                            "y": 0.0
                        },
                        "scale": {
                            "x": 1.0,
                            "y": 1.0
                        },
                        "align": 5,
                        "bounds_type": 0,
                        "bounds_align": 0,
                        "bounds": {
                            "x": 0.0,
                            "y": 0.0
                        },
                        "crop_left": 0,
                        "crop_top": 0,
                        "crop_right": 0,
                        "crop_bottom": 0,
                        "id": 3,
                        "group_item_backup": false,
                        "scale_filter": "disable",
                        "blend_method": "default",
                        "blend_type": "normal",
                        "show_transition": {
                            "duration": 0
                        },
                        "hide_transition": {
                            "duration": 0
                        },
                        "private_settings": {}
                    },
                    {
                        "name": "JACK Input Client",
                        "source_uuid": "f9f91ab0-cbbf-4cd4-b8f9-39c90712c935",
                        "visible": true,
                        "locked": false,
                        "rot": 0.0,
                        "pos": {
                            "x": 0.0,
                            "y": 0.0
                        },
                        "scale": {
                            "x": 1.0,
                            "y": 1.0
                        },
                        "align": 5,
                        "bounds_type": 0,
                        "bounds_align": 0,
                        "bounds": {
                            "x": 0.0,
                            "y": 0.0
                        },
                        "crop_left": 0,
                        "crop_top": 0,
                        "crop_right": 0,
                        "crop_bottom": 0,
                        "id": 2,
                        "group_item_backup": false,
                        "scale_filter": "disable",
                        "blend_method": "default",
                        "blend_type": "normal",
                        "show_transition": {
                            "duration": 0
                        },
                        "hide_transition": {
                            "duration": 0
                        },
                        "private_settings": {}
                    }
                ]
            },
            "mixers": 0,
            "sync": 0,
            "flags": 0,
            "volume": 1.0,
            "balance": 0.5,
            "enabled": true,
            "muted": false,
            "push-to-mute": false,
            "push-to-mute-delay": 0,
            "push-to-talk": false,
            "push-to-talk-delay": 0,
            "hotkeys": {
                "OBSBasic.SelectScene": [
                    {
                        "shift": true,
                        "control": true,
                        "key": "OBS_KEY_4"
                    }
                ],
                "libobs.show_scene_item.main screen": [],
                "libobs.hide_scene_item.main screen": [],
                "libobs.show_scene_item.JACK Input Client": [],
                "libobs.hide_scene_item.JACK Input Client": []
            },
            "deinterlace_mode": 0,
            "deinterlace_field_order": 0,
            "monitoring_type": 0,
            "private_settings": {}
        },
        {
            "prev_ver": 486604803,
            "name": "5. side",
            "uuid": "e2857e3a-e002-4e2d-bd98-cb8958e305d3",
            "id": "scene",
            "versioned_id": "scene",
            "settings": {
                "id_counter": 3,
                "custom_size": false,
                "items": [
                    {
                        "name": "JACK Input Client",
                        "source_uuid": "f9f91ab0-cbbf-4cd4-b8f9-39c90712c935",
                        "visible": true,
                        "locked": false,
                        "rot": 0.0,
                        "pos": {
                            "x": 0.0,
                            "y": 0.0
                        },
                        "scale": {
                            "x": 1.0,
                            "y": 1.0
                        },
                        "align": 5,
                        "bounds_type": 0,
                        "bounds_align": 0,
                        "bounds": {
                            "x": 0.0,
                            "y": 0.0
                        },
                        "crop_left": 0,
                        "crop_top": 0,
                        "crop_right": 0,
                        "crop_bottom": 0,
                        "id": 1,
                        "group_item_backup": false,
                        "scale_filter": "disable",
                        "blend_method": "default",
                        "blend_type": "normal",
                        "show_transition": {
                            "duration": 0
                        },
                        "hide_transition": {
                            "duration": 0
                        },
                        "private_settings": {}
                    },
                    {
                        "name": "side screen",
                        "source_uuid": "dd83e1f2-faa3-4f45-829e-6428687f65f4",
                        "visible": true,
                        "locked": false,
                        "rot": 0.0,
                        "pos": {
                            "x": 0.0,
                            "y": 0.0
                        },
                        "scale": {
                            "x": 1.0,
                            "y": 1.0
                        },
                        "align": 5,
                        "bounds_type": 2,
                        "bounds_align": 0,
                        "bounds": {
                            "x": 2560.0,
                            "y": 1440.0
                        },
                        "crop_left": 0,
                        "crop_top": 0,
                        "crop_right": 0,
                        "crop_bottom": 0,
                        "id": 3,
                        "group_item_backup": false,
                        "scale_filter": "disable",
                        "blend_method": "default",
                        "blend_type": "normal",
                        "show_transition": {
                            "duration": 0
                        },
                        "hide_transition": {
                            "duration": 0
                        },
                        "private_settings": {}
                    }
                ]
            },
            "mixers": 0,
            "sync": 0,
            "flags": 0,
            "volume": 1.0,
            "balance": 0.5,
            "enabled": true,
            "muted": false,
            "push-to-mute": false,
            "push-to-mute-delay": 0,
            "push-to-talk": false,
            "push-to-talk-delay": 0,
            "hotkeys": {
                "OBSBasic.SelectScene": [
                    {
                        "shift": true,
                        "control": true,
                        "key": "OBS_KEY_5"
                    }
                ],
                "libobs.show_scene_item.JACK Input Client": [],
                "libobs.hide_scene_item.JACK Input Client": [],
                "libobs.show_scene_item.side screen": [],
                "libobs.hide_scene_item.side screen": []
            },
            "deinterlace_mode": 0,
            "deinterlace_field_order": 0,
            "monitoring_type": 0,
            "private_settings": {
                "transition": "Fade",
                "transition_duration": 650
            }
        },
        {
            "prev_ver": 486604803,
            "name": "6. cams01",
            "uuid": "b4b7b8d0-2ed4-4f73-b660-846959cd64d5",
            "id": "scene",
            "versioned_id": "scene",
            "settings": {
                "id_counter": 5,
                "custom_size": false,
                "items": [
                    {
                        "name": "JACK Input Client",
                        "source_uuid": "f9f91ab0-cbbf-4cd4-b8f9-39c90712c935",
                        "visible": true,
                        "locked": false,
                        "rot": 0.0,
                        "pos": {
                            "x": 0.0,
                            "y": 0.0
                        },
                        "scale": {
                            "x": 1.0,
                            "y": 1.0
                        },
                        "align": 5,
                        "bounds_type": 0,
                        "bounds_align": 0,
                        "bounds": {
                            "x": 0.0,
                            "y": 0.0
                        },
                        "crop_left": 0,
                        "crop_top": 0,
                        "crop_right": 0,
                        "crop_bottom": 0,
                        "id": 1,
                        "group_item_backup": false,
                        "scale_filter": "disable",
                        "blend_method": "default",
                        "blend_type": "normal",
                        "show_transition": {
                            "duration": 0
                        },
                        "hide_transition": {
                            "duration": 0
                        },
                        "private_settings": {}
                    },
                    {
                        "name": "Video Capture Device (V4L2)",
                        "source_uuid": "b2cebbbb-1d07-43c8-8000-0c53bc9b0a5f",
                        "visible": true,
                        "locked": false,
                        "rot": 0.0,
                        "pos": {
                            "x": -749.0,
                            "y": 0.0
                        },
                        "scale": {
                            "x": 1.0,
                            "y": 1.0
                        },
                        "align": 5,
                        "bounds_type": 3,
                        "bounds_align": 0,
                        "bounds": {
                            "x": 3451.0,
                            "y": 1892.0
                        },
                        "crop_left": 0,
                        "crop_top": 0,
                        "crop_right": 0,
                        "crop_bottom": 0,
                        "id": 3,
                        "group_item_backup": false,
                        "scale_filter": "disable",
                        "blend_method": "default",
                        "blend_type": "normal",
                        "show_transition": {
                            "duration": 0
                        },
                        "hide_transition": {
                            "duration": 0
                        },
                        "private_settings": {}
                    },
                    {
                        "name": "Color Source 2",
                        "source_uuid": "b68b8223-e36c-4a15-b4d1-97d7551c3f06",
                        "visible": true,
                        "locked": false,
                        "rot": 0.0,
                        "pos": {
                            "x": 0.0,
                            "y": 0.0
                        },
                        "scale": {
                            "x": 1.0,
                            "y": 1.0
                        },
                        "align": 5,
                        "bounds_type": 1,
                        "bounds_align": 0,
                        "bounds": {
                            "x": 2560.0,
                            "y": 1440.0
                        },
                        "crop_left": 0,
                        "crop_top": 0,
                        "crop_right": 0,
                        "crop_bottom": 0,
                        "id": 5,
                        "group_item_backup": false,
                        "scale_filter": "disable",
                        "blend_method": "default",
                        "blend_type": "normal",
                        "show_transition": {
                            "duration": 0
                        },
                        "hide_transition": {
                            "duration": 0
                        },
                        "private_settings": {}
                    },
                    {
                        "name": "topic 2",
                        "source_uuid": "6d905684-0cea-4d00-b3f8-6b52a172c110",
                        "visible": true,
                        "locked": false,
                        "rot": 0.0,
                        "pos": {
                            "x": 963.0,
                            "y": 1174.0
                        },
                        "scale": {
                            "x": 1.2376111745834351,
                            "y": 1.2380952835083008
                        },
                        "align": 5,
                        "bounds_type": 0,
                        "bounds_align": 0,
                        "bounds": {
                            "x": 703.0,
                            "y": 123.0
                        },
                        "crop_left": 0,
                        "crop_top": 0,
                        "crop_right": 0,
                        "crop_bottom": 0,
                        "id": 4,
                        "group_item_backup": false,
                        "scale_filter": "disable",
                        "blend_method": "default",
                        "blend_type": "normal",
                        "show_transition": {
                            "duration": 0
                        },
                        "hide_transition": {
                            "duration": 0
                        },
                        "private_settings": {}
                    }
                ]
            },
            "mixers": 0,
            "sync": 0,
            "flags": 0,
            "volume": 1.0,
            "balance": 0.5,
            "enabled": true,
            "muted": false,
            "push-to-mute": false,
            "push-to-mute-delay": 0,
            "push-to-talk": false,
            "push-to-talk-delay": 0,
            "hotkeys": {
                "OBSBasic.SelectScene": [
                    {
                        "shift": true,
                        "control": true,
                        "alt": true,
                        "key": "OBS_KEY_5"
                    }
                ],
                "libobs.show_scene_item.JACK Input Client": [],
                "libobs.hide_scene_item.JACK Input Client": [],
                "libobs.show_scene_item.Video Capture Device (V4L2)": [],
                "libobs.hide_scene_item.Video Capture Device (V4L2)": [],
                "libobs.show_scene_item.Color Source 2": [],
                "libobs.hide_scene_item.Color Source 2": [],
                "libobs.show_scene_item.topic 2": [],
                "libobs.hide_scene_item.topic 2": []
            },
            "deinterlace_mode": 0,
            "deinterlace_field_order": 0,
            "monitoring_type": 0,
            "private_settings": {
                "transition_duration": 8450
            }
        },
        {
            "prev_ver": 486604803,
            "name": "6a. cams01",
            "uuid": "4133976b-7be2-498d-99e2-ba6375c4d044",
            "id": "scene",
            "versioned_id": "scene",
            "settings": {
                "id_counter": 4,
                "custom_size": false,
                "items": [
                    {
                        "name": "JACK Input Client",
                        "source_uuid": "f9f91ab0-cbbf-4cd4-b8f9-39c90712c935",
                        "visible": true,
                        "locked": false,
                        "rot": 0.0,
                        "pos": {
                            "x": 0.0,
                            "y": 0.0
                        },
                        "scale": {
                            "x": 1.0,
                            "y": 1.0
                        },
                        "align": 5,
                        "bounds_type": 0,
                        "bounds_align": 0,
                        "bounds": {
                            "x": 0.0,
                            "y": 0.0
                        },
                        "crop_left": 0,
                        "crop_top": 0,
                        "crop_right": 0,
                        "crop_bottom": 0,
                        "id": 1,
                        "group_item_backup": false,
                        "scale_filter": "disable",
                        "blend_method": "default",
                        "blend_type": "normal",
                        "show_transition": {
                            "duration": 0
                        },
                        "hide_transition": {
                            "duration": 0
                        },
                        "private_settings": {}
                    },
                    {
                        "name": "Video Capture Device (V4L2)",
                        "source_uuid": "b2cebbbb-1d07-43c8-8000-0c53bc9b0a5f",
                        "visible": true,
                        "locked": false,
                        "rot": 0.0,
                        "pos": {
                            "x": -509.0,
                            "y": 688.0
                        },
                        "scale": {
                            "x": 1.0,
                            "y": 1.0
                        },
                        "align": 5,
                        "bounds_type": 3,
                        "bounds_align": 0,
                        "bounds": {
                            "x": 8985.0,
                            "y": 2708.0
                        },
                        "crop_left": 0,
                        "crop_top": 0,
                        "crop_right": 0,
                        "crop_bottom": 0,
                        "id": 2,
                        "group_item_backup": false,
                        "scale_filter": "disable",
                        "blend_method": "default",
                        "blend_type": "normal",
                        "show_transition": {
                            "duration": 0
                        },
                        "hide_transition": {
                            "duration": 0
                        },
                        "private_settings": {}
                    },
                    {
                        "name": "Color Source 2",
                        "source_uuid": "b68b8223-e36c-4a15-b4d1-97d7551c3f06",
                        "visible": false,
                        "locked": true,
                        "rot": 0.0,
                        "pos": {
                            "x": 0.0,
                            "y": 0.0
                        },
                        "scale": {
                            "x": 1.0,
                            "y": 1.0
                        },
                        "align": 5,
                        "bounds_type": 1,
                        "bounds_align": 0,
                        "bounds": {
                            "x": 2560.0,
                            "y": 1440.0
                        },
                        "crop_left": 0,
                        "crop_top": 0,
                        "crop_right": 0,
                        "crop_bottom": 0,
                        "id": 3,
                        "group_item_backup": false,
                        "scale_filter": "disable",
                        "blend_method": "default",
                        "blend_type": "normal",
                        "show_transition": {
                            "duration": 0
                        },
                        "hide_transition": {
                            "duration": 0
                        },
                        "private_settings": {}
                    },
                    {
                        "name": "topic 2",
                        "source_uuid": "6d905684-0cea-4d00-b3f8-6b52a172c110",
                        "visible": true,
                        "locked": false,
                        "rot": 0.0,
                        "pos": {
                            "x": 377.0,
                            "y": 1054.0
                        },
                        "scale": {
                            "x": 2.3062827587127686,
                            "y": 2.3015873432159424
                        },
                        "align": 5,
                        "bounds_type": 0,
                        "bounds_align": 0,
                        "bounds": {
                            "x": 703.0,
                            "y": 123.0
                        },
                        "crop_left": 0,
                        "crop_top": 0,
                        "crop_right": 0,
                        "crop_bottom": 0,
                        "id": 4,
                        "group_item_backup": false,
                        "scale_filter": "disable",
                        "blend_method": "default",
                        "blend_type": "normal",
                        "show_transition": {
                            "duration": 0
                        },
                        "hide_transition": {
                            "duration": 0
                        },
                        "private_settings": {}
                    }
                ]
            },
            "mixers": 0,
            "sync": 0,
            "flags": 0,
            "volume": 1.0,
            "balance": 0.5,
            "enabled": true,
            "muted": false,
            "push-to-mute": false,
            "push-to-mute-delay": 0,
            "push-to-talk": false,
            "push-to-talk-delay": 0,
            "hotkeys": {
                "OBSBasic.SelectScene": [],
                "libobs.show_scene_item.JACK Input Client": [],
                "libobs.hide_scene_item.JACK Input Client": [],
                "libobs.show_scene_item.Video Capture Device (V4L2)": [],
                "libobs.hide_scene_item.Video Capture Device (V4L2)": [],
                "libobs.show_scene_item.Color Source 2": [],
                "libobs.hide_scene_item.Color Source 2": [],
                "libobs.show_scene_item.topic 2": [],
                "libobs.hide_scene_item.topic 2": []
            },
            "deinterlace_mode": 0,
            "deinterlace_field_order": 0,
            "monitoring_type": 0,
            "private_settings": {
                "transition_duration": 8450
            }
        },
        {
            "prev_ver": 486604803,
            "name": "7. outtro",
            "uuid": "31641e53-4f35-4ab0-9c1b-e21607d5771d",
            "id": "scene",
            "versioned_id": "scene",
            "settings": {
                "id_counter": 1,
                "custom_size": false,
                "items": [
                    {
                        "name": "JACK Input Client",
                        "source_uuid": "f9f91ab0-cbbf-4cd4-b8f9-39c90712c935",
                        "visible": true,
                        "locked": false,
                        "rot": 0.0,
                        "pos": {
                            "x": 0.0,
                            "y": 0.0
                        },
                        "scale": {
                            "x": 1.0,
                            "y": 1.0
                        },
                        "align": 5,
                        "bounds_type": 0,
                        "bounds_align": 0,
                        "bounds": {
                            "x": 0.0,
                            "y": 0.0
                        },
                        "crop_left": 0,
                        "crop_top": 0,
                        "crop_right": 0,
                        "crop_bottom": 0,
                        "id": 1,
                        "group_item_backup": false,
                        "scale_filter": "disable",
                        "blend_method": "default",
                        "blend_type": "normal",
                        "show_transition": {
                            "duration": 0
                        },
                        "hide_transition": {
                            "duration": 0
                        },
                        "private_settings": {}
                    }
                ]
            },
            "mixers": 0,
            "sync": 0,
            "flags": 0,
            "volume": 1.0,
            "balance": 0.5,
            "enabled": true,
            "muted": false,
            "push-to-mute": false,
            "push-to-mute-delay": 0,
            "push-to-talk": false,
            "push-to-talk-delay": 0,
            "hotkeys": {
                "OBSBasic.SelectScene": [
                    {
                        "shift": true,
                        "control": true,
                        "key": "OBS_KEY_6"
                    }
                ],
                "libobs.show_scene_item.JACK Input Client": [],
                "libobs.hide_scene_item.JACK Input Client": []
            },
            "deinterlace_mode": 0,
            "deinterlace_field_order": 0,
            "monitoring_type": 0,
            "private_settings": {}
        },
        {
            "prev_ver": 486604803,
            "name": "Color Source",
            "uuid": "d6b8b830-d994-4448-9bd9-dbce65686de2",
            "id": "color_source",
            "versioned_id": "color_source_v3",
            "settings": {
                "color": 4286513152
            },
            "mixers": 0,
            "sync": 0,
            "flags": 0,
            "volume": 1.0,
            "balance": 0.5,
            "enabled": true,
            "muted": false,
            "push-to-mute": false,
            "push-to-mute-delay": 0,
            "push-to-talk": false,
            "push-to-talk-delay": 0,
            "hotkeys": {},
            "deinterlace_mode": 0,
            "deinterlace_field_order": 0,
            "monitoring_type": 0,
            "private_settings": {},
            "filters": [
                {
                    "prev_ver": 486604803,
                    "name": "Color Correction",
                    "uuid": "2b9a40ea-91f2-41e5-be9b-34df29328300",
                    "id": "color_filter",
                    "versioned_id": "color_filter_v2",
                    "settings": {
                        "gamma": -3.0,
                        "contrast": -4.0,
                        "brightness": -0.98219999999999996,
                        "saturation": 0.0,
                        "hue_shift": -42.399999999999999,
                        "opacity": 0.84719999999999995
                    },
                    "mixers": 0,
                    "sync": 0,
                    "flags": 0,
                    "volume": 1.0,
                    "balance": 0.5,
                    "enabled": true,
                    "muted": false,
                    "push-to-mute": false,
                    "push-to-mute-delay": 0,
                    "push-to-talk": false,
                    "push-to-talk-delay": 0,
                    "hotkeys": {},
                    "deinterlace_mode": 0,
                    "deinterlace_field_order": 0,
                    "monitoring_type": 0,
                    "private_settings": {}
                }
            ]
        },
        {
            "prev_ver": 486604803,
            "name": "Color Source 2",
            "uuid": "b68b8223-e36c-4a15-b4d1-97d7551c3f06",
            "id": "color_source",
            "versioned_id": "color_source_v3",
            "settings": {
                "color": 4286513152
            },
            "mixers": 0,
            "sync": 0,
            "flags": 0,
            "volume": 1.0,
            "balance": 0.5,
            "enabled": true,
            "muted": false,
            "push-to-mute": false,
            "push-to-mute-delay": 0,
            "push-to-talk": false,
            "push-to-talk-delay": 0,
            "hotkeys": {},
            "deinterlace_mode": 0,
            "deinterlace_field_order": 0,
            "monitoring_type": 0,
            "private_settings": {},
            "filters": [
                {
                    "prev_ver": 486604803,
                    "name": "Color Correction",
                    "uuid": "9d539f0a-1aea-44e7-ae7d-38a45e04b245",
                    "id": "color_filter",
                    "versioned_id": "color_filter_v2",
                    "settings": {
                        "gamma": -3.0,
                        "contrast": -4.0,
                        "brightness": -0.98219999999999996,
                        "saturation": 0.57999999999999996,
                        "hue_shift": -8.8000000000000007,
                        "opacity": 0.56769999999999998
                    },
                    "mixers": 0,
                    "sync": 0,
                    "flags": 0,
                    "volume": 1.0,
                    "balance": 0.5,
                    "enabled": true,
                    "muted": false,
                    "push-to-mute": false,
                    "push-to-mute-delay": 0,
                    "push-to-talk": false,
                    "push-to-talk-delay": 0,
                    "hotkeys": {},
                    "deinterlace_mode": 0,
                    "deinterlace_field_order": 0,
                    "monitoring_type": 0,
                    "private_settings": {}
                }
            ]
        },
        {
            "prev_ver": 486604803,
            "name": "JACK Input Client",
            "uuid": "f9f91ab0-cbbf-4cd4-b8f9-39c90712c935",
            "id": "jack_output_capture",
            "versioned_id": "jack_output_capture",
            "settings": {},
            "mixers": 255,
            "sync": 0,
            "flags": 0,
            "volume": 0.78212708234786987,
            "balance": 0.5,
            "enabled": true,
            "muted": false,
            "push-to-mute": false,
            "push-to-mute-delay": 0,
            "push-to-talk": false,
            "push-to-talk-delay": 0,
            "hotkeys": {
                "libobs.mute": [
                    {
                        "key": "OBS_KEY_VK_VOLUME_MUTE"
                    }
                ],
                "libobs.unmute": [
                    {
                        "key": "OBS_KEY_VK_VOLUME_MUTE"
                    }
                ],
                "libobs.push-to-mute": [],
                "libobs.push-to-talk": []
            },
            "deinterlace_mode": 0,
            "deinterlace_field_order": 0,
            "monitoring_type": 0,
            "private_settings": {},
            "filters": [
                {
                    "prev_ver": 486604803,
                    "name": "Gain",
                    "uuid": "17cbb391-62a1-4607-9756-f08e9c3ae1db",
                    "id": "gain_filter",
                    "versioned_id": "gain_filter",
                    "settings": {
                        "db": 3.0
                    },
                    "mixers": 255,
                    "sync": 0,
                    "flags": 0,
                    "volume": 1.0,
                    "balance": 0.5,
                    "enabled": true,
                    "muted": false,
                    "push-to-mute": false,
                    "push-to-mute-delay": 0,
                    "push-to-talk": false,
                    "push-to-talk-delay": 0,
                    "hotkeys": {},
                    "deinterlace_mode": 0,
                    "deinterlace_field_order": 0,
                    "monitoring_type": 0,
                    "private_settings": {}
                }
            ]
        },
        {
            "prev_ver": 486604803,
            "name": "main dimmed",
            "uuid": "b9287355-e2ac-44e6-8bec-5d4e7106c9fc",
            "id": "xshm_input",
            "versioned_id": "xshm_input",
            "settings": {
                "show_cursor": false,
                "advanced": true
            },
            "mixers": 0,
            "sync": 0,
            "flags": 0,
            "volume": 1.0,
            "balance": 0.5,
            "enabled": true,
            "muted": false,
            "push-to-mute": false,
            "push-to-mute-delay": 0,
            "push-to-talk": false,
            "push-to-talk-delay": 0,
            "hotkeys": {},
            "deinterlace_mode": 0,
            "deinterlace_field_order": 0,
            "monitoring_type": 0,
            "private_settings": {},
            "filters": [
                {
                    "prev_ver": 486604803,
                    "name": "Apply LUT",
                    "uuid": "2ab0fedf-d82d-41b4-906f-d8142d0fdd1c",
                    "id": "clut_filter",
                    "versioned_id": "clut_filter",
                    "settings": {
                        "image_path": "/usr/share/obs/obs-plugins/obs-filters/LUTs/posterize.png"
                    },
                    "mixers": 0,
                    "sync": 0,
                    "flags": 0,
                    "volume": 1.0,
                    "balance": 0.5,
                    "enabled": true,
                    "muted": false,
                    "push-to-mute": false,
                    "push-to-mute-delay": 0,
                    "push-to-talk": false,
                    "push-to-talk-delay": 0,
                    "hotkeys": {},
                    "deinterlace_mode": 0,
                    "deinterlace_field_order": 0,
                    "monitoring_type": 0,
                    "private_settings": {}
                },
                {
                    "prev_ver": 486604803,
                    "name": "Color Correction",
                    "uuid": "98074a1f-332e-4889-bffb-1b1c5b1cd573",
                    "id": "color_filter",
                    "versioned_id": "color_filter_v2",
                    "settings": {
                        "gamma": 2.4500000000000002,
                        "contrast": -1.8999999999999999,
                        "brightness": -0.075600000000000001,
                        "saturation": -1.0,
                        "hue_shift": -47.200000000000003,
                        "opacity": 0.3362
                    },
                    "mixers": 0,
                    "sync": 0,
                    "flags": 0,
                    "volume": 1.0,
                    "balance": 0.5,
                    "enabled": true,
                    "muted": false,
                    "push-to-mute": false,
                    "push-to-mute-delay": 0,
                    "push-to-talk": false,
                    "push-to-talk-delay": 0,
                    "hotkeys": {},
                    "deinterlace_mode": 0,
                    "deinterlace_field_order": 0,
                    "monitoring_type": 0,
                    "private_settings": {}
                },
                {
                    "prev_ver": 486604803,
                    "name": "Chroma Key",
                    "uuid": "267ad17c-f8df-4468-9fc6-1572c1639436",
                    "id": "chroma_key_filter",
                    "versioned_id": "chroma_key_filter_v2",
                    "settings": {
                        "contrast": 2.0299999999999998,
                        "brightness": 0.057599999999999998,
                        "gamma": -0.29999999999999999
                    },
                    "mixers": 0,
                    "sync": 0,
                    "flags": 0,
                    "volume": 1.0,
                    "balance": 0.5,
                    "enabled": true,
                    "muted": false,
                    "push-to-mute": false,
                    "push-to-mute-delay": 0,
                    "push-to-talk": false,
                    "push-to-talk-delay": 0,
                    "hotkeys": {},
                    "deinterlace_mode": 0,
                    "deinterlace_field_order": 0,
                    "monitoring_type": 0,
                    "private_settings": {}
                },
                {
                    "prev_ver": 486604803,
                    "name": "Luma Key",
                    "uuid": "5eefa588-7ef7-4b3f-8943-36545b536b68",
                    "id": "luma_key_filter",
                    "versioned_id": "luma_key_filter_v2",
                    "settings": {
                        "luma_max": 0.76000000000000001,
                        "luma_min": 0.0,
                        "luma_min_smooth": 0.28499999999999998
                    },
                    "mixers": 0,
                    "sync": 0,
                    "flags": 0,
                    "volume": 1.0,
                    "balance": 0.5,
                    "enabled": true,
                    "muted": false,
                    "push-to-mute": false,
                    "push-to-mute-delay": 0,
                    "push-to-talk": false,
                    "push-to-talk-delay": 0,
                    "hotkeys": {},
                    "deinterlace_mode": 0,
                    "deinterlace_field_order": 0,
                    "monitoring_type": 0,
                    "private_settings": {}
                }
            ]
        },
        {
            "prev_ver": 486604803,
            "name": "main screen",
            "uuid": "305a7493-cee0-4757-8365-a298a1018548",
            "id": "xshm_input",
            "versioned_id": "xshm_input",
            "settings": {
                "show_cursor": false
            },
            "mixers": 0,
            "sync": 0,
            "flags": 0,
            "volume": 1.0,
            "balance": 0.5,
            "enabled": true,
            "muted": false,
            "push-to-mute": false,
            "push-to-mute-delay": 0,
            "push-to-talk": false,
            "push-to-talk-delay": 0,
            "hotkeys": {},
            "deinterlace_mode": 0,
            "deinterlace_field_order": 0,
            "monitoring_type": 0,
            "private_settings": {},
            "filters": [
                {
                    "prev_ver": 486604803,
                    "name": "Sharpen",
                    "uuid": "3103ceb7-9c7d-415a-a80a-09374b578b41",
                    "id": "sharpness_filter",
                    "versioned_id": "sharpness_filter_v2",
                    "settings": {
                        "sharpness": 0.029999999999999999
                    },
                    "mixers": 0,
                    "sync": 0,
                    "flags": 0,
                    "volume": 1.0,
                    "balance": 0.5,
                    "enabled": true,
                    "muted": false,
                    "push-to-mute": false,
                    "push-to-mute-delay": 0,
                    "push-to-talk": false,
                    "push-to-talk-delay": 0,
                    "hotkeys": {},
                    "deinterlace_mode": 0,
                    "deinterlace_field_order": 0,
                    "monitoring_type": 0,
                    "private_settings": {}
                },
                {
                    "prev_ver": 486604803,
                    "name": "Color Correction",
                    "uuid": "8b0aee8d-0bb8-4534-a7e5-98a91e1dc290",
                    "id": "color_filter",
                    "versioned_id": "color_filter_v2",
                    "settings": {
                        "gamma": 0.089999999999999997,
                        "contrast": 0.5,
                        "brightness": -0.0115,
                        "saturation": 0.10000000000000001
                    },
                    "mixers": 0,
                    "sync": 0,
                    "flags": 0,
                    "volume": 1.0,
                    "balance": 0.5,
                    "enabled": true,
                    "muted": false,
                    "push-to-mute": false,
                    "push-to-mute-delay": 0,
                    "push-to-talk": false,
                    "push-to-talk-delay": 0,
                    "hotkeys": {},
                    "deinterlace_mode": 0,
                    "deinterlace_field_order": 0,
                    "monitoring_type": 0,
                    "private_settings": {}
                }
            ]
        },
        {
            "prev_ver": 486604803,
            "name": "side screen",
            "uuid": "dd83e1f2-faa3-4f45-829e-6428687f65f4",
            "id": "xshm_input",
            "versioned_id": "xshm_input",
            "settings": {
                "screen": 1,
                "show_cursor": false
            },
            "mixers": 0,
            "sync": 0,
            "flags": 0,
            "volume": 1.0,
            "balance": 0.5,
            "enabled": true,
            "muted": false,
            "push-to-mute": false,
            "push-to-mute-delay": 0,
            "push-to-talk": false,
            "push-to-talk-delay": 0,
            "hotkeys": {},
            "deinterlace_mode": 0,
            "deinterlace_field_order": 0,
            "monitoring_type": 0,
            "private_settings": {}
        },
        {
            "prev_ver": 486604803,
            "name": "title",
            "uuid": "6b29efc2-fe25-43bc-a519-0470372bc807",
            "id": "text_ft2_source",
            "versioned_id": "text_ft2_source_v2",
            "settings": {
                "undo_sname": "topic",
                "text": "syncopated notes",
                "font": {
                    "face": "mononoki Nerd Font Mono",
                    "style": "Regular",
                    "size": 48,
                    "flags": 0
                },
                "outline": true,
                "drop_shadow": false,
                "color1": 4278234841,
                "color2": 4278234841
            },
            "mixers": 0,
            "sync": 0,
            "flags": 0,
            "volume": 1.0,
            "balance": 0.5,
            "enabled": true,
            "muted": false,
            "push-to-mute": false,
            "push-to-mute-delay": 0,
            "push-to-talk": false,
            "push-to-talk-delay": 0,
            "hotkeys": {},
            "deinterlace_mode": 0,
            "deinterlace_field_order": 0,
            "monitoring_type": 0,
            "private_settings": {}
        },
        {
            "prev_ver": 486604803,
            "name": "topic",
            "uuid": "df5f081f-5415-4928-a17f-6114b4326258",
            "id": "text_ft2_source",
            "versioned_id": "text_ft2_source_v2",
            "settings": {
                "text": "",
                "from_file": true,
                "text_file": "/home/b08x/Recordings/topic.txt",
                "font": {
                    "face": "mononoki Nerd Font Mono",
                    "style": "Regular",
                    "size": 48,
                    "flags": 0
                },
                "outline": true,
                "color1": 4278233855,
                "color2": 4278233855
            },
            "mixers": 0,
            "sync": 0,
            "flags": 0,
            "volume": 1.0,
            "balance": 0.5,
            "enabled": true,
            "muted": false,
            "push-to-mute": false,
            "push-to-mute-delay": 0,
            "push-to-talk": false,
            "push-to-talk-delay": 0,
            "hotkeys": {},
            "deinterlace_mode": 0,
            "deinterlace_field_order": 0,
            "monitoring_type": 0,
            "private_settings": {}
        },
        {
            "prev_ver": 486604803,
            "name": "topic 2",
            "uuid": "6d905684-0cea-4d00-b3f8-6b52a172c110",
            "id": "text_ft2_source",
            "versioned_id": "text_ft2_source_v2",
            "settings": {
                "text": "",
                "from_file": true,
                "text_file": "/home/b08x/Recordings/topic.txt",
                "font": {
                    "face": "mononoki Nerd Font Mono",
                    "style": "Regular",
                    "size": 48,
                    "flags": 0
                },
                "outline": true,
                "color1": 4278233770,
                "color2": 4278233770
            },
            "mixers": 0,
            "sync": 0,
            "flags": 0,
            "volume": 1.0,
            "balance": 0.5,
            "enabled": true,
            "muted": false,
            "push-to-mute": false,
            "push-to-mute-delay": 0,
            "push-to-talk": false,
            "push-to-talk-delay": 0,
            "hotkeys": {},
            "deinterlace_mode": 0,
            "deinterlace_field_order": 0,
            "monitoring_type": 0,
            "private_settings": {}
        },
        {
            "prev_ver": 486604803,
            "name": "Video Capture Device (V4L2)",
            "uuid": "b2cebbbb-1d07-43c8-8000-0c53bc9b0a5f",
            "id": "v4l2_input",
            "versioned_id": "v4l2_input",
            "settings": {
                "device_id": "/dev/video0",
                "input": 0,
                "pixelformat": 1196444237
            },
            "mixers": 0,
            "sync": 0,
            "flags": 0,
            "volume": 1.0,
            "balance": 0.5,
            "enabled": true,
            "muted": false,
            "push-to-mute": false,
            "push-to-mute-delay": 0,
            "push-to-talk": false,
            "push-to-talk-delay": 0,
            "hotkeys": {},
            "deinterlace_mode": 0,
            "deinterlace_field_order": 0,
            "monitoring_type": 0,
            "private_settings": {},
            "filters": [
                {
                    "prev_ver": 486604803,
                    "name": "Apply LUT",
                    "uuid": "d7ff2a10-398a-403b-ba3e-9fd99da60362",
                    "id": "clut_filter",
                    "versioned_id": "clut_filter",
                    "settings": {
                        "clut_amount": 1.0,
                        "image_path": "/usr/share/obs/obs-plugins/obs-filters/LUTs/grayscale.cube"
                    },
                    "mixers": 0,
                    "sync": 0,
                    "flags": 0,
                    "volume": 1.0,
                    "balance": 0.5,
                    "enabled": true,
                    "muted": false,
                    "push-to-mute": false,
                    "push-to-mute-delay": 0,
                    "push-to-talk": false,
                    "push-to-talk-delay": 0,
                    "hotkeys": {},
                    "deinterlace_mode": 0,
                    "deinterlace_field_order": 0,
                    "monitoring_type": 0,
                    "private_settings": {}
                },
                {
                    "prev_ver": 486604803,
                    "name": "Color Key",
                    "uuid": "980d1a34-61f1-4ad6-a4ec-2499e4b87a3f",
                    "id": "color_key_filter",
                    "versioned_id": "color_key_filter_v2",
                    "settings": {
                        "contrast": 0.050000000000000003,
                        "brightness": -0.046399999999999997,
                        "gamma": 0.52000000000000002,
                        "similarity": 278
                    },
                    "mixers": 0,
                    "sync": 0,
                    "flags": 0,
                    "volume": 1.0,
                    "balance": 0.5,
                    "enabled": false,
                    "muted": false,
                    "push-to-mute": false,
                    "push-to-mute-delay": 0,
                    "push-to-talk": false,
                    "push-to-talk-delay": 0,
                    "hotkeys": {},
                    "deinterlace_mode": 0,
                    "deinterlace_field_order": 0,
                    "monitoring_type": 0,
                    "private_settings": {}
                },
                {
                    "prev_ver": 486604803,
                    "name": "Chroma Key",
                    "uuid": "c07474f3-0e8b-471b-a712-cd6b2c4e4c6b",
                    "id": "chroma_key_filter",
                    "versioned_id": "chroma_key_filter_v2",
                    "settings": {
                        "contrast": 0.22,
                        "brightness": 0.078899999999999998,
                        "gamma": 0.84999999999999998
                    },
                    "mixers": 0,
                    "sync": 0,
                    "flags": 0,
                    "volume": 1.0,
                    "balance": 0.5,
                    "enabled": false,
                    "muted": false,
                    "push-to-mute": false,
                    "push-to-mute-delay": 0,
                    "push-to-talk": false,
                    "push-to-talk-delay": 0,
                    "hotkeys": {},
                    "deinterlace_mode": 0,
                    "deinterlace_field_order": 0,
                    "monitoring_type": 0,
                    "private_settings": {}
                },
                {
                    "prev_ver": 486604803,
                    "name": "Luma Key",
                    "uuid": "ddb533f8-33d9-4c8f-8e5e-770a9f230a1f",
                    "id": "luma_key_filter",
                    "versioned_id": "luma_key_filter_v2",
                    "settings": {
                        "luma_max": 0.71719999999999995,
                        "luma_min": 0.0,
                        "luma_min_smooth": 0.0,
                        "luma_max_smooth": 1.0
                    },
                    "mixers": 0,
                    "sync": 0,
                    "flags": 0,
                    "volume": 1.0,
                    "balance": 0.5,
                    "enabled": true,
                    "muted": false,
                    "push-to-mute": false,
                    "push-to-mute-delay": 0,
                    "push-to-talk": false,
                    "push-to-talk-delay": 0,
                    "hotkeys": {},
                    "deinterlace_mode": 0,
                    "deinterlace_field_order": 0,
                    "monitoring_type": 0,
                    "private_settings": {}
                },
                {
                    "prev_ver": 486604803,
                    "name": "Color Correction",
                    "uuid": "74a013ed-084c-4faa-aeb0-8765cebb1683",
                    "id": "color_filter",
                    "versioned_id": "color_filter_v2",
                    "settings": {
                        "gamma": -1.9099999999999999,
                        "contrast": -4.0,
                        "brightness": -0.2268,
                        "saturation": 3.6499999999999999,
                        "hue_shift": 180.0
                    },
                    "mixers": 0,
                    "sync": 0,
                    "flags": 0,
                    "volume": 1.0,
                    "balance": 0.5,
                    "enabled": false,
                    "muted": false,
                    "push-to-mute": false,
                    "push-to-mute-delay": 0,
                    "push-to-talk": false,
                    "push-to-talk-delay": 0,
                    "hotkeys": {},
                    "deinterlace_mode": 0,
                    "deinterlace_field_order": 0,
                    "monitoring_type": 0,
                    "private_settings": {}
                },
                {
                    "prev_ver": 486604803,
                    "name": "Color Correction 2",
                    "uuid": "47619c91-d380-4e89-b99a-0fb847688e27",
                    "id": "color_filter",
                    "versioned_id": "color_filter_v2",
                    "settings": {
                        "gamma": 3.0,
                        "contrast": 4.0,
                        "brightness": -1.0,
                        "saturation": 4.2000000000000002,
                        "hue_shift": -180.0,
                        "opacity": 0.93010000000000004
                    },
                    "mixers": 0,
                    "sync": 0,
                    "flags": 0,
                    "volume": 1.0,
                    "balance": 0.5,
                    "enabled": true,
                    "muted": false,
                    "push-to-mute": false,
                    "push-to-mute-delay": 0,
                    "push-to-talk": false,
                    "push-to-talk-delay": 0,
                    "hotkeys": {},
                    "deinterlace_mode": 0,
                    "deinterlace_field_order": 0,
                    "monitoring_type": 0,
                    "private_settings": {}
                }
            ]
        }
    ]
}