{
	"type": "Project",
	"version": 1,
	"name": "sampler",
	"rootPath": "/home/b08x/Sessions/Collections/",
	"assets": [
		{
			"type": "ProjectAsset",
			"version": 2,
			"resolveTokens": false,
			"exportPath": "",
			"source": {
				"type": "FileLocation",
				"version": 1,
				"filename": "Sounds/collections/Another_thing/A#1_ff_looped.flac",
				"locationPath": "/home/b08x/Library/sononym.db"
			},
			"sequenceIndex": 0
		}
	],
	"expandedFolders": [],
	"autoExportEnabled": false
}