<?xml version="1.0" encoding="utf-8"?>
<!-- Generator: Adobe Illustrator 26.5.0, SVG Export Plug-In . SVG Version: 6.00 Build 0)  -->
<svg version="1.1" id="Layer_1" xmlns="http://www.w3.org/2000/svg" xmlns:xlink="http://www.w3.org/1999/xlink" x="0px" y="0px"
	 width="150px" height="100.2px" viewBox="0 0 150 100.2" style="enable-background:new 0 0 150 100.2;" xml:space="preserve">
<style type="text/css">
	.st0{fill:#FFFFFF;}
	.st1{fill:none;}
</style>
<g>
	<polygon id="XMLID_574_" class="st0" points="150,82.6 126.2,68.7 122.5,60.9 103,58.3 116.6,71.6 125.3,70.5 	"/>
	<g id="XMLID_570_">
		<path id="XMLID_571_" class="st0" d="M49.2,98.4C22.1,98.4,0,76.3,0,49.2S22.1,0,49.2,0s49.2,22.1,49.2,49.2S76.3,98.4,49.2,98.4z
			 M49.2,7.5c-23,0-41.7,18.7-41.7,41.7s18.7,41.7,41.7,41.7s41.7-18.7,41.7-41.7S72.2,7.5,49.2,7.5z"/>
	</g>
	<path id="XMLID_567_" class="st0" d="M142,100.2L78.3,62.9l-10-21.1l-52.3-7l36.5,35.8l23.2-3L142,100.2z M55.1,53.2L23,37.9
		l43.9,5.8L55.1,53.2z"/>
</g>
<rect y="-24.9" class="st1" width="150" height="150"/>
</svg>
