Dec  5 03:42:19 example syslogd 1.5.0#5: restart.
Dec  5 03:43:01 example /USR/SBIN/CRON[26348]: (Debian-exim) CMD ([ -x /usr/sbin/exim_rewrite_scan ] && /usr/sbin/exim_rewrite_scan  /etc/exim4/exim4.conf)
Dec  5 03:43:01 example /USR/SBIN/CRON[26349]: (root) CMD ([ -x /usr/sbin/sympl-all-crontabs ] && /usr/sbin/sympl-all-crontabs)
Dec  5 03:44:01 example /USR/SBIN/CRON[26442]: (root) CMD ([ -x /usr/sbin/sympl-all-crontabs ] && /usr/sbin/sympl-all-crontabs)
Dec  5 03:44:01 example /USR/SBIN/CRON[26443]: (Debian-exim) CMD ([ -x /usr/sbin/exim_rewrite_scan ] && /usr/sbin/exim_rewrite_scan  /etc/exim4/exim4.conf)
Dec  5 03:44:01 example /USR/SBIN/CRON[26441]: (root) CMD ( [ -x /usr/sbin/sympl-monit ] &&  /usr/sbin/sympl-monit -m -d /etc/sympl/monit.d)
Dec  5 03:44:01 example /USR/SBIN/CRON[26444]: (root) CMD ([ -x /usr/bin/firewall-blacklist ] && /usr/bin/firewall-blacklist)
Dec  5 03:44:02 example dovecot: imap-login: Login: user=<gsl@306th.org.uk>, method=PLAIN, rip=::ffff:31.94.124.185, lip=::ffff:80.68.93.79, TLS
Dec  5 03:44:02 example dovecot: pop3-login: Aborted login (0 authentication attempts): rip=::ffff:127.0.0.1, lip=::ffff:127.0.0.1, secured
Dec  5 03:44:03 example dovecot: imap-login: Aborted login (0 authentication attempts): rip=::ffff:127.0.0.1, lip=::ffff:127.0.0.1, secured
