{
  "name": "Atlas",
  "about_url": "",
  "assets": {},
  "color_schemes": {
    "hin": {
      "primary": "161c45",
      "secondary": "FFFFFF",
      "tertiary": "2bb0e5",
      "quaternary": "171e4e",
      "header_background": "FFFFFF",
      "header_primary": "FFFFFF",
      "highlight": "e4e8ff",
      "danger": "ce0e3a",
      "success": "2bb0e5",
      "love": "ee2553",
      "--primary-high": "86899c",
      "--primary-medium": "1c82ab"
    }
  },
  "modifiers": {
    "serialize_topic_excerpts": true
  },
  "components": ["https://github.com/awesomerobot/discourse-custom-sidebar"]
}
