// Jest Snapshot v1, https://goo.gl/fbAQLP

exports[`<BottomList /> should match the snapshot 1`] = `
<div
  className="bottom-list"
>
  <a
    className="ui card singleItem-bottom-menu"
    href={undefined}
    onClick={[Function]}
  >
    <img
      className="ui image"
      src="/asset/thumbnail/background1.svg"
      style={
        Object {
          "margin": "auto",
        }
      }
    />
    <div
      className="content singleItemSelected"
    >
      <div
        className="header single-item-text"
      >
        Office Layout
      </div>
      <div
        className="description single-item-text"
      >
        description description description description
      </div>
    </div>
  </a>
  <a
    className="ui card singleItem-bottom-menu"
    href={undefined}
    onClick={[Function]}
  >
    <img
      className="ui image"
      src="/asset/thumbnail/background3.svg"
      style={
        Object {
          "margin": "auto",
        }
      }
    />
    <div
      className="content"
    >
      <div
        className="header single-item-text"
      >
        Home Layout
      </div>
      <div
        className="description single-item-text"
      >
        description description description description
      </div>
    </div>
  </a>
  <a
    className="ui card singleItem-bottom-menu"
    href={undefined}
    onClick={[Function]}
  >
    <img
      className="ui image"
      src="/asset/thumbnail/background2.svg"
      style={
        Object {
          "margin": "auto",
        }
      }
    />
    <div
      className="content"
    >
      <div
        className="header single-item-text"
      >
        Building Layout
      </div>
      <div
        className="description single-item-text"
      >
        description description description description
      </div>
    </div>
  </a>
</div>
`;
