GeneID	baseMean	log2FoldChange	lfcSE	stat	pvalue	padj
cds-gene-SAA6008_02197	5255.280232457363	-7.604131664970183	0.24443904614550005	-31.108498355225517	1.8485502474054156e-212	4.621375618513539e-209
cds-gene-SAA6008_01007	4888.15877054889	-6.5317095801231515	0.2602310526867448	-25.09965475944083	5.016672627132439e-139	6.270840783915549e-136
cds-gene-SAA6008_01157	4039.9353374535995	2.8682123272923192	0.20975822376516054	13.673896907629661	1.4539543025846453e-42	1.2116285854872045e-39
cds-gene-SAA6008_r02	2368.223272589941	-2.158046419580335	0.2101984793087877	-10.266708049824194	9.954357588839455e-25	6.221473493024659e-22
cds-gene-SAA6008_r06	30896.078407321987	-1.7855105384732437	0.18213607976406954	-9.803167723748691	1.091091480430752e-22	5.455457402153761e-20
cds-gene-SAA6008_r09	1915.235402526908	-2.020664475273295	0.21175247617682716	-9.542577785895208	1.393252852336019e-21	5.805220218066747e-19
cds-gene-SAA6008_01147	2372.7796316121667	-1.987862214113962	0.21475803415989958	-9.256287998212375	2.1166287098579356e-20	7.559388249492628e-18
cds-gene-SAA6008_01315	1533.6059370695455	-2.0960050370237537	0.22858343472348142	-9.169540389308185	4.750400713726695e-20	1.484500223039592e-17
cds-gene-SAA6008_01588	3317.182402594638	-1.8442857536673598	0.20418978908005686	-9.032213422505027	1.6823392570752803e-19	4.67316460298689e-17
cds-gene-SAA6008_01631	11816.06320020376	-1.5872810029185631	0.19473033856215358	-8.151174668717266	3.604061130708367e-16	6.930886789823783e-14
cds-gene-SAA6008_01730	2172.071751339931	-1.6354636648538485	0.20913585719865008	-7.820101663869074	5.278069282862474e-15	8.796782138104122e-13
cds-gene-SAA6008_00023	3577.3814973326025	-1.672002789954815	0.2214923796001371	-7.548805033262553	4.392698708040474e-14	6.86359173131324e-12
cds-gene-SAA6008_01650	14878.910500554295	-1.4181300876646248	0.1888766072051835	-7.508235713510349	5.992952711566121e-14	8.81316575230312e-12
cds-gene-SAA6008_00394	1906.7549193789728	-1.6612493590466053	0.2232244536810557	-7.442058124242101	9.912858556032343e-14	1.3106270212581908e-11
cds-gene-SAA6008_02389	19034.337850330183	-1.3477110851344112	0.18235870531660972	-7.390440082334024	1.4634363573951706e-13	1.8292954467439633e-11
cds-gene-SAA6008_01348	32914.54613023515	-1.3138382989722295	0.1812630375802173	-7.248241652084171	4.222168329662885e-13	4.7979185564350965e-11
cds-gene-SAA6008_00954	41344.52127522839	1.4933212780496365	0.20646339976778316	7.232861997473784	4.729199139515632e-13	4.898811558742815e-11
cds-gene-SAA6008_01255	3775.7677357811144	-1.4288249341532806	0.19767705084233309	-7.22807694704485	4.898811558742815e-13	4.898811558742815e-11
cds-gene-SAA6008_01702	6168.619761719195	1.4212841786816754	0.1966299437707439	7.228218405731676	4.893712745002478e-13	4.898811558742815e-11
cds-gene-SAA6008_02368	8012.98337701496	-1.3387965908190644	0.187081990357995	-7.156202412948353	8.294264890682999e-13	7.975254702579807e-11
cds-gene-SAA6008_02527	1904.6212562060962	1.5532021452630205	0.22078279374409274	7.03497821964932	1.9929213148778396e-12	1.8452975137757776e-10
cds-gene-SAA6008_02067	56801.142628191854	-1.2711727331557743	0.1821766405888999	-6.977693347767372	3.0006571186523547e-12	2.6791581416538884e-10
cds-gene-SAA6008_02593	4987.870395418155	1.3421919791514	0.19319180312540124	6.947458212190194	3.719261794360682e-12	3.2062601675523124e-10
cds-gene-SAA6008_r10	1521.956433204046	-1.5215665234499451	0.22145241659074186	-6.870850844052413	6.382009654009139e-12	5.318341378340949e-10
cds-gene-SAA6008_00008	5185.612663496544	-1.342222009308024	0.19854540018601624	-6.760277538792148	1.377276523208961e-11	1.1107068735556136e-9
cds-gene-SAA6008_00145	2162.4848943297166	-1.3996515676115537	0.2074411092431719	-6.7472236950430995	1.50700846545448e-11	1.1773503636363125e-9
cds-gene-SAA6008_01026	5725.127417453822	-1.2525751547401704	0.19050030332774345	-6.575187193194101	4.859199612635727e-11	3.6812118277543387e-9
cds-gene-SAA6008_01029	4266.647070033148	-1.2736763208756061	0.19921177990633931	-6.39357934292055	1.6204684893644136e-10	1.1915209480620689e-8
cds-gene-SAA6008_02403	1943.56940648195	1.3633592306315907	0.21342176257550655	6.388098449656686	1.6796119861451342e-10	1.1997228472465245e-8
cds-gene-SAA6008_00171	11417.553285291702	-1.1738301003574028	0.18459369535380088	-6.358993453744914	2.0308006080132798e-10	1.4102782000092221e-8
cds-gene-SAA6008_00603	30278.195475162564	-1.2755447948737784	0.20253141863097132	-6.298009481669234	3.01492074868592e-10	2.0147661706827492e-8
cds-gene-SAA6008_02479	41702.27021913387	1.1420394431691236	0.18140325413225344	6.295584104221807	3.062444579437779e-10	2.0147661706827492e-8
cds-gene-SAA6008_02352	9361.65964747118	-5.508228636393556	0.8766736093801234	-6.283100777139058	3.3188576396530354e-10	2.127472845931433e-8
cds-gene-SAA6008_02493	1902.9838301068826	1.3372586182122446	0.21750045029695683	6.148302757012521	7.831643794102735e-10	4.6616927345849614e-8
cds-gene-SAA6008_02290	1841.1618557239706	-1.3124991927985321	0.21337938173787024	-6.151012258583144	7.698996749090379e-10	4.6616927345849614e-8
cds-gene-SAA6008_00915	4404.6967055127725	-1.2644933559749636	0.20988407604605525	-6.024722693576303	1.6939981374128433e-9	9.010628390493847e-8
cds-gene-SAA6008_00718	1928.3320183991013	-1.2948906828687359	0.21541762553933794	-6.011071190793869	1.843014441476847e-9	9.599033549358579e-8
cds-gene-SAA6008_00896	4184.876243928232	-1.1895365658633876	0.19887199924210816	-5.98141804978406	2.2120334133536234e-9	1.0843301045851096e-7
cds-gene-SAA6008_00009	5562.040361435717	1.14725407533375	0.1934317767074597	5.931052771483467	3.0099844501196783e-9	1.4471079087113838e-7
cds-gene-SAA6008_01234	37679.00626514515	1.0683941657352825	0.18085306206685245	5.907525996658823	3.4728353972025918e-9	1.613320759347226e-7
cds-gene-SAA6008_01155	2300.2481117438297	-1.2219466228066669	0.20785239900929373	-5.87891517553295	4.129639094535085e-9	1.8435888814888775e-7
cds-gene-SAA6008_00184	18409.124362150997	-1.0972176464835677	0.1878416593527867	-5.841183740944684	5.183119888527473e-9	2.2732981967225761e-7
cds-gene-SAA6008_01233	11635.261128829723	-1.0670654804644775	0.18564830903301552	-5.747779153079771	9.04232359696527e-9	3.767634832068862e-7
cds-gene-SAA6008_00032	4017.9804721566243	-1.1566983116124727	0.2033405777675361	-5.688477549890894	1.2817695887350618e-8	5.006912455996335e-7
cds-gene-SAA6008_01600	7461.508472774215	-1.1173960859080387	0.1963580290077405	-5.690605530899838	1.2658964627843091e-8	5.006912455996335e-7
cds-gene-SAA6008_01698	3403.9642503951986	-1.1405397982460774	0.20095709396309402	-5.675538871275371	1.3825274395592133e-8	5.236846361966717e-7
cds-gene-SAA6008_02070	2858.759485075526	1.1501472250779683	0.20407141037601648	5.636003705559432	1.740416354939005e-8	6.494090876638079e-7
cds-gene-SAA6008_01030	7481.443082248589	1.248480079208268	0.22244746621098527	5.612471566765877	1.9945699166634948e-08	7.33297763479226e-7
cds-gene-SAA6008_02367	9828.988147691636	-1.0297181874877432	0.18556559946751747	-5.549079088163598	2.8717825480488154e-8	1.0405009232060925e-6
cds-gene-SAA6008_00556	6791.225784291199	1.0447609019362922	0.18930472784800068	5.518937185632083	3.4105606783928226e-8	1.2180573851402938e-6
cds-gene-SAA6008_01444	1226.5873226578985	-1.2581264310547449	0.22916303568151006	-5.490093231280477	4.0172163751142425e-8	1.4145128081388177e-6
cds-gene-SAA6008_01200	596.9128124688339	1.5510828373989896	0.2897114161044064	5.3538892538498	8.608355878542378e-8	2.8694519595141263e-6
cds-gene-SAA6008_01021	1325.5935620294636	1.1947945126332966	0.22680137529599442	5.268021461836339	1.3790198789831938e-7	4.419935509561518e-6
cds-gene-SAA6008_01662	15468.73137864844	-1.0094216683616362	0.19237790142533764	-5.247077033706989	1.5453129633814414e-7	4.890230896776714e-6
cds-gene-SAA6008_01156	4707.618073759296	-1.0056107056669101	0.19248201694719483	-5.224439776848284	1.7468316741214037e-7	5.458848981629387e-6
cds-gene-SAA6008_00182	1339.7850191713458	1.1811366390126772	0.2263275487495434	5.218704685039188	1.801787833802122e-7	5.561073561117661e-6
cds-gene-SAA6008_01506	1261.7535183111368	-1.1770913948387574	0.2256548109847344	-5.216336357740619	1.8249665431291836e-7	5.563922387588974e-6
cds-gene-SAA6008_01716	759.8102197717664	1.3721597398072851	0.2645608003097095	5.186557260943265	2.142171792957172e-7	6.4523246775818435e-6
cds-gene-SAA6008_01092	1940.3796280082647	-1.0925836589071347	0.21130228190803632	-5.17071396030949	2.3320129394683236e-7	6.940514700798582e-6
cds-gene-SAA6008_00169	10336.647892869169	-5.560142417115076	1.0867380716065966	-5.116359279559563	3.1148947815434693e-7	8.749704442537835e-6
cds-gene-SAA6008_01240	9437.395369809048	-0.9534333149822581	0.186332189055929	-5.116847066590722	3.106853293447405e-7	8.749704442537835e-6
cds-gene-SAA6008_00871	37411.32936410942	-0.9650616452887749	0.1897130292096801	-5.086955014682421	3.638580958449257e-7	1.0107169329025714e-5
cds-gene-SAA6008_01027	13803.452152640188	-0.9351017214948636	0.18407498599550204	-5.080004306058799	3.7742631318424685e-7	1.036885475780898e-5
cds-gene-SAA6008_02747	1898.437365901649	-1.0818763236614672	0.21480636917707746	-5.036518832314573	4.7407448807279834e-7	1.274393785141931e-5
cds-gene-SAA6008_00982	2499.9981256326864	1.069194609011499	0.2128347479741821	5.02359045780061	5.071432154923088e-7	1.3417508903537275e-5
cds-gene-SAA6008_02185	6891.062240768216	-0.9438538260059238	0.191121416105339	-4.938503728361383	7.872427359681157e-7	2.0082722856329483e-5
cds-gene-SAA6008_00737	4624.317909115758	-1.0218037315099424	0.20772310386752085	-4.919066355573119	8.695798941225684e-7	2.1739497353064213e-5
cds-gene-SAA6008_01049	20408.83962460188	-0.9440939161414362	0.1918880304964865	-4.920025046370585	8.653313835671965e-7	2.1739497353064213e-5
cds-gene-SAA6008_00747	1692.6187197547188	-1.0658123788510663	0.21742531056965866	-4.901970134289409	9.488026366543576e-7	2.3254966584665627e-5
cds-gene-SAA6008_01667	1539.5082314534297	-1.0973659952758679	0.22498503876484024	-4.877506527991228	1.074352937421921e-6	2.5825791764950025e-5
cds-gene-SAA6008_02659	891.295815852429	1.2806249087138197	0.2643149437039887	4.845071908412472	1.265658303709534e-6	3.0134721516893666e-5
cds-gene-SAA6008_01668	16404.78057401409	-0.8908795418487987	0.18447422014844456	-4.829290190964986	1.3702060140291644e-6	3.231617957615954e-5
cds-gene-SAA6008_00936	840.1342170281077	1.268262644133727	0.27009233499848384	4.695663222508133	2.657430672566407e-6	5.836235553368583e-5
cds-gene-SAA6008_02371	14318.965921199058	-1.0170933591757505	0.21714012497852264	-4.68404151133445	2.8127300533651286e-6	6.114630550793758e-5
cds-gene-SAA6008_00518	38816.17908937587	1.083763645155712	0.23210534373352046	4.669274854783086	3.022647563640074e-6	6.514326645776022e-5
cds-gene-SAA6008_02201	1637.5938310458419	-1.067709398102221	0.22888059181670758	-4.664918897786079	3.0873878286463088e-6	6.59698253984254e-5
cds-gene-SAA6008_00170	24038.212739789138	0.8452154037123841	0.1817838318206649	4.649563139070663	3.3263884339676397e-6	7.047433122812795e-5
cds-gene-SAA6008_00172	6952.903297824732	0.8746868272712595	0.18896334893517036	4.628870266113602	3.6766600332101866e-6	7.7240757000214e-5
cds-gene-SAA6008_01965	6259.751935677111	-0.9268994705496227	0.20031866923498526	-4.627124741240751	3.70777212812571e-6	7.724525266928562e-5
cds-gene-SAA6008_02647	4488.084606414687	0.9634791305135578	0.20880035415881268	4.614355825185716	3.943163810306851e-6	8.064006804710311e-5
cds-gene-SAA6008_01019	3614.173932413524	1.019029269396513	0.22199128810244226	4.590402074365468	4.423929763734452e-6	8.919213233335588e-5
cds-gene-SAA6008_02163	14321.668647144636	-0.8440153631532444	0.18472755612061162	-4.56897379512872	4.9011805084535275e-6	9.724564500899856e-5
cds-gene-SAA6008_01253	27370.828779322994	-0.9404271165031046	0.20736476851565785	-4.535134503487723	5.756678744638066e-6	1.1156354156275321e-4
cds-gene-SAA6008_02513	1682.2957676817073	0.9920462341973694	0.2189335491485235	4.531266395925321	5.863114718513189e-6	1.1195216758081977e-4
cds-gene-SAA6008_02335	2264.7259483943244	1.04712019479867	0.2312875250242176	4.527352673643026	5.97272137865924e-6	1.131197230806674e-4
cds-gene-SAA6008_00719	17043.995577300902	0.9062572986519026	0.2005063503675926	4.519843371496422	6.188539913388813e-6	1.1545783420501518e-4
cds-gene-SAA6008_00681	2443.8678713533627	-0.944079007288736	0.20934621474602122	-4.509654060065487	6.4933425094944446e-6	1.1936291377747141e-4
cds-gene-SAA6008_00861	4949.45787145528	-0.9736498928088648	0.21673041117979164	-4.4924470336613735	7.04094332841196e-6	1.2848436730678758e-4
cds-gene-SAA6008_01211	2523.0572078652062	-0.9671931800670318	0.2173132076887355	-4.450687513905611	8.559581673637973e-6	1.5284967274353524e-4
cds-gene-SAA6008_02605	41034.54956622935	0.822950747317476	0.1864988285945194	4.412632258976343	1.0212137116309597e-5	1.8106626092747512e-4
cds-gene-SAA6008_00382	8363.528659684014	0.898710155046052	0.20423435016430222	4.400386880674375	1.0805804712890196e-5	1.8760077626545478e-4
cds-gene-SAA6008_01561	11958.136610409003	-0.9287667020502601	0.212721272834415	-4.3661204621186345	1.2647274814588748e-5	2.1656292490734158e-4
cds-gene-SAA6008_01235	953.6292551069287	-1.0414993952227523	0.23951964630345407	-4.348283789227243	1.3720699046963108e-5	2.322952911564189e-4
cds-gene-SAA6008_00544	8998.514090368786	0.8173183207765684	0.1888232570533849	4.328483331613609	1.501396934212618e-5	2.502328223687697e-4
cds-gene-SAA6008_02714	9119.5222253768	-0.811527467925016	0.18881888566089322	-4.29791471909472	1.7241246938209318e-5	2.835731404310743e-4
cds-gene-SAA6008_01675	8399.14231634982	0.8832988009243421	0.20605021656772218	4.286813261533408	1.8125453566695392e-5	2.9424437608271736e-4
cds-gene-SAA6008_01964	18094.77480492798	0.7841947856337574	0.18348897619042256	4.273797815624247	1.9217130765730918e-5	3.05977317679718e-4
cds-gene-SAA6008_02561	8455.023591630465	0.802423202199124	0.18848546588446402	4.257215262905127	2.0698903265874427e-5	3.2266329518462544e-4
cds-gene-SAA6008_02176	31169.43420211335	0.77385201190656006	0.18181135508368185	4.256345878673976	2.077951620988988e-5	3.2266329518462544e-4
cds-gene-SAA6008_01720	30834.20009897069	0.8291352808208626	0.19507195846548342	4.250407323242065	2.1338211359745527e-5	3.292933851812581e-4
cds-gene-SAA6008_00535	3628.5789409182244	-0.9042037781490289	0.21331108628771017	-4.238897255107759	2.2462042460166205e-05	3.429444217665476e-4
cds-gene-SAA6008_00547	66253.77533919897	0.7650906723003582	0.1805077904679939	4.2385465486932405	2.2497154067885523e-5	3.429444217665476e-4
cds-gene-SAA6008_02594	2500.4072965841165	-0.9047416884573598	0.21401600753510433	-4.22744867955243	2.3635606090895984e-5	3.559579230556624e-4
cds-gene-SAA6008_00767	838.258283038931	-1.07203474543109	0.2539477850935653	-4.221477045118177	2.427066747545036e-5	3.6117064695610654e-4
cds-gene-SAA6008_01028	2063.975660858883	-0.8891053100202977	0.21057521308707366	-4.22226954913563	2.418546292229496e-5	3.6117064695610654e-4
cds-gene-SAA6008_01648	1924.2877066779195	-0.960136839769518	0.2291873853461877	-4.189309277730232	2.798048352701391e-5	4.0434224750020097e-4
cds-gene-SAA6008_02407	6026.919832451533	0.7989087446992679	0.19064472473797875	4.190563079032397	2.78263040007055e-5	4.0434224750020097e-4
cds-gene-SAA6008_00366	15320.887841447251	-0.7683919384162781	0.18372722578177658	-4.1822431876750885	2.8864697897074112e-5	4.1338313590973553e-4
cds-gene-SAA6008_00969	9644.508748787508	0.7867805196919497	0.18857310126946064	4.172283928065029	3.015615255386551e-5	4.283544396855896e-4
cds-gene-SAA6008_02361	3746.908875599351	0.8179403127909914	0.19718076612643917	4.14817494048329	3.35136270490491e-5	4.7069700911585814e-4
cds-gene-SAA6008_00545	54453.57590601404	-0.7504931531561955	0.18099166459560512	-4.1465619692102615	3.375048637433797e-5	4.7137550802148e-4
cds-gene-SAA6008_01678	6769.128277477206	-0.7847758639106354	0.18999115559978455	-4.13059156060802	3.618309463622535e-5	5.019246978102169e-4
cds-gene-SAA6008_02339	26654.84401713986	0.7574215826571135	0.18346906840396093	4.1283339434058055	3.654011800058379e-5	5.019246978102169e-4
cds-gene-SAA6008_01710	23832.29121968989	-0.7530272794863279	0.18235627296685522	-4.129428986647456	3.636653032898401e-5	5.019246978102169e-4
cds-gene-SAA6008_02343	3253.9404861355188	-0.8190198281468586	0.19878027113895066	-4.120226939293942	3.7849940434987544e-5	5.170756890025621e-4
cds-gene-SAA6008_00796	30663.455557002628	-0.7610001701321231	0.18491898718881186	-4.115316559435308	3.8664839654705005e-5	5.224978331716893e-4
cds-gene-SAA6008_01820	25495.623573450775	-0.8177731869298365	0.1989346343733738	-4.11076326405278	3.943533647521761e-5	5.30044845097011e-4
cds-gene-SAA6008_00712	30406.45682773976	0.7463364196669421	0.18176869974130933	4.105967753134163	4.0262565093070605e-5	5.382695868057567e-4
cds-gene-SAA6008_01130	9240.989313215485	-0.7815882561996088	0.1904313699805158	-4.104304119009268	4.0553370677144276e-5	5.392735462386207e-4
cds-gene-SAA6008_02581	8315.00859149179	-0.7651136463365544	0.18742912355481722	-4.082149197655413	4.462113491104083e-5	5.902266522624448e-4
cds-gene-SAA6008_00543	179092.87222583962	-0.7400005640531578	0.18182307379722656	-4.069893598204286	4.703461409973356e-5	6.124298710902808e-4
cds-gene-SAA6008_01494	2292.828098222645	-1.06914753545169	0.2631139522704497	-4.063439153362472	4.835493155922885e-5	6.263592170884566e-4
cds-gene-SAA6008_00823	2372.44472208661	-0.8294043849787848	0.2053269841589664	-4.039431974204865	5.358080475054044e-5	6.799594511489904e-4
cds-gene-SAA6008_00546	1447.9319396590836	1.0209801212176672	0.2540028058005949	4.0195623745164	5.8306344212049746e-5	7.324917614579114e-4
cds-gene-SAA6008_01646	3696.7199322776983	-0.7917627310177515	0.1972329865933126	-4.014352490896151	5.960920838897703e-5	7.412068077040242e-4
cds-gene-SAA6008_02422	18407.331495548468	-0.7350914133362803	0.18309742695535805	-4.014755562433473	5.9507434246332806e-5	7.412068077040242e-4
cds-gene-SAA6008_02631	26400.65812375777	-0.7279593351011374	0.1815933871620743	-4.008732622248105	6.104548666451928e-5	7.481064542220501e-4
cds-gene-SAA6008_01802	7185.257680046731	0.8298913781927693	0.2073662485453959	4.002056188093176	6.279438091427806e-5	7.65785133100952e-4
cds-gene-SAA6008_01099	1036.2035594455767	-1.0954328615439395	0.2739757700980914	-3.9982837210449023	6.380344390269242e-5	7.743136395957818e-4
cds-gene-SAA6008_00438	6537.417942622674	0.7854391612226563	0.19653405386440628	3.9964532648604005	6.429856832005713e-5	7.765527574886126e-4
cds-gene-SAA6008_01922	1259.9351583224736	0.9072970053030158	0.227997790780091	3.9794113890258007	6.908610369732001e-5	8.303618232850964e-4
cds-gene-SAA6008_01228	7255.274259567913	-0.8586451875148072	0.21596062094233084	-3.9759340557929588	7.010355109389609e-5	8.34566084451144e-4
cds-gene-SAA6008_01452	21751.519005099395	-0.7393019586661195	0.1860324283884504	-3.974048853044043	7.066105986710035e-5	8.3721634913626e-4
cds-gene-SAA6008_00981	4283.231010866628	-0.8195416996885957	0.2068187176430385	-3.96260894095231	7.413516012657329e-5	8.66064954749688e-4
cds-gene-SAA6008_02124	1938.1745114461896	0.8464571345979459	0.21417146498064313	3.9522404848584705	7.742287431618234e-5	8.878769990387883e-4
cds-gene-SAA6008_00808	3919.8614676111692	0.8182247731732251	0.20701818854851864	3.9524293923645195	7.736176002580579e-5	8.878769990387883e-4
cds-gene-SAA6008_01647	709.132194340782	-1.0221664747275974	0.25919992836245487	-3.943544588092017	8.028605582172778e-5	9.16507486549404e-4
cds-gene-SAA6008_01545	1074.128093728892	-0.9169369273086452	0.23337730805587178	-3.928989218990929	8.53036633716449e-5	9.649735675525441e-4
cds-gene-SAA6008_02775	3945.6207884409137	0.770510311575643	0.1960692889068625	3.9297858214891237	8.50215590400113e-5	9.649735675525441e-4
cds-gene-SAA6008_01413	3962.2465732138376	0.7722619506279966	0.19665353491806747	3.92701789443931	8.600558464321866e-5	9.685313585948047e-4
