%YAML 1.1
%TAG !u! tag:unity3d.com,2011:
--- !u!1045 &1
EditorBuildSettings:
  m_ObjectHideFlags: 0
  serializedVersion: 2
  m_Scenes:
  - enabled: 1
    path: Assets/Scenes/Menu.unity
    guid: 99c9720ab356a0642a771bea13969a05
  - enabled: 1
    path: Assets/Scenes/Level1.unity
    guid: f1f8b6adba40b46228e0f8810dfa8dd4
  - enabled: 1
    path: Assets/Scenes/Level2.unity
    guid: f23f5161b3eee384bb91762174f686f4
  - enabled: 1
    path: Assets/Scenes/Level3.unity
    guid: 3eb20f0ad9076481a86ba2e43b7d3705
  - enabled: 1
    path: Assets/Scenes/Level4.unity
    guid: f38f929f855614d4a985636a687fb262
  - enabled: 1
    path: Assets/Scenes/Level5.unity
    guid: 6b3014f3678ef421a9ed95992ad32b7a
