{
  "openapi": "3.0.3",
  "info": {
    "title": "Cookbook API",
    "description": "This is a server to store and manage cookbook",
    "version": "0.3.1",
    "license": {
      "name": "Apache 2.0",
      "url": "https://www.apache.org/licenses/LICENSE-2.0.html"
    }
  },
  "servers": [
    {
      "description": "Development server",
      "url": "https://ashlook.freeboxos.fr/cookbook/api/{basePath}",
      "variables": {
        "basePath": {
          "default": "v0"
        }
      }
    },
    {
      "description": "Local server",
      "url": "http://localhost:{port}",
      "variables": {
        "port": {
          "default": "8096"
        }
      }
    }
  ],
  "tags": [
    {
      "name": "Authentification",
      "description": "Path to get a JWT"
    },
    {
      "name": "Users"
    },
    {
      "name": "Roles",
      "description": "You need to be admin for these operations"
    },
    {
      "name": "Recipes"
    },
    {
      "name": "Steps"
    },
    {
      "name": "Ingredients"
    }
  ],
  "security": [
    {
      "JWTAuth": []
    }
  ],
  "components": {
    "securitySchemes": {
      "JWTAuth": {
        "type": "http",
        "scheme": "bearer",
        "bearerFormat": "JWT"
      }
    },
    "headers": {
      "Location": {
        "description": "The location of the ressource",
        "schema": {
          "type": "string"
        }
      },
      "X-Total-Count": {
        "description": "Total count of ressources in collection for pagination",
        "schema": {
          "type": "integer"
        }
      }
    },
    "schemas": {
      "GeneralError": {
        "description": "Generic error when something goes wrong",
        "type": "object",
        "properties": {
          "status": {
            "type": "integer",
            "format": "int32"
          },
          "name": {
            "type": "string"
          },
          "message": {
            "type": "string"
          },
          "code": {
            "type": "number"
          },
          "details": {
            "type": "object"
          }
        }
      },
      "User": {
        "type": "object",
        "properties": {
          "id": {
            "type": "integer",
            "format": "int32",
            "readOnly": true
          },
          "username": {
            "type": "string",
            "minLength": 3
          },
          "password": {
            "type": "string",
            "format": "password",
            "writeOnly": true,
            "minLength": 8
          },
          "role_id": {
            "type": "integer",
            "format": "int32"
          },
          "role": {
            "readOnly": true,
            "allOf": [
              {
                "$ref": "#/components/schemas/Role"
              }
            ]
          }
        }
      },
      "Role": {
        "type": "object",
        "properties": {
          "id": {
            "type": "integer",
            "format": "int32"
          },
          "name": {
            "type": "string",
            "maxLength": 20
          },
          "desc": {
            "type": "string",
            "maxLength": 255
          }
        }
      },
      "Recipe": {
        "type": "object",
        "properties": {
          "id": {
            "type": "integer",
            "format": "int32",
            "readOnly": true
          },
          "user_id": {
            "type": "integer",
            "format": "int32",
            "readOnly": true
          },
          "name": {
            "type": "string",
            "maxLength": 64
          },
          "desc": {
            "type": "string",
            "maxLength": 255
          },
          "difficulty": {
            "type": "integer",
            "format": "int32",
            "minimum": 1,
            "maximum": 3
          },
          "prep_time": {
            "type": "integer",
            "format": "int32",
            "minimum": 0
          },
          "cook_time": {
            "type": "integer",
            "format": "int32",
            "minimum": 0
          },
          "persons": {
            "type": "integer",
            "format": "int32",
            "minimum": 1
          },
          "note": {
            "type": "string",
            "maxLength": 255
          },
          "user": {
            "readOnly": true,
            "allOf": [
              {
                "$ref": "#/components/schemas/User"
              }
            ]
          },
          "steps": {
            "readOnly": true,
            "type": "array",
            "items": {
              "$ref": "#/components/schemas/Step"
            }
          }
        }
      },
      "Ingredient": {
        "type": "object",
        "properties": {
          "id": {
            "type": "integer",
            "format": "int32",
            "readOnly": true
          },
          "name": {
            "type": "string",
            "maxLength": 20
          }
        }
      },
      "QuantityUnit": {
        "type": "object",
        "properties": {
          "id": {
            "type": "integer",
            "format": "int32",
            "readOnly": true
          },
          "name": {
            "type": "string"
          },
          "abbreviation": {
            "type": "string"
          }
        }
      },
      "Step": {
        "type": "object",
        "properties": {
          "id": {
            "type": "integer",
            "format": "int32",
            "readOnly": true
          },
          "recipe_id": {
            "type": "integer",
            "format": "int32"
          },
          "order": {
            "type": "integer",
            "format": "int32",
            "minimum": 1
          },
          "instruction": {
            "type": "string",
            "maxLength": 512
          },
          "recipe": {
            "readOnly": true,
            "allOf": [
              {
                "$ref": "#/components/schemas/Recipe"
              }
            ]
          }
        }
      }
    },
    "parameters": {
      "include": {
        "name": "include",
        "description": "Relation to include in the response",
        "in": "query",
        "style": "form",
        "required": false,
        "explode": false,
        "schema": {
          "type": "array",
          "items": {
            "type": "string",
            "pattern": "^[a-z_]+"
          }
        }
      },
      "sort": {
        "name": "sort",
        "description": "Fields to apply sort order",
        "in": "query",
        "style": "form",
        "required": false,
        "explode": false,
        "schema": {
          "type": "array",
          "items": {
            "type": "string",
            "pattern": "^[a-z_]+\\.(asc|desc)?$"
          }
        }
      },
      "fields": {
        "name": "fields",
        "description": "Fields to select in request",
        "in": "query",
        "style": "form",
        "required": false,
        "explode": false,
        "schema": {
          "type": "array",
          "minItems": 0,
          "items": {
            "type": "string",
            "pattern": "^[a-z_]+$"
          }
        }
      },
      "limit": {
        "name": "limit",
        "description": "Number of results per page (default 20)",
        "in": "query",
        "style": "form",
        "required": false,
        "schema": {
          "type": "integer",
          "minimum": 1
        }
      },
      "page": {
        "name": "page",
        "description": "Which page to show",
        "in": "query",
        "style": "form",
        "required": false,
        "schema": {
          "type": "integer",
          "minimum": 0
        }
      },
      "userId": {
        "name": "userId",
        "description": "Id of the user",
        "in": "path",
        "style": "simple",
        "required": true,
        "schema": {
          "type": "integer",
          "minimum": 1
        }
      },
      "roleId": {
        "name": "roleId",
        "description": "Id of the role",
        "in": "path",
        "style": "simple",
        "required": true,
        "schema": {
          "type": "integer",
          "minimum": 1
        }
      },
      "recipeId": {
        "name": "recipeId",
        "description": "Id of the recipe",
        "in": "path",
        "style": "simple",
        "required": true,
        "schema": {
          "type": "integer",
          "minimum": 1
        }
      },
      "ingredientId": {
        "name": "ingredientId",
        "description": "Id of the ingredient",
        "in": "path",
        "style": "simple",
        "required": true,
        "schema": {
          "type": "integer",
          "minimum": 1
        }
      },
      "stepId": {
        "name": "stepId",
        "description": "Id of the step",
        "in": "path",
        "style": "simple",
        "required": true,
        "schema": {
          "type": "integer",
          "minimum": 1
        }
      }
    },
    "responses": {
      "BadRequest": {
        "description": "Error in the client request",
        "content": {
          "application/json": {
            "schema": {
              "$ref": "#/components/schemas/GeneralError"
            },
            "example": {
              "status": 400,
              "name": "Bad Request",
              "message": "There is an error with the request"
            }
          }
        }
      },
      "Unauthorized": {
        "description": "You need to be authentified to access this url",
        "content": {
          "application/json": {
            "schema": {
              "$ref": "#/components/schemas/GeneralError"
            },
            "example": {
              "status": 401,
              "name": "Unauthorized",
              "message": "Token signature invalid"
            }
          }
        }
      },
      "Forbidden": {
        "description": "Does not have right",
        "content": {
          "application/json": {
            "schema": {
              "$ref": "#/components/schemas/GeneralError"
            },
            "example": {
              "status": 403,
              "name": "Forbidden",
              "message": "You don't have permission to perform this action"
            }
          }
        }
      },
      "NotFound": {
        "description": "Ressource not found",
        "content": {
          "application/json": {
            "schema": {
              "$ref": "#/components/schemas/GeneralError"
            },
            "example": {
              "status": 404,
              "name": "Not Found",
              "message": "Ressource not found"
            }
          }
        }
      }
    }
  },
  "paths": {
    "/users/authenticate": {
      "post": {
        "description": "Authenticate a user using JWT",
        "tags": [
          "Authentification"
        ],
        "security": [],
        "requestBody": {
          "description": "User credentials",
          "required": true,
          "content": {
            "application/json": {
              "schema": {
                "type": "object",
                "properties": {
                  "username": {
                    "type": "string"
                  },
                  "password": {
                    "type": "string"
                  }
                },
                "required": [
                  "username",
                  "password"
                ]
              },
              "example": {
                "username": "OneUser",
                "password": "sup3rSecr3T"
              }
            }
          }
        },
        "responses": {
          "200": {
            "description": "The JWT token",
            "content": {
              "application/json": {
                "schema": {
                  "type": "object",
                  "properties": {
                    "access_token": {
                      "type": "string"
                    },
                    "token_type": {
                      "type": "string"
                    },
                    "expiresIn": {
                      "type": "string"
                    }
                  }
                },
                "example": {
                  "access_token": "thebase64JWTtoken",
                  "token_type": "JWT",
                  "expiresIn": "15d"
                }
              }
            }
          },
          "400": {
            "$ref": "#/components/responses/BadRequest"
          },
          "401": {
            "description": "Authentification failed",
            "content": {
              "application/json": {
                "schema": {
                  "$ref": "#/components/schemas/GeneralError"
                },
                "example": {
                  "status": 401,
                  "name": "Unauthorized",
                  "message": "Wrong password"
                }
              }
            }
          }
        }
      }
    },
    "/users": {
      "get": {
        "description": "Returns all users",
        "tags": [
          "Users"
        ],
        "security": [],
        "parameters": [
          {
            "$ref": "#/components/parameters/fields"
          },
          {
            "$ref": "#/components/parameters/include"
          },
          {
            "$ref": "#/components/parameters/limit"
          },
          {
            "$ref": "#/components/parameters/page"
          },
          {
            "$ref": "#/components/parameters/sort"
          }
        ],
        "responses": {
          "200": {
            "description": "A list of users",
            "content": {
              "application/json": {
                "schema": {
                  "type": "array",
                  "items": {
                    "$ref": "#/components/schemas/User"
                  }
                },
                "example": [
                  {
                    "id": 1,
                    "username": "username"
                  },
                  {
                    "id": 2,
                    "username": "JohnDoe"
                  }
                ]
              }
            },
            "headers": {
              "X-total-count": {
                "$ref": "#/components/headers/X-Total-Count"
              }
            }
          },
          "204": {
            "description": "No users found"
          },
          "400": {
            "$ref": "#/components/responses/BadRequest"
          }
        }
      },
      "post": {
        "description": "Create a user, must be admin",
        "tags": [
          "Users"
        ],
        "requestBody": {
          "content": {
            "application/json": {
              "schema": {
                "$ref": "#/components/schemas/User"
              },
              "example": {
                "username": "newuser",
                "password": "supersecret"
              }
            }
          }
        },
        "responses": {
          "201": {
            "description": "The newly created user",
            "content": {
              "application/json": {
                "schema": {
                  "$ref": "#/components/schemas/User"
                },
                "example": {
                  "id": 1,
                  "username": "newuser"
                }
              }
            },
            "headers": {
              "Location": {
                "$ref": "#/components/headers/Location"
              }
            }
          },
          "400": {
            "$ref": "#/components/responses/BadRequest"
          },
          "409": {
            "description": "User already exists",
            "content": {
              "application/json": {
                "schema": {
                  "$ref": "#/components/schemas/GeneralError"
                },
                "example": {
                  "status": 409,
                  "name": "Conflict",
                  "message": "Username Ashlook already exists"
                }
              }
            }
          }
        }
      }
    },
    "/users/{userId}": {
      "get": {
        "description": "Return a user",
        "tags": [
          "Users"
        ],
        "security": [],
        "parameters": [
          {
            "$ref": "#/components/parameters/userId"
          },
          {
            "$ref": "#/components/parameters/fields"
          },
          {
            "$ref": "#/components/parameters/include"
          }
        ],
        "responses": {
          "200": {
            "description": "A user",
            "content": {
              "application/json": {
                "schema": {
                  "$ref": "#/components/schemas/User"
                },
                "example": {
                  "id": 1,
                  "username": "username"
                }
              }
            }
          },
          "400": {
            "$ref": "#/components/responses/BadRequest"
          },
          "404": {
            "$ref": "#/components/responses/NotFound"
          }
        }
      },
      "patch": {
        "description": "Update a user",
        "tags": [
          "Users"
        ],
        "parameters": [
          {
            "$ref": "#/components/parameters/userId"
          }
        ],
        "requestBody": {
          "content": {
            "application/json": {
              "schema": {
                "$ref": "#/components/schemas/User"
              },
              "example": {
                "username": "updateduser",
                "password": "n3wPassw0rd"
              }
            }
          }
        },
        "responses": {
          "200": {
            "description": "The updated user",
            "content": {
              "application/json": {
                "schema": {
                  "$ref": "#/components/schemas/User"
                },
                "example": {
                  "id": 1,
                  "username": "username"
                }
              }
            },
            "headers": {
              "Location": {
                "$ref": "#/components/headers/Location"
              }
            }
          },
          "400": {
            "$ref": "#/components/responses/BadRequest"
          },
          "401": {
            "$ref": "#/components/responses/Unauthorized"
          },
          "403": {
            "$ref": "#/components/responses/Forbidden"
          },
          "409": {
            "description": "User already exists",
            "content": {
              "application/json": {
                "schema": {
                  "$ref": "#/components/schemas/GeneralError"
                },
                "example": {
                  "status": 409,
                  "name": "Conflict",
                  "message": "Username Ashlook already exists"
                }
              }
            }
          },
          "404": {
            "$ref": "#/components/responses/NotFound"
          }
        }
      },
      "delete": {
        "description": "Delete a user",
        "tags": [
          "Users"
        ],
        "parameters": [
          {
            "$ref": "#/components/parameters/userId"
          }
        ],
        "responses": {
          "200": {
            "description": "User is deleted"
          },
          "401": {
            "$ref": "#/components/responses/Unauthorized"
          },
          "403": {
            "$ref": "#/components/responses/Forbidden"
          },
          "404": {
            "$ref": "#/components/responses/NotFound"
          }
        }
      }
    },
    "/users/{userId}/recipes": {
      "get": {
        "description": "Return a list of recipes by user",
        "tags": [
          "Users"
        ],
        "security": [],
        "parameters": [
          {
            "$ref": "#/components/parameters/userId"
          },
          {
            "$ref": "#/components/parameters/fields"
          },
          {
            "$ref": "#/components/parameters/include"
          },
          {
            "$ref": "#/components/parameters/limit"
          },
          {
            "$ref": "#/components/parameters/page"
          },
          {
            "$ref": "#/components/parameters/sort"
          }
        ],
        "responses": {
          "200": {
            "description": "A list of recipes",
            "content": {
              "application/json": {
                "schema": {
                  "type": "array",
                  "items": {
                    "$ref": "#/components/schemas/Recipe"
                  }
                },
                "example": [
                  {
                    "id": 1,
                    "user_id": 1,
                    "name": "A recipe",
                    "desc": "What do we cook today ?",
                    "difficulty": 1,
                    "prep_time": 15,
                    "cook_time": 20,
                    "persons": 4,
                    "note": "A super important note"
                  }
                ]
              }
            }
          },
          "204": {
            "description": "No recipes found"
          },
          "400": {
            "$ref": "#/components/responses/BadRequest"
          },
          "404": {
            "$ref": "#/components/responses/NotFound"
          }
        }
      }
    },
    "/roles": {
      "get": {
        "description": "Returns all roles",
        "tags": [
          "Roles"
        ],
        "parameters": [
          {
            "$ref": "#/components/parameters/fields"
          },
          {
            "$ref": "#/components/parameters/include"
          },
          {
            "$ref": "#/components/parameters/limit"
          },
          {
            "$ref": "#/components/parameters/page"
          },
          {
            "$ref": "#/components/parameters/sort"
          }
        ],
        "responses": {
          "200": {
            "description": "A list of roles",
            "content": {
              "application/json": {
                "schema": {
                  "type": "array",
                  "items": {
                    "$ref": "#/components/schemas/Role"
                  }
                },
                "example": [
                  {
                    "id": 12,
                    "name": "user",
                    "desc": "default role"
                  },
                  {
                    "id": 1,
                    "name": "admin",
                    "desc": "admin role"
                  }
                ]
              }
            },
            "headers": {
              "X-total-count": {
                "$ref": "#/components/headers/X-Total-Count"
              }
            }
          },
          "204": {
            "description": "No roles found"
          },
          "400": {
            "$ref": "#/components/responses/BadRequest"
          },
          "401": {
            "$ref": "#/components/responses/Unauthorized"
          },
          "403": {
            "$ref": "#/components/responses/Forbidden"
          }
        }
      },
      "post": {
        "description": "Create a user",
        "tags": [
          "Roles"
        ],
        "requestBody": {
          "content": {
            "application/json": {
              "schema": {
                "$ref": "#/components/schemas/Role"
              },
              "example": {
                "id": 2,
                "name": "newrole",
                "desc": "A new role"
              }
            }
          }
        },
        "responses": {
          "201": {
            "description": "The newly created role",
            "content": {
              "application/json": {
                "schema": {
                  "$ref": "#/components/schemas/Role"
                },
                "example": {
                  "id": 2,
                  "name": "newrole",
                  "desc": "A new role"
                }
              }
            },
            "headers": {
              "Location": {
                "$ref": "#/components/headers/Location"
              }
            }
          },
          "400": {
            "$ref": "#/components/responses/BadRequest"
          },
          "401": {
            "$ref": "#/components/responses/Unauthorized"
          },
          "403": {
            "$ref": "#/components/responses/Forbidden"
          },
          "409": {
            "description": "Role id already exists",
            "content": {
              "application/json": {
                "schema": {
                  "$ref": "#/components/schemas/GeneralError"
                },
                "example": {
                  "status": 409,
                  "name": "Conflict",
                  "message": "Role with id 2 already exists"
                }
              }
            }
          }
        }
      }
    },
    "/roles/{roleId}": {
      "get": {
        "description": "Return a role",
        "tags": [
          "Roles"
        ],
        "parameters": [
          {
            "$ref": "#/components/parameters/roleId"
          },
          {
            "$ref": "#/components/parameters/fields"
          },
          {
            "$ref": "#/components/parameters/include"
          }
        ],
        "responses": {
          "200": {
            "description": "A role",
            "content": {
              "application/json": {
                "schema": {
                  "$ref": "#/components/schemas/Role"
                },
                "example": {
                  "id": 12,
                  "name": "user",
                  "desc": "default role"
                }
              }
            }
          },
          "400": {
            "$ref": "#/components/responses/BadRequest"
          },
          "401": {
            "$ref": "#/components/responses/Unauthorized"
          },
          "403": {
            "$ref": "#/components/responses/Forbidden"
          },
          "404": {
            "$ref": "#/components/responses/NotFound"
          }
        }
      },
      "patch": {
        "description": "Update a role",
        "tags": [
          "Roles"
        ],
        "parameters": [
          {
            "$ref": "#/components/parameters/roleId"
          }
        ],
        "requestBody": {
          "content": {
            "application/json": {
              "schema": {
                "$ref": "#/components/schemas/Role"
              },
              "example": {
                "id": 12,
                "name": "user",
                "desc": "default role"
              }
            }
          }
        },
        "responses": {
          "200": {
            "description": "The updated role",
            "content": {
              "application/json": {
                "schema": {
                  "$ref": "#/components/schemas/Role"
                },
                "example": {
                  "id": 12,
                  "name": "user",
                  "desc": "default role"
                }
              }
            },
            "headers": {
              "Location": {
                "$ref": "#/components/headers/Location"
              }
            }
          },
          "400": {
            "$ref": "#/components/responses/BadRequest"
          },
          "401": {
            "$ref": "#/components/responses/Unauthorized"
          },
          "403": {
            "$ref": "#/components/responses/Forbidden"
          },
          "409": {
            "description": "Role id already exists",
            "content": {
              "application/json": {
                "schema": {
                  "$ref": "#/components/schemas/GeneralError"
                },
                "example": {
                  "status": 409,
                  "name": "Conflict",
                  "message": "Role with id 12 already exists"
                }
              }
            }
          },
          "404": {
            "$ref": "#/components/responses/NotFound"
          }
        }
      },
      "delete": {
        "description": "Delete a role",
        "tags": [
          "Roles"
        ],
        "parameters": [
          {
            "$ref": "#/components/parameters/roleId"
          }
        ],
        "responses": {
          "200": {
            "description": "Role is deleted"
          },
          "401": {
            "$ref": "#/components/responses/Unauthorized"
          },
          "403": {
            "$ref": "#/components/responses/Forbidden"
          },
          "404": {
            "$ref": "#/components/responses/NotFound"
          }
        }
      }
    },
    "/roles/{roleId}/users": {
      "get": {
        "description": "Return a list of users by role",
        "tags": [
          "Roles"
        ],
        "parameters": [
          {
            "$ref": "#/components/parameters/roleId"
          },
          {
            "$ref": "#/components/parameters/fields"
          },
          {
            "$ref": "#/components/parameters/include"
          },
          {
            "$ref": "#/components/parameters/limit"
          },
          {
            "$ref": "#/components/parameters/page"
          },
          {
            "$ref": "#/components/parameters/sort"
          }
        ],
        "responses": {
          "200": {
            "description": "A list of users",
            "content": {
              "application/json": {
                "schema": {
                  "type": "array",
                  "items": {
                    "$ref": "#/components/schemas/User"
                  }
                },
                "example": [
                  {
                    "id": 1,
                    "username": "username"
                  },
                  {
                    "id": 2,
                    "username": "JohnDoe"
                  }
                ]
              }
            }
          },
          "204": {
            "description": "No users found"
          },
          "400": {
            "$ref": "#/components/responses/BadRequest"
          },
          "401": {
            "$ref": "#/components/responses/Unauthorized"
          },
          "403": {
            "$ref": "#/components/responses/Forbidden"
          },
          "404": {
            "$ref": "#/components/responses/NotFound"
          }
        }
      }
    },
    "/recipes": {
      "get": {
        "description": "Returns all recipes",
        "tags": [
          "Recipes"
        ],
        "parameters": [
          {
            "$ref": "#/components/parameters/fields"
          },
          {
            "$ref": "#/components/parameters/include"
          },
          {
            "$ref": "#/components/parameters/limit"
          },
          {
            "$ref": "#/components/parameters/page"
          },
          {
            "$ref": "#/components/parameters/sort"
          }
        ],
        "security": [],
        "responses": {
          "200": {
            "description": "A list of recipes",
            "content": {
              "application/json": {
                "schema": {
                  "type": "array",
                  "items": {
                    "$ref": "#/components/schemas/Recipe"
                  }
                },
                "example": [
                  {
                    "id": 1,
                    "user_id": 1,
                    "name": "A recipe",
                    "desc": "What do we cook today ?",
                    "difficulty": 1,
                    "prep_time": 15,
                    "cook_time": 20,
                    "persons": 4,
                    "note": "A super important note"
                  }
                ]
              }
            },
            "headers": {
              "X-total-count": {
                "$ref": "#/components/headers/X-Total-Count"
              }
            }
          },
          "204": {
            "description": "No recipes found"
          },
          "400": {
            "$ref": "#/components/responses/BadRequest"
          }
        }
      },
      "post": {
        "description": "Create a recipe",
        "tags": [
          "Recipes"
        ],
        "requestBody": {
          "content": {
            "application/json": {
              "schema": {
                "$ref": "#/components/schemas/Recipe"
              },
              "example": {
                "name": "Oeufs mayo",
                "desc": "Ma super recette des oeufs à la mayonaise",
                "difficulty": 1,
                "prep_time": 10,
                "cook_time": 0,
                "persons": 2,
                "note": "Ne pas oublier la mayo"
              }
            }
          }
        },
        "responses": {
          "201": {
            "description": "The newly created recipe",
            "content": {
              "application/json": {
                "schema": {
                  "$ref": "#/components/schemas/Recipe"
                },
                "example": {
                  "id": 1,
                  "user_id": 2,
                  "name": "Oeufs mayo",
                  "desc": "Ma super recette des oeufs à la mayonaise",
                  "difficulty": 1,
                  "prep_time": 10,
                  "cook_time": 0,
                  "persons": 2,
                  "note": "Ne pas oublier la mayo"
                }
              }
            },
            "headers": {
              "Location": {
                "$ref": "#/components/headers/Location"
              }
            }
          },
          "400": {
            "$ref": "#/components/responses/BadRequest"
          },
          "401": {
            "$ref": "#/components/responses/Unauthorized"
          }
        }
      }
    },
    "/recipes/{recipeId}": {
      "get": {
        "description": "Return a recipe",
        "tags": [
          "Recipes"
        ],
        "security": [],
        "parameters": [
          {
            "$ref": "#/components/parameters/recipeId"
          },
          {
            "$ref": "#/components/parameters/fields"
          },
          {
            "$ref": "#/components/parameters/include"
          }
        ],
        "responses": {
          "200": {
            "description": "A recipe",
            "content": {
              "application/json": {
                "schema": {
                  "$ref": "#/components/schemas/Recipe"
                },
                "example": {
                  "id": 1,
                  "user_id": 1,
                  "name": "A recipe",
                  "desc": "What do we cook today ?",
                  "difficulty": 1,
                  "prep_time": 15,
                  "cook_time": 20,
                  "persons": 4,
                  "note": "A super important note"
                }
              }
            }
          },
          "400": {
            "$ref": "#/components/responses/BadRequest"
          },
          "404": {
            "$ref": "#/components/responses/NotFound"
          }
        }
      },
      "patch": {
        "description": "Update a recipe",
        "tags": [
          "Recipes"
        ],
        "parameters": [
          {
            "$ref": "#/components/parameters/recipeId"
          }
        ],
        "requestBody": {
          "content": {
            "application/json": {
              "schema": {
                "$ref": "#/components/schemas/Recipe"
              },
              "example": {
                "name": "Oeufs mayo",
                "desc": "Ma super recette des oeufs à la mayonaise",
                "difficulty": 1,
                "prep_time": 10,
                "cook_time": 0,
                "persons": 2,
                "note": "Ne pas oublier la mayo"
              }
            }
          }
        },
        "responses": {
          "200": {
            "description": "The updated recipe",
            "content": {
              "application/json": {
                "schema": {
                  "$ref": "#/components/schemas/Recipe"
                },
                "example": {
                  "id": 1,
                  "user_id": 2,
                  "name": "Oeufs mayo",
                  "desc": "Ma super recette des oeufs à la mayonaise",
                  "difficulty": 1,
                  "prep_time": 10,
                  "cook_time": 0,
                  "persons": 2,
                  "note": "Ne pas oublier la mayo"
                }
              }
            },
            "headers": {
              "Location": {
                "$ref": "#/components/headers/Location"
              }
            }
          },
          "400": {
            "$ref": "#/components/responses/BadRequest"
          },
          "401": {
            "$ref": "#/components/responses/Unauthorized"
          },
          "403": {
            "$ref": "#/components/responses/Forbidden"
          },
          "404": {
            "$ref": "#/components/responses/NotFound"
          }
        }
      },
      "delete": {
        "description": "Delete a recipe",
        "tags": [
          "Recipes"
        ],
        "parameters": [
          {
            "$ref": "#/components/parameters/recipeId"
          }
        ],
        "responses": {
          "200": {
            "description": "Recipe is deleted"
          },
          "401": {
            "$ref": "#/components/responses/Unauthorized"
          },
          "403": {
            "$ref": "#/components/responses/Forbidden"
          },
          "404": {
            "$ref": "#/components/responses/NotFound"
          }
        }
      }
    },
    "/recipes/{recipeId}/steps": {
      "get": {
        "description": "Return a list of steps for a recipe",
        "tags": [
          "Recipes"
        ],
        "security": [],
        "parameters": [
          {
            "$ref": "#/components/parameters/recipeId"
          },
          {
            "$ref": "#/components/parameters/limit"
          },
          {
            "$ref": "#/components/parameters/page"
          }
        ],
        "responses": {
          "200": {
            "description": "A list of steps",
            "content": {
              "application/json": {
                "schema": {
                  "type": "array",
                  "items": {
                    "$ref": "#/components/schemas/Step"
                  }
                },
                "example": [
                  {
                    "id": 1,
                    "recipe_id": 1,
                    "order": 1,
                    "instruction": "First step"
                  },
                  {
                    "id": 21,
                    "recipe_id": 1,
                    "order": 2,
                    "instruction": "Another step"
                  }
                ]
              }
            }
          },
          "400": {
            "$ref": "#/components/responses/BadRequest"
          },
          "404": {
            "$ref": "#/components/responses/NotFound"
          }
        }
      }
    },
    "/recipes/{recipeId}/ingredients": {
      "get": {
        "description": "Return a list of ingredients for a recipe with the quantity",
        "tags": [
          "Recipes"
        ],
        "security": [],
        "parameters": [
          {
            "$ref": "#/components/parameters/recipeId"
          },
          {
            "$ref": "#/components/parameters/limit"
          },
          {
            "$ref": "#/components/parameters/page"
          }
        ],
        "responses": {
          "200": {
            "description": "A list of ingredients",
            "content": {
              "application/json": {
                "schema": {
                  "type": "array",
                  "items": {
                    "type": "object",
                    "properties": {
                      "quantity": {
                        "type": "string"
                      },
                      "ingredient": {
                        "$ref": "#/components/schemas/Ingredient"
                      },
                      "unit": {
                        "$ref": "#/components/schemas/QuantityUnit"
                      }
                    }
                  }
                },
                "example": [
                  {
                    "quantity": 100,
                    "unit": {
                      "id": 2,
                      "name": "gramme",
                      "abbreviation": "g"
                    },
                    "ingredient": {
                      "id": 1,
                      "name": "Farine"
                    }
                  },
                  {
                    "quantity": 150,
                    "unit": {
                      "id": 3,
                      "name": "unit",
                      "abbreviation": ""
                    },
                    "ingredient": {
                      "id": 2,
                      "name": "sucre"
                    }
                  },
                  {
                    "quantity": 20,
                    "unit": {
                      "id": 1,
                      "name": "centiliter",
                      "abbreviation": "cl"
                    },
                    "ingredient": {
                      "id": 3,
                      "name": "lait"
                    }
                  }
                ]
              }
            }
          },
          "400": {
            "$ref": "#/components/responses/BadRequest"
          },
          "404": {
            "$ref": "#/components/responses/NotFound"
          }
        }
      }
    },
    "/recipes/{recipeId}/ingredients/{ingredientId}": {
      "get": {
        "description": "Return an ingredients for a recipe with the quantity",
        "tags": [
          "Recipes"
        ],
        "security": [],
        "parameters": [
          {
            "$ref": "#/components/parameters/recipeId"
          },
          {
            "$ref": "#/components/parameters/ingredientId"
          }
        ],
        "responses": {
          "200": {
            "description": "An ingredient",
            "content": {
              "application/json": {
                "schema": {
                  "type": "object",
                  "properties": {
                    "quantity": {
                      "type": "string"
                    },
                    "ingredient": {
                      "$ref": "#/components/schemas/Ingredient"
                    },
                    "unit": {
                      "$ref": "#/components/schemas/QuantityUnit"
                    }
                  }
                },
                "example": {
                  "quantity": 100,
                  "unit": {
                    "id": 2,
                    "name": "gramme",
                    "abbreviation": "g"
                  },
                  "ingredient": {
                    "id": 1,
                    "name": "Farine"
                  }
                }
              }
            }
          },
          "400": {
            "$ref": "#/components/responses/BadRequest"
          },
          "404": {
            "$ref": "#/components/responses/NotFound"
          }
        }
      },
      "put": {
        "description": "Set a quantity for an ingredient of a recipe",
        "tags": [
          "Recipes"
        ],
        "parameters": [
          {
            "$ref": "#/components/parameters/recipeId"
          },
          {
            "$ref": "#/components/parameters/ingredientId"
          }
        ],
        "requestBody": {
          "content": {
            "application/json": {
              "schema": {
                "type": "object",
                "properties": {
                  "quantity": {
                    "type": "integer"
                  },
                  "unit_id": {
                    "type": "integer"
                  }
                }
              },
              "example": {
                "quantity": 300,
                "unit_id": 1
              }
            }
          }
        },
        "responses": {
          "200": {
            "description": "The new quantity",
            "content": {
              "application/json": {
                "schema": {
                  "type": "object",
                  "properties": {
                    "quantity": {
                      "type": "string"
                    },
                    "ingredient": {
                      "$ref": "#/components/schemas/Ingredient"
                    },
                    "unit": {
                      "$ref": "#/components/schemas/QuantityUnit"
                    }
                  }
                },
                "example": {
                  "quantity": 300,
                  "unit": {
                    "id": 2,
                    "name": "gramme",
                    "abbreviation": "g"
                  },
                  "ingredient": {
                    "id": 1,
                    "name": "Farine"
                  }
                }
              }
            },
            "headers": {
              "Location": {
                "$ref": "#/components/headers/Location"
              }
            }
          },
          "400": {
            "$ref": "#/components/responses/BadRequest"
          },
          "401": {
            "$ref": "#/components/responses/Unauthorized"
          },
          "403": {
            "$ref": "#/components/responses/Forbidden"
          },
          "404": {
            "$ref": "#/components/responses/NotFound"
          }
        }
      },
      "delete": {
        "description": "Remove an ingredient from a recipe",
        "tags": [
          "Recipes"
        ],
        "parameters": [
          {
            "$ref": "#/components/parameters/recipeId"
          },
          {
            "$ref": "#/components/parameters/ingredientId"
          }
        ],
        "responses": {
          "200": {
            "description": "Ingredient is removed from the recipe"
          },
          "401": {
            "$ref": "#/components/responses/Unauthorized"
          },
          "403": {
            "$ref": "#/components/responses/Forbidden"
          },
          "404": {
            "$ref": "#/components/responses/NotFound"
          }
        }
      }
    },
    "/steps": {
      "get": {
        "description": "Returns all steps",
        "tags": [
          "Steps"
        ],
        "parameters": [
          {
            "$ref": "#/components/parameters/fields"
          },
          {
            "$ref": "#/components/parameters/include"
          },
          {
            "$ref": "#/components/parameters/limit"
          },
          {
            "$ref": "#/components/parameters/page"
          },
          {
            "$ref": "#/components/parameters/sort"
          }
        ],
        "security": [],
        "responses": {
          "200": {
            "description": "A list of steps",
            "content": {
              "application/json": {
                "schema": {
                  "type": "array",
                  "items": {
                    "$ref": "#/components/schemas/Step"
                  }
                },
                "example": [
                  {
                    "id": 1,
                    "recipe_id": 1,
                    "order": 1,
                    "instruction": "First step recipe one"
                  },
                  {
                    "id": 2,
                    "recipe_id": 1,
                    "order": 2,
                    "instruction": "2nd step recipe one"
                  },
                  {
                    "id": 3,
                    "recipe_id": 2,
                    "order": 1,
                    "instruction": "First step recipe two"
                  }
                ]
              }
            },
            "headers": {
              "X-total-count": {
                "$ref": "#/components/headers/X-Total-Count"
              }
            }
          },
          "204": {
            "description": "No steps found"
          },
          "400": {
            "$ref": "#/components/responses/BadRequest"
          }
        }
      },
      "post": {
        "description": "Create a step",
        "tags": [
          "Steps"
        ],
        "requestBody": {
          "content": {
            "application/json": {
              "schema": {
                "$ref": "#/components/schemas/Step"
              },
              "example": {
                "recipe_id": 1,
                "order": 1,
                "instruction": "3333333"
              }
            }
          }
        },
        "responses": {
          "201": {
            "description": "The newly created step",
            "content": {
              "application/json": {
                "schema": {
                  "$ref": "#/components/schemas/Step"
                },
                "example": {
                  "id": 3,
                  "recipe_id": 1,
                  "order": 1,
                  "instruction": "3333333"
                }
              }
            },
            "headers": {
              "Location": {
                "$ref": "#/components/headers/Location"
              }
            }
          },
          "400": {
            "$ref": "#/components/responses/BadRequest"
          },
          "401": {
            "$ref": "#/components/responses/Unauthorized"
          },
          "403": {
            "$ref": "#/components/responses/Forbidden"
          }
        }
      }
    },
    "/steps/{stepId}": {
      "get": {
        "description": "Return a step",
        "tags": [
          "Steps"
        ],
        "security": [],
        "parameters": [
          {
            "$ref": "#/components/parameters/stepId"
          },
          {
            "$ref": "#/components/parameters/fields"
          },
          {
            "$ref": "#/components/parameters/include"
          }
        ],
        "responses": {
          "200": {
            "description": "A step",
            "content": {
              "application/json": {
                "schema": {
                  "$ref": "#/components/schemas/Step"
                },
                "example": {
                  "id": 3,
                  "recipe_id": 1,
                  "order": 1,
                  "instruction": "3333333"
                }
              }
            }
          },
          "400": {
            "$ref": "#/components/responses/BadRequest"
          },
          "404": {
            "$ref": "#/components/responses/NotFound"
          }
        }
      },
      "patch": {
        "description": "Update a step",
        "tags": [
          "Steps"
        ],
        "parameters": [
          {
            "$ref": "#/components/parameters/stepId"
          }
        ],
        "requestBody": {
          "content": {
            "application/json": {
              "schema": {
                "$ref": "#/components/schemas/Step"
              },
              "example": {
                "instruction": "A new instruction"
              }
            }
          }
        },
        "responses": {
          "200": {
            "description": "The updated step",
            "content": {
              "application/json": {
                "schema": {
                  "$ref": "#/components/schemas/Step"
                },
                "example": {
                  "id": 3,
                  "recipe_id": 1,
                  "order": 1,
                  "instruction": "A new instruction"
                }
              }
            },
            "headers": {
              "Location": {
                "$ref": "#/components/headers/Location"
              }
            }
          },
          "400": {
            "$ref": "#/components/responses/BadRequest"
          },
          "401": {
            "$ref": "#/components/responses/Unauthorized"
          },
          "403": {
            "$ref": "#/components/responses/Forbidden"
          },
          "404": {
            "$ref": "#/components/responses/NotFound"
          }
        }
      },
      "delete": {
        "description": "Delete a step",
        "tags": [
          "Steps"
        ],
        "parameters": [
          {
            "$ref": "#/components/parameters/stepId"
          }
        ],
        "responses": {
          "200": {
            "description": "Step is deleted"
          },
          "401": {
            "$ref": "#/components/responses/Unauthorized"
          },
          "403": {
            "$ref": "#/components/responses/Forbidden"
          },
          "404": {
            "$ref": "#/components/responses/NotFound"
          }
        }
      }
    },
    "/ingredients": {
      "get": {
        "description": "Returns all ingredients",
        "tags": [
          "Ingredients"
        ],
        "parameters": [
          {
            "$ref": "#/components/parameters/fields"
          },
          {
            "$ref": "#/components/parameters/include"
          },
          {
            "$ref": "#/components/parameters/limit"
          },
          {
            "$ref": "#/components/parameters/page"
          },
          {
            "$ref": "#/components/parameters/sort"
          }
        ],
        "security": [],
        "responses": {
          "200": {
            "description": "A list of ingredients",
            "content": {
              "application/json": {
                "schema": {
                  "type": "array",
                  "items": {
                    "$ref": "#/components/schemas/Ingredient"
                  }
                },
                "example": [
                  {
                    "id": 1,
                    "name": "Flour"
                  },
                  {
                    "id": 2,
                    "name": "Sugar"
                  }
                ]
              }
            },
            "headers": {
              "X-total-count": {
                "$ref": "#/components/headers/X-Total-Count"
              }
            }
          },
          "204": {
            "description": "No ingredients found"
          },
          "400": {
            "$ref": "#/components/responses/BadRequest"
          }
        }
      },
      "post": {
        "description": "Create an ingredient <br> Must be admin for this operation",
        "tags": [
          "Ingredients"
        ],
        "requestBody": {
          "content": {
            "application/json": {
              "schema": {
                "$ref": "#/components/schemas/Ingredient"
              },
              "example": {
                "name": "Salt"
              }
            }
          }
        },
        "responses": {
          "201": {
            "description": "The newly created ingredient",
            "content": {
              "application/json": {
                "schema": {
                  "$ref": "#/components/schemas/Ingredient"
                },
                "example": {
                  "id": 3,
                  "name": "Salt"
                }
              }
            },
            "headers": {
              "Location": {
                "$ref": "#/components/headers/Location"
              }
            }
          },
          "400": {
            "$ref": "#/components/responses/BadRequest"
          },
          "401": {
            "$ref": "#/components/responses/Unauthorized"
          },
          "403": {
            "$ref": "#/components/responses/Forbidden"
          }
        }
      }
    },
    "/ingredients/{ingredientId}": {
      "get": {
        "description": "Return an ingredient",
        "tags": [
          "Ingredients"
        ],
        "security": [],
        "parameters": [
          {
            "$ref": "#/components/parameters/ingredientId"
          },
          {
            "$ref": "#/components/parameters/fields"
          },
          {
            "$ref": "#/components/parameters/include"
          }
        ],
        "responses": {
          "200": {
            "description": "An ingredient",
            "content": {
              "application/json": {
                "schema": {
                  "$ref": "#/components/schemas/Ingredient"
                },
                "example": {
                  "id": 2,
                  "name": "Sugar"
                }
              }
            }
          },
          "400": {
            "$ref": "#/components/responses/BadRequest"
          },
          "404": {
            "$ref": "#/components/responses/NotFound"
          }
        }
      },
      "patch": {
        "description": "Update an ingredient <br> Must be admin for this operation",
        "tags": [
          "Ingredients"
        ],
        "parameters": [
          {
            "$ref": "#/components/parameters/ingredientId"
          }
        ],
        "requestBody": {
          "content": {
            "application/json": {
              "schema": {
                "$ref": "#/components/schemas/Ingredient"
              },
              "example": {
                "name": "Updated Salt"
              }
            }
          }
        },
        "responses": {
          "200": {
            "description": "The updated ingredient",
            "content": {
              "application/json": {
                "schema": {
                  "$ref": "#/components/schemas/Ingredient"
                },
                "example": {
                  "id": 3,
                  "name": "Updated Salt"
                }
              }
            },
            "headers": {
              "Location": {
                "$ref": "#/components/headers/Location"
              }
            }
          },
          "400": {
            "$ref": "#/components/responses/BadRequest"
          },
          "401": {
            "$ref": "#/components/responses/Unauthorized"
          },
          "403": {
            "$ref": "#/components/responses/Forbidden"
          },
          "404": {
            "$ref": "#/components/responses/NotFound"
          }
        }
      },
      "delete": {
        "description": "Delete an ingredient <br> Must be admin for this operation",
        "tags": [
          "Ingredients"
        ],
        "parameters": [
          {
            "$ref": "#/components/parameters/ingredientId"
          }
        ],
        "responses": {
          "200": {
            "description": "Ingredient is deleted"
          },
          "401": {
            "$ref": "#/components/responses/Unauthorized"
          },
          "403": {
            "$ref": "#/components/responses/Forbidden"
          },
          "404": {
            "$ref": "#/components/responses/NotFound"
          }
        }
      }
    }
  }
}