module gitlab.com/sylva-projects/sylva-elements/sylvactl

go 1.23.0

toolchain go1.24.0

require (
	github.com/fluxcd/flux2/v2 v2.5.1
	github.com/fluxcd/helm-controller/api v1.2.0
	github.com/fluxcd/kustomize-controller/api v1.5.1
	github.com/fluxcd/pkg/apis/meta v1.10.0
	github.com/fluxcd/pkg/ssa v0.45.1
	github.com/fluxcd/source-controller/api v1.5.0
	github.com/go-logr/logr v1.4.2
	github.com/heimdalr/dag v1.5.0
	github.com/mattn/go-colorable v0.1.14
	github.com/onsi/ginkgo/v2 v2.22.2
	github.com/onsi/gomega v1.36.2
	github.com/pkg/errors v0.9.1
	github.com/spf13/cobra v1.9.1
	github.com/stmcginnis/gofish v0.20.0
	golang.org/x/sync v0.11.0
	golang.org/x/term v0.29.0
	k8s.io/api v0.32.2
	k8s.io/apiextensions-apiserver v0.32.2
	k8s.io/apimachinery v0.32.2
	k8s.io/cli-runtime v0.32.2
	k8s.io/client-go v0.32.2
	sigs.k8s.io/cli-utils v0.37.2
	sigs.k8s.io/controller-runtime v0.20.2
	sigs.k8s.io/yaml v1.4.0
)

require github.com/emirpasic/gods v1.18.1 // indirect

require (
	github.com/Azure/go-ansiterm v0.0.0-20230124172434-306776ec8161 // indirect
	github.com/blang/semver/v4 v4.0.0 // indirect
	github.com/cyphar/filepath-securejoin v0.4.1 // indirect
	github.com/davecgh/go-spew v1.1.2-0.20180830191138-d8f796af33cc // indirect
	github.com/emicklei/go-restful/v3 v3.12.1 // indirect
	github.com/evanphx/json-patch/v5 v5.9.11 // indirect
	github.com/fluxcd/cli-utils v0.36.0-flux.12 // indirect
	github.com/fluxcd/pkg/apis/acl v0.6.0 // indirect
	github.com/fluxcd/pkg/apis/kustomize v1.9.0 // indirect
	github.com/fxamacker/cbor/v2 v2.7.0 // indirect
	github.com/go-errors/errors v1.5.1 // indirect
	github.com/go-logr/zapr v1.3.0 // indirect
	github.com/go-openapi/jsonpointer v0.21.0 // indirect
	github.com/go-openapi/jsonreference v0.21.0 // indirect
	github.com/go-openapi/swag v0.23.0 // indirect
	github.com/go-task/slim-sprig/v3 v3.0.0 // indirect
	github.com/gogo/protobuf v1.3.2 // indirect
	github.com/golang/protobuf v1.5.4 // indirect
	github.com/google/btree v1.1.3 // indirect
	github.com/google/gnostic-models v0.6.9 // indirect
	github.com/google/go-cmp v0.6.0 // indirect
	github.com/google/gofuzz v1.2.0 // indirect
	github.com/google/pprof v0.0.0-20250128161936-077ca0a936bf // indirect
	github.com/google/shlex v0.0.0-20191202100458-e7afc7fbc510 // indirect
	github.com/google/uuid v1.6.0 // indirect
	github.com/gregjones/httpcache v0.0.0-20190611155906-901d90724c79 // indirect
	github.com/inconshreveable/mousetrap v1.1.0 // indirect
	github.com/josharian/intern v1.0.0 // indirect
	github.com/json-iterator/go v1.1.12 // indirect
	github.com/liggitt/tabwriter v0.0.0-20181228230101-89fcab3d43de // indirect
	github.com/mailru/easyjson v0.9.0 // indirect
	github.com/mattn/go-isatty v0.0.20 // indirect
	github.com/moby/term v0.5.0 // indirect
	github.com/modern-go/concurrent v0.0.0-20180306012644-bacd9c7ef1dd // indirect
	github.com/modern-go/reflect2 v1.0.2 // indirect
	github.com/monochromegane/go-gitignore v0.0.0-20200626010858-205db1a8cc00 // indirect
	github.com/munnerz/goautoneg v0.0.0-20191010083416-a7dc8b61c822 // indirect
	github.com/peterbourgon/diskv v2.0.1+incompatible // indirect
	github.com/spf13/pflag v1.0.6 // indirect
	github.com/x448/float16 v0.8.4 // indirect
	github.com/xlab/treeprint v1.2.0 // indirect
	go.uber.org/multierr v1.11.0 // indirect
	go.uber.org/zap v1.27.0 // indirect
	golang.org/x/net v0.35.0 // indirect
	golang.org/x/oauth2 v0.25.0 // indirect
	golang.org/x/sys v0.30.0 // indirect
	golang.org/x/text v0.22.0 // indirect
	golang.org/x/time v0.9.0 // indirect
	golang.org/x/tools v0.29.0 // indirect
	google.golang.org/protobuf v1.36.4 // indirect
	gopkg.in/evanphx/json-patch.v4 v4.12.0 // indirect
	gopkg.in/inf.v0 v0.9.1 // indirect
	gopkg.in/yaml.v3 v3.0.1 // indirect
	k8s.io/klog/v2 v2.130.1 // indirect
	k8s.io/kube-openapi v0.0.0-20241212222426-2c72e554b1e7 // indirect
	k8s.io/utils v0.0.0-20241210054802-24370beab758 // indirect
	sigs.k8s.io/json v0.0.0-20241014173422-cfa47c3a1cc8 // indirect
	sigs.k8s.io/kustomize/api v0.19.0 // indirect
	sigs.k8s.io/kustomize/kyaml v0.19.0 // indirect
	sigs.k8s.io/structured-merge-diff/v4 v4.5.0 // indirect
)
