{
  "$schema": "https://docs.renovatebot.com/renovate-schema.json",
  "extends": [
    "gitlab>sylva-projects/sylva-elements/renovate-config:docker"
  ],
  "packageRules": [
    {
      "matchPackagePatterns": [
        "rancher/rke2"
      ],
      "matchUpdateTypes": ["major", "minor"],
      "description": "disabling major and minor version to only keep the patch updates",
      "enabled": false
    },
    {
      "matchPackagePatterns": [
        "rancher/rke2"
      ],
      "description": "renovate to propose only patch update without grouping them with minor update",
      "separateMinorPatch": true,
      "separateMajorMinor": true
    }
  ]
}
