<svg width="15" height="15" viewBox="0 0 15 15" fill="none" xmlns="http://www.w3.org/2000/svg">
<line x1="0.117188" y1="1.5" x2="14.1029" y2="1.5" stroke="#E0E0E0" stroke-width="2"/>
<line x1="0.124512" y1="7.5" x2="14.1102" y2="7.5" stroke="#E0E0E0" stroke-width="2"/>
<line x1="0.131348" y1="13.5" x2="14.1171" y2="13.5" stroke="#E0E0E0" stroke-width="2"/>
</svg>
