[
    {
        "name" : "Test product one",
        "price": "405.32",
        "description": "description for the product", 
        "rating": 4.5,
        "images": [
            {
                "public_id" : "someidlink",
                "url": "anurllink"
            }
        ],
        "category": "Food",
        "seller": "",
        "stock": 3,
        "numberOfReviews": 32,
        "reviews": []
    },
    {
        "name" : "Test product two",
        "price": "45.32",
        "description": "description for the product", 
        "rating": 4.5,
        "images": [
            {
                "public_id" : "someidlink",
                "url": "anurllink"
            }
        ],
        "category": "Food",
        "seller": "",
        "stock": 40,
        "numberOfReviews": 32,
        "reviews": []
    },
    {
        "name" : "Test product three",
        "price": "4510.32",
        "description": "description for the product", 
        "rating": 4.5,
        "images": [
            {
                "public_id" : "someidlink",
                "url": "anurllink"
            }
        ],
        "category": "Food",
        "seller": "",
        "stock": 6,
        "numberOfReviews": 20,
        "reviews": []
    }
]