<svg width="16" height="14" viewBox="0 0 16 14" fill="none" xmlns="http://www.w3.org/2000/svg">
<path d="M14.6668 1H1.3335L6.66683 7.30667V11.6667L9.3335 13V7.30667L14.6668 1Z" stroke="white" stroke-linecap="round" stroke-linejoin="round"/>
</svg>
