{
    "itemPrice": 2.75,
    "taxPrice": 0.14,
    "shippingPrice": 25,
    "totalPrice": 56.00,
    "orderItems": [
        {
            "product": "4545454545",
            "name": "name of the ordered product",
            "price": 2.24,
            "images": "imagelink",
            "quantity": 1
        }
    ],
    "shippingInfo": {
        "address": "28/4, Kaoranbazar",
        "city": "Dhaka",
        "phoneNo": 123456789,
        "potalCode": 1205,
        "country": "Bangladesh"
    }, 
    "paymentInfo": {
        "id": "545454",
        "status": "succeeded"
    }
}