/Users/wiratekdeveloper/Downloads/backend/src/main/java/com/ujian/backend/BackendApplication.java
/Users/wiratekdeveloper/Downloads/backend/src/main/java/com/ujian/backend/entity/ResultUmur.java
/Users/wiratekdeveloper/Downloads/backend/src/main/java/com/ujian/backend/HelloWorld.java
/Users/wiratekdeveloper/Downloads/backend/src/main/java/com/ujian/backend/controllers/HitungGaji.java
/Users/wiratekdeveloper/Downloads/backend/src/main/java/com/ujian/backend/entity/Umur.java
/Users/wiratekdeveloper/Downloads/backend/src/main/java/com/ujian/backend/controllers/CalculateAge.java
