0 6 "微笑" 10 20 30 40 50 85
6 2 "大笑" 10 20
8 6 "发怒" 20 25 35 45 55 65
14 8 "哭泣" 10 20 30 40 50 60 70 80
22 7 "被捅" 30 40 50 60 70 80 85
29 7 "不要" 10 20 30 40 50 60 70
36 6 "被打" 10 20 30 40 50 60
42 4 "鄙视" 20 30 40 50
46 8 "大惊" 10 20 30 40 50 60 70 80
54 4 "呆" 35 45 55 65
58 6 "得意" 10 20 30 40 50 60
64 5 "地主" 10 20 30 35 40
69 2 "躲躲" 50 80
71 3 "跪服" 30 50 55
74 7 "害羞" 20 30 40 50 60 70 80
81 2 "发愁" 40 50
83 4 "加油" 10 20 30 40
87 8 "坏笑" 10 20 30 40 50 60 70 80
95 5 "虎头帽" 10 20 30 40 60
100 12 "汗" 5 10 15 20 25 30 35 40 45 50 55 60
112 2 "酷" 20 60
114 11 "捆绑" 8 16 24 32 40 48 56 64 72 80 88
125 6 "困" 5 10 15 20 25 55
131 15 "雷" 10 30 35 40 45 50 55 60 70 80 90 100 110 120 130
146 7 "钱" 20 30 35 40 45 50 55
153 10 "亲吻" 10 18 26 34 44 54 64 74 84 94
163 4 "色色" 10 20 25 60
167 6 "揉揉" 10 20 30 40 55 60
173 8 "求" 10 15 20 30 40 45 50 75
181 12 "闪亮" 10 15 20 30 35 40 45 50 55 60 65 85
193 10 "石化" 10 20 30 40 45 50 55 60 65 70
203 9 "失败" 30 35 40 45 50 55 60 65 80
212 6 "胜利" 10 20 30 40 55 80
218 5 "睡" 10 20 30 40 60
223 8 "吐白沫" 10 20 30 40 50 60 70 80
231 2 "偷笑" 10 20
233 10 "痛打" 10 15 20 30 40 50 55 60 70 85
243 11 "跳走" 10 20 35 45 55 65 75 90 100 110 125
254 7 "吐血" 10 20 30 40 50 60 70
261 7 "吐舌头" 10 20 30 40 50 60 95
268 10 "性感" 10 20 30 40 50 60 70 80 90 100
278 4 "谢谢" 10 20 30 55
282 3 "嘘" 15 35 80
285 8 "撞墙" 15 20 25 30 35 40 45 50
293 5 "再见" 10 20 30 40 60
298 4 "晕" 10 20 30 40
302 5 "疑问" 10 20 30 40 65
307 5 "心" 30 40 45 50 55
312 2 "鲜花" 10 20
314 2 "牛" 10 20
