<svg width="76" height="76" viewBox="0 0 76 76" fill="none" xmlns="http://www.w3.org/2000/svg">
<path d="M38 35.625C43.2467 35.625 47.5 31.3717 47.5 26.125C47.5 20.8783 43.2467 16.625 38 16.625C32.7533 16.625 28.5 20.8783 28.5 26.125C28.5 31.3717 32.7533 35.625 38 35.625Z" fill="#4AC2A5" stroke="black" stroke-width="2" stroke-linecap="round" stroke-linejoin="round"/>
<path d="M57 35.625C49.875 52.25 38 71.25 38 71.25C38 71.25 26.125 52.25 19 35.625C11.875 19 23.75 4.75 38 4.75C52.25 4.75 64.125 19 57 35.625Z" fill="#4AC2A5" stroke="black" stroke-width="2" stroke-linecap="round" stroke-linejoin="round"/>
<circle cx="37.5" cy="26.5" r="11.5" fill="white"/>
</svg>
