<svg width="139" height="139" viewBox="0 0 139 139" fill="none" xmlns="http://www.w3.org/2000/svg">
<path d="M17.375 52.1249L69.5 11.5833L121.625 52.1249V115.833C121.625 118.905 120.405 121.852 118.232 124.024C116.06 126.196 113.114 127.417 110.042 127.417H28.9583C25.8862 127.417 22.94 126.196 20.7677 124.024C18.5954 121.852 17.375 118.905 17.375 115.833V52.1249Z" stroke="white" stroke-width="8" stroke-linecap="round" stroke-linejoin="round"/>
<path d="M52.125 127.417V69.5H86.875V127.417" stroke="white" stroke-width="8" stroke-linecap="round" stroke-linejoin="round"/>
</svg>
