<svg width="160" height="32" viewBox="0 0 160 32" fill="none" xmlns="http://www.w3.org/2000/svg">
<path d="M16 2L20 12H30L22 19L25 30L16 23L7 30L10 19L2 12H12L16 2Z" fill="#4AC2A5" stroke="black" stroke-width="2" stroke-linecap="round" stroke-linejoin="round"/>
<path d="M48 2L52 12H62L54 19L57 30L48 23L39 30L42 19L34 12H44L48 2Z" fill="#4AC2A5" stroke="black" stroke-width="2" stroke-linecap="round" stroke-linejoin="round"/>
<path d="M80 2L84 12H94L86 19L89 30L80 23L71 30L74 19L66 12H76L80 2Z" fill="#4AC2A5" stroke="black" stroke-width="2" stroke-linecap="round" stroke-linejoin="round"/>
<path d="M112 2L116 12H126L118 19L121 30L112 23L103 30L106 19L98 12H108L112 2Z" stroke="black" stroke-width="2" stroke-linecap="round" stroke-linejoin="round"/>
<path d="M144 2L148 12H158L150 19L153 30L144 23L135 30L138 19L130 12H140L144 2Z" stroke="black" stroke-width="2" stroke-linecap="round" stroke-linejoin="round"/>
</svg>
