<svg width="95" height="95" viewBox="0 0 95 95" fill="none" xmlns="http://www.w3.org/2000/svg">
<path d="M47.5001 28.4725C36.9703 28.4725 28.4722 36.9705 28.4722 47.5003C28.4722 58.0301 36.9703 66.5281 47.5001 66.5281C58.0299 66.5281 66.5279 58.0301 66.5279 47.5003C66.5279 36.9705 58.0299 28.4725 47.5001 28.4725ZM47.5001 59.867C40.6905 59.867 35.1334 54.3099 35.1334 47.5003C35.1334 40.6907 40.6905 35.1336 47.5001 35.1336C54.3096 35.1336 59.8668 40.6907 59.8668 47.5003C59.8668 54.3099 54.3096 59.867 47.5001 59.867ZM67.3072 23.2586C64.8487 23.2586 62.8634 25.244 62.8634 27.7025C62.8634 30.161 64.8487 32.1463 67.3072 32.1463C69.7657 32.1463 71.7511 30.1702 71.7511 27.7025C71.7518 27.1187 71.6373 26.5405 71.4143 26.001C71.1912 25.4615 70.8639 24.9714 70.4511 24.5586C70.0383 24.1458 69.5481 23.8185 69.0087 23.5954C68.4692 23.3723 67.891 23.2579 67.3072 23.2586ZM84.5909 47.5003C84.5909 42.3792 84.6373 37.3045 84.3497 32.1927C84.0621 26.2552 82.7076 20.9857 78.3658 16.6439C74.0147 12.2928 68.7545 10.9476 62.817 10.66C57.6959 10.3724 52.6212 10.4188 47.5093 10.4188C42.3883 10.4188 37.3136 10.3724 32.2017 10.66C26.2642 10.9476 20.9947 12.3021 16.6529 16.6439C12.3018 20.9949 10.9566 26.2552 10.669 32.1927C10.3814 37.3138 10.4278 42.3885 10.4278 47.5003C10.4278 52.6121 10.3814 57.6961 10.669 62.8079C10.9566 68.7454 12.3111 74.015 16.6529 78.3568C21.004 82.7078 26.2642 84.053 32.2017 84.3406C37.3228 84.6282 42.3975 84.5819 47.5093 84.5819C52.6304 84.5819 57.7052 84.6282 62.817 84.3406C68.7545 84.053 74.024 82.6986 78.3658 78.3568C82.7169 74.0057 84.0621 68.7454 84.3497 62.8079C84.6466 57.6961 84.5909 52.6214 84.5909 47.5003ZM76.4268 69.3763C75.7496 71.0648 74.9332 72.3265 73.6251 73.6253C72.317 74.9334 71.0645 75.7498 69.3761 76.4271C64.4962 78.366 52.9088 77.93 47.5001 77.93C42.0914 77.93 30.4947 78.366 25.6148 76.4364C23.9263 75.7591 22.6646 74.9427 21.3658 73.6346C20.0577 72.3265 19.2413 71.0741 18.564 69.3856C16.6344 64.4964 17.0704 52.909 17.0704 47.5003C17.0704 42.0916 16.6344 30.4949 18.564 25.6151C19.2413 23.9266 20.0577 22.6649 21.3658 21.366C22.6739 20.0672 23.9263 19.2415 25.6148 18.5643C30.4947 16.6346 42.0914 17.0706 47.5001 17.0706C52.9088 17.0706 64.5055 16.6346 69.3853 18.5643C71.0738 19.2415 72.3355 20.0579 73.6344 21.366C74.9425 22.6741 75.7589 23.9266 76.4361 25.6151C78.3658 30.4949 77.9298 42.0916 77.9298 47.5003C77.9298 52.909 78.3658 64.4964 76.4268 69.3763Z" fill="black"/>
</svg>
