<svg width="87" height="99" viewBox="0 0 87 99" fill="none" xmlns="http://www.w3.org/2000/svg">
<g clip-path="url(#clip0)">
<path d="M52.8409 39.484V53.2319C52.8409 53.5799 52.569 53.8506 52.2195 53.8506H50.0056C49.792 53.8506 49.5978 53.7346 49.5007 53.5993L43.1699 45.0914V53.2512C43.1699 53.5993 42.898 53.87 42.5485 53.87H40.3346C39.9851 53.87 39.7132 53.5993 39.7132 53.2512V39.5034C39.7132 39.1553 39.9851 38.8846 40.3346 38.8846H42.5291C42.7233 38.8846 42.9369 38.9813 43.034 39.1553L49.3648 47.6631V39.5034C49.3648 39.1553 49.6367 38.8846 49.9862 38.8846H52.2C52.5496 38.8653 52.8409 39.1553 52.8409 39.484ZM36.9168 38.8653H34.7029C34.3534 38.8653 34.0815 39.136 34.0815 39.484V53.2319C34.0815 53.5799 34.3534 53.8506 34.7029 53.8506H36.9168C37.2663 53.8506 37.5382 53.5799 37.5382 53.2319V39.484C37.5382 39.1553 37.2663 38.8653 36.9168 38.8653ZM31.5764 50.3895H25.5369V39.484C25.5369 39.136 25.265 38.8653 24.9154 38.8653H22.7016C22.352 38.8653 22.0802 39.136 22.0802 39.484V53.2319C22.0802 53.4059 22.1384 53.5413 22.255 53.6573C22.3715 53.7539 22.5074 53.8313 22.6822 53.8313H31.557C31.9065 53.8313 32.1784 53.5606 32.1784 53.2125V51.0082C32.1784 50.6795 31.9065 50.3895 31.5764 50.3895ZM64.4927 38.8653H55.6179C55.2878 38.8653 54.9965 39.136 54.9965 39.484V53.2319C54.9965 53.5606 55.2683 53.8506 55.6179 53.8506H64.4927C64.8422 53.8506 65.1141 53.5799 65.1141 53.2319V51.0276C65.1141 50.6795 64.8422 50.4088 64.4927 50.4088H58.4532V48.0885H64.4927C64.8422 48.0885 65.1141 47.8178 65.1141 47.4698V45.2461C65.1141 44.8981 64.8422 44.6274 64.4927 44.6274H58.4532V42.3071H64.4927C64.8422 42.3071 65.1141 42.0364 65.1141 41.6883V39.484C65.0947 39.1553 64.8228 38.8653 64.4927 38.8653ZM87 21.985V77.1504C86.9806 85.8129 79.8536 92.8319 71.1342 92.8125H15.73C7.02995 92.7932 -0.0193796 85.6776 4.00271e-05 77.0151V21.8496C0.0194597 13.1871 7.16589 6.1682 15.8659 6.18754H71.2701C79.9701 6.20688 87.0195 13.3032 87 21.985ZM75.0375 45.6909C75.0375 31.5756 60.8224 20.0901 43.3641 20.0901C25.9058 20.0901 11.6907 31.5756 11.6907 45.6909C11.6907 58.3366 22.9541 68.9327 38.1791 70.9436C41.8882 71.7364 41.461 73.0899 40.6259 78.0592C40.49 78.852 39.9851 81.1723 43.3641 79.7608C46.7431 78.3493 61.5992 69.068 68.2601 61.4496C72.8431 56.4223 75.0375 51.337 75.0375 45.6909Z" fill="black"/>
</g>
<defs>
<clipPath id="clip0">
<rect width="87" height="99" fill="white"/>
</clipPath>
</defs>
</svg>
