module assignment

go 1.19

require (
	github.com/gorilla/handlers v1.5.1
	github.com/gorilla/mux v1.8.0
	github.com/joho/godotenv v1.4.0
	github.com/lib/pq v1.10.7
)

require (
	github.com/felixge/httpsnoop v1.0.1 // indirect
	github.com/teris-io/shortid v0.0.0-20220617161101-71ec9f2aa569
)
