Suite/Test/Step Name,Browser,Description,Tag,Start time,End time,Duration,Status
login,Chrome 114.0.0.0,,,2023-06-27 15:57:17,2023-06-27 15:57:32,"14,578s",PASSED
,,,,,,,
Test Cases/loginValidInputWithDataDriven,Chrome 114.0.0.0,,,2023-06-27 15:57:18,2023-06-27 15:57:26,"8,307s",PASSED
openBrowser(url),Chrome 114.0.0.0,,,2023-06-27 15:57:18,2023-06-27 15:57:23,"4,433s",PASSED
"setText(findTestObject(""loginPage/sauceLabs/username""), username)",Chrome 114.0.0.0,,,2023-06-27 15:57:23,2023-06-27 15:57:24,"1,088s",PASSED
"setText(findTestObject(""loginPage/sauceLabs/password""), password)",Chrome 114.0.0.0,,,2023-06-27 15:57:24,2023-06-27 15:57:25,"0,893s",PASSED
"click(findTestObject(""loginPage/sauceLabs/loginButton""))",Chrome 114.0.0.0,,,2023-06-27 15:57:25,2023-06-27 15:57:25,"0,628s",PASSED
"verifyElementVisible(findTestObject(""loginPage/sauceLabs/pageSwagLabs""))",Chrome 114.0.0.0,,,2023-06-27 15:57:25,2023-06-27 15:57:26,"0,518s",PASSED
,,,,,,,
Test Cases/loginValidInputWithDataDriven,Chrome 114.0.0.0,,,2023-06-27 15:57:26,2023-06-27 15:57:32,"5,497s",PASSED
openBrowser(url),Chrome 114.0.0.0,,,2023-06-27 15:57:26,2023-06-27 15:57:29,"2,651s",PASSED
"setText(findTestObject(""loginPage/sauceLabs/username""), username)",Chrome 114.0.0.0,,,2023-06-27 15:57:29,2023-06-27 15:57:30,"0,927s",PASSED
"setText(findTestObject(""loginPage/sauceLabs/password""), password)",Chrome 114.0.0.0,,,2023-06-27 15:57:30,2023-06-27 15:57:30,"0,839s",PASSED
"click(findTestObject(""loginPage/sauceLabs/loginButton""))",Chrome 114.0.0.0,,,2023-06-27 15:57:30,2023-06-27 15:57:31,"0,605s",PASSED
"verifyElementVisible(findTestObject(""loginPage/sauceLabs/pageSwagLabs""))",Chrome 114.0.0.0,,,2023-06-27 15:57:31,2023-06-27 15:57:32,"0,460s",PASSED
