Suite/Test/Step Name,Browser,Description,Tag,Start time,End time,Duration,Status
checkout,Chrome 114.0.0.0,,,2023-06-27 17:34:04,2023-06-27 17:34:41,"36,856s",PASSED
,,,,,,,
Test Cases/CheckoutItemOnCartWithDataDriven,Chrome 114.0.0.0,,,2023-06-27 17:34:05,2023-06-27 17:34:25,"19,906s",PASSED
openBrowser(url),Chrome 114.0.0.0,,,2023-06-27 17:34:06,2023-06-27 17:34:12,"6,168s",PASSED
"setText(findTestObject(""loginPage/sauceLabs/username""), username)",Chrome 114.0.0.0,,,2023-06-27 17:34:12,2023-06-27 17:34:13,"1,062s",PASSED
"setText(findTestObject(""loginPage/sauceLabs/password""), password)",Chrome 114.0.0.0,,,2023-06-27 17:34:13,2023-06-27 17:34:14,"0,843s",PASSED
"click(findTestObject(""loginPage/sauceLabs/loginButton""))",Chrome 114.0.0.0,,,2023-06-27 17:34:14,2023-06-27 17:34:15,"0,675s",PASSED
"verifyElementVisible(findTestObject(""loginPage/sauceLabs/pageSwagLabs""))",Chrome 114.0.0.0,,,2023-06-27 17:34:15,2023-06-27 17:34:16,"0,570s",PASSED
"click(findTestObject(""checkoutPayment/buttonAddToCart""))",Chrome 114.0.0.0,,,2023-06-27 17:34:16,2023-06-27 17:34:16,"0,569s",PASSED
"click(findTestObject(""checkoutPayment/cartLogo""))",Chrome 114.0.0.0,,,2023-06-27 17:34:16,2023-06-27 17:34:17,"0,619s",PASSED
"click(findTestObject(""checkoutPayment/buttonCheckout""))",Chrome 114.0.0.0,,,2023-06-27 17:34:17,2023-06-27 17:34:17,"0,599s",PASSED
"setText(findTestObject(""checkoutPayment/inputFirstName""), firstname)",Chrome 114.0.0.0,,,2023-06-27 17:34:17,2023-06-27 17:34:18,"0,961s",PASSED
"setText(findTestObject(""checkoutPayment/inputLastName""), lastname)",Chrome 114.0.0.0,,,2023-06-27 17:34:18,2023-06-27 17:34:19,"0,891s",PASSED
"setText(findTestObject(""checkoutPayment/inputZip""), zip)",Chrome 114.0.0.0,,,2023-06-27 17:34:19,2023-06-27 17:34:20,"0,931s",PASSED
"click(findTestObject(""checkoutPayment/continueButton""))",Chrome 114.0.0.0,,,2023-06-27 17:34:20,2023-06-27 17:34:21,"0,655s",PASSED
"verifyElementVisible(findTestObject(""checkoutPayment/paymentInformation""))",Chrome 114.0.0.0,,,2023-06-27 17:34:21,2023-06-27 17:34:21,"0,447s",PASSED
"verifyElementVisible(findTestObject(""checkoutPayment/shippingInformation""))",Chrome 114.0.0.0,,,2023-06-27 17:34:21,2023-06-27 17:34:22,"0,429s",PASSED
"verifyElementVisible(findTestObject(""checkoutPayment/itemTotal""))",Chrome 114.0.0.0,,,2023-06-27 17:34:22,2023-06-27 17:34:22,"0,427s",PASSED
"verifyElementVisible(findTestObject(""checkoutPayment/tax""))",Chrome 114.0.0.0,,,2023-06-27 17:34:22,2023-06-27 17:34:23,"0,449s",PASSED
"verifyElementVisible(findTestObject(""checkoutPayment/total""))",Chrome 114.0.0.0,,,2023-06-27 17:34:23,2023-06-27 17:34:23,"0,450s",PASSED
"click(findTestObject(""checkoutPayment/buttonFinish""))",Chrome 114.0.0.0,,,2023-06-27 17:34:23,2023-06-27 17:34:23,"0,475s",PASSED
"verifyElementVisible(findTestObject(""checkoutPayment/checkoutComplete""))",Chrome 114.0.0.0,,,2023-06-27 17:34:23,2023-06-27 17:34:24,"0,567s",PASSED
"click(findTestObject(""checkoutPayment/buttonBackHome""))",Chrome 114.0.0.0,,,2023-06-27 17:34:24,2023-06-27 17:34:25,"0,514s",PASSED
"verifyElementVisible(findTestObject(""loginPage/sauceLabs/pageSwagLabs""))",Chrome 114.0.0.0,,,2023-06-27 17:34:25,2023-06-27 17:34:25,"0,482s",PASSED
,,,,,,,
Test Cases/CheckoutItemOnCartWithDataDriven,Chrome 114.0.0.0,,,2023-06-27 17:34:25,2023-06-27 17:34:41,"15,855s",PASSED
openBrowser(url),Chrome 114.0.0.0,,,2023-06-27 17:34:25,2023-06-27 17:34:28,"3,165s",PASSED
"setText(findTestObject(""loginPage/sauceLabs/username""), username)",Chrome 114.0.0.0,,,2023-06-27 17:34:28,2023-06-27 17:34:29,"0,960s",PASSED
"setText(findTestObject(""loginPage/sauceLabs/password""), password)",Chrome 114.0.0.0,,,2023-06-27 17:34:29,2023-06-27 17:34:30,"0,844s",PASSED
"click(findTestObject(""loginPage/sauceLabs/loginButton""))",Chrome 114.0.0.0,,,2023-06-27 17:34:30,2023-06-27 17:34:31,"0,588s",PASSED
"verifyElementVisible(findTestObject(""loginPage/sauceLabs/pageSwagLabs""))",Chrome 114.0.0.0,,,2023-06-27 17:34:31,2023-06-27 17:34:31,"0,497s",PASSED
"click(findTestObject(""checkoutPayment/buttonAddToCart""))",Chrome 114.0.0.0,,,2023-06-27 17:34:31,2023-06-27 17:34:32,"0,621s",PASSED
"click(findTestObject(""checkoutPayment/cartLogo""))",Chrome 114.0.0.0,,,2023-06-27 17:34:32,2023-06-27 17:34:33,"0,610s",PASSED
"click(findTestObject(""checkoutPayment/buttonCheckout""))",Chrome 114.0.0.0,,,2023-06-27 17:34:33,2023-06-27 17:34:33,"0,614s",PASSED
"setText(findTestObject(""checkoutPayment/inputFirstName""), firstname)",Chrome 114.0.0.0,,,2023-06-27 17:34:33,2023-06-27 17:34:34,"0,998s",PASSED
"setText(findTestObject(""checkoutPayment/inputLastName""), lastname)",Chrome 114.0.0.0,,,2023-06-27 17:34:34,2023-06-27 17:34:35,"0,976s",PASSED
"setText(findTestObject(""checkoutPayment/inputZip""), zip)",Chrome 114.0.0.0,,,2023-06-27 17:34:35,2023-06-27 17:34:36,"0,947s",PASSED
"click(findTestObject(""checkoutPayment/continueButton""))",Chrome 114.0.0.0,,,2023-06-27 17:34:36,2023-06-27 17:34:37,"0,627s",PASSED
"verifyElementVisible(findTestObject(""checkoutPayment/paymentInformation""))",Chrome 114.0.0.0,,,2023-06-27 17:34:37,2023-06-27 17:34:37,"0,564s",PASSED
"verifyElementVisible(findTestObject(""checkoutPayment/shippingInformation""))",Chrome 114.0.0.0,,,2023-06-27 17:34:37,2023-06-27 17:34:38,"0,446s",PASSED
"verifyElementVisible(findTestObject(""checkoutPayment/itemTotal""))",Chrome 114.0.0.0,,,2023-06-27 17:34:38,2023-06-27 17:34:38,"0,441s",PASSED
"verifyElementVisible(findTestObject(""checkoutPayment/tax""))",Chrome 114.0.0.0,,,2023-06-27 17:34:38,2023-06-27 17:34:39,"0,469s",PASSED
"verifyElementVisible(findTestObject(""checkoutPayment/total""))",Chrome 114.0.0.0,,,2023-06-27 17:34:39,2023-06-27 17:34:39,"0,450s",PASSED
"click(findTestObject(""checkoutPayment/buttonFinish""))",Chrome 114.0.0.0,,,2023-06-27 17:34:39,2023-06-27 17:34:40,"0,480s",PASSED
"verifyElementVisible(findTestObject(""checkoutPayment/checkoutComplete""))",Chrome 114.0.0.0,,,2023-06-27 17:34:40,2023-06-27 17:34:40,"0,472s",PASSED
"click(findTestObject(""checkoutPayment/buttonBackHome""))",Chrome 114.0.0.0,,,2023-06-27 17:34:40,2023-06-27 17:34:41,"0,492s",PASSED
"verifyElementVisible(findTestObject(""loginPage/sauceLabs/pageSwagLabs""))",Chrome 114.0.0.0,,,2023-06-27 17:34:41,2023-06-27 17:34:41,"0,564s",PASSED
