Suite/Test/Step Name,Browser,Description,Tag,Start time,End time,Duration,Status
checkout,Chrome 114.0.0.0,,,2023-06-27 18:01:00,2023-06-27 18:02:53,"1m - 53,493s",PASSED
,,,,,,,
Test Cases/CheckoutItemOnCartWithDataDriven,Chrome 114.0.0.0,,,2023-06-27 18:01:01,2023-06-27 18:01:19,"18,056s",PASSED
openBrowser(url),Chrome 114.0.0.0,,,2023-06-27 18:01:02,2023-06-27 18:01:06,"4,341s",PASSED
"setText(findTestObject(""loginPage/sauceLabs/username""), username)",Chrome 114.0.0.0,,,2023-06-27 18:01:06,2023-06-27 18:01:07,"1,072s",PASSED
"setText(findTestObject(""loginPage/sauceLabs/password""), password)",Chrome 114.0.0.0,,,2023-06-27 18:01:07,2023-06-27 18:01:08,"0,851s",PASSED
"click(findTestObject(""loginPage/sauceLabs/loginButton""))",Chrome 114.0.0.0,,,2023-06-27 18:01:08,2023-06-27 18:01:09,"0,618s",PASSED
"verifyElementVisible(findTestObject(""loginPage/sauceLabs/pageSwagLabs""))",Chrome 114.0.0.0,,,2023-06-27 18:01:09,2023-06-27 18:01:09,"0,540s",PASSED
"click(findTestObject(""checkoutPayment/buttonAddToCart""))",Chrome 114.0.0.0,,,2023-06-27 18:01:09,2023-06-27 18:01:10,"0,483s",PASSED
"click(findTestObject(""checkoutPayment/cartLogo""))",Chrome 114.0.0.0,,,2023-06-27 18:01:10,2023-06-27 18:01:10,"0,632s",PASSED
"click(findTestObject(""checkoutPayment/buttonCheckout""))",Chrome 114.0.0.0,,,2023-06-27 18:01:10,2023-06-27 18:01:11,"0,612s",PASSED
"setText(findTestObject(""checkoutPayment/inputFirstName""), firstname)",Chrome 114.0.0.0,,,2023-06-27 18:01:11,2023-06-27 18:01:12,"0,970s",PASSED
"setText(findTestObject(""checkoutPayment/inputLastName""), lastname)",Chrome 114.0.0.0,,,2023-06-27 18:01:12,2023-06-27 18:01:13,"0,964s",PASSED
"setText(findTestObject(""checkoutPayment/inputZip""), zip)",Chrome 114.0.0.0,,,2023-06-27 18:01:13,2023-06-27 18:01:14,"0,929s",PASSED
"click(findTestObject(""checkoutPayment/continueButton""))",Chrome 114.0.0.0,,,2023-06-27 18:01:14,2023-06-27 18:01:14,"0,597s",PASSED
"verifyElementVisible(findTestObject(""checkoutPayment/paymentInformation""))",Chrome 114.0.0.0,,,2023-06-27 18:01:14,2023-06-27 18:01:15,"0,541s",PASSED
"verifyElementVisible(findTestObject(""checkoutPayment/shippingInformation""))",Chrome 114.0.0.0,,,2023-06-27 18:01:15,2023-06-27 18:01:15,"0,453s",PASSED
"verifyElementVisible(findTestObject(""checkoutPayment/itemTotal""))",Chrome 114.0.0.0,,,2023-06-27 18:01:15,2023-06-27 18:01:16,"0,450s",PASSED
"verifyElementVisible(findTestObject(""checkoutPayment/tax""))",Chrome 114.0.0.0,,,2023-06-27 18:01:16,2023-06-27 18:01:16,"0,452s",PASSED
"verifyElementVisible(findTestObject(""checkoutPayment/total""))",Chrome 114.0.0.0,,,2023-06-27 18:01:16,2023-06-27 18:01:17,"0,448s",PASSED
"click(findTestObject(""checkoutPayment/buttonFinish""))",Chrome 114.0.0.0,,,2023-06-27 18:01:17,2023-06-27 18:01:17,"0,510s",PASSED
"verifyElementVisible(findTestObject(""checkoutPayment/checkoutComplete""))",Chrome 114.0.0.0,,,2023-06-27 18:01:17,2023-06-27 18:01:18,"0,557s",PASSED
"click(findTestObject(""checkoutPayment/buttonBackHome""))",Chrome 114.0.0.0,,,2023-06-27 18:01:18,2023-06-27 18:01:18,"0,496s",PASSED
"verifyElementVisible(findTestObject(""loginPage/sauceLabs/pageSwagLabs""))",Chrome 114.0.0.0,,,2023-06-27 18:01:18,2023-06-27 18:01:19,"0,553s",PASSED
,,,,,,,
Test Cases/CheckoutItemOnCartWithDataDriven,Chrome 114.0.0.0,,,2023-06-27 18:01:19,2023-06-27 18:01:35,"15,474s",PASSED
openBrowser(url),Chrome 114.0.0.0,,,2023-06-27 18:01:19,2023-06-27 18:01:22,"3,112s",PASSED
"setText(findTestObject(""loginPage/sauceLabs/username""), username)",Chrome 114.0.0.0,,,2023-06-27 18:01:22,2023-06-27 18:01:23,"0,942s",PASSED
"setText(findTestObject(""loginPage/sauceLabs/password""), password)",Chrome 114.0.0.0,,,2023-06-27 18:01:23,2023-06-27 18:01:24,"0,863s",PASSED
"click(findTestObject(""loginPage/sauceLabs/loginButton""))",Chrome 114.0.0.0,,,2023-06-27 18:01:24,2023-06-27 18:01:25,"0,611s",PASSED
"verifyElementVisible(findTestObject(""loginPage/sauceLabs/pageSwagLabs""))",Chrome 114.0.0.0,,,2023-06-27 18:01:25,2023-06-27 18:01:25,"0,531s",PASSED
"click(findTestObject(""checkoutPayment/buttonAddToCart""))",Chrome 114.0.0.0,,,2023-06-27 18:01:25,2023-06-27 18:01:26,"0,481s",PASSED
"click(findTestObject(""checkoutPayment/cartLogo""))",Chrome 114.0.0.0,,,2023-06-27 18:01:26,2023-06-27 18:01:26,"0,604s",PASSED
"click(findTestObject(""checkoutPayment/buttonCheckout""))",Chrome 114.0.0.0,,,2023-06-27 18:01:26,2023-06-27 18:01:27,"0,530s",PASSED
"setText(findTestObject(""checkoutPayment/inputFirstName""), firstname)",Chrome 114.0.0.0,,,2023-06-27 18:01:27,2023-06-27 18:01:28,"0,953s",PASSED
"setText(findTestObject(""checkoutPayment/inputLastName""), lastname)",Chrome 114.0.0.0,,,2023-06-27 18:01:28,2023-06-27 18:01:29,"0,966s",PASSED
"setText(findTestObject(""checkoutPayment/inputZip""), zip)",Chrome 114.0.0.0,,,2023-06-27 18:01:29,2023-06-27 18:01:30,"0,889s",PASSED
"click(findTestObject(""checkoutPayment/continueButton""))",Chrome 114.0.0.0,,,2023-06-27 18:01:30,2023-06-27 18:01:30,"0,625s",PASSED
"verifyElementVisible(findTestObject(""checkoutPayment/paymentInformation""))",Chrome 114.0.0.0,,,2023-06-27 18:01:30,2023-06-27 18:01:31,"0,541s",PASSED
"verifyElementVisible(findTestObject(""checkoutPayment/shippingInformation""))",Chrome 114.0.0.0,,,2023-06-27 18:01:31,2023-06-27 18:01:31,"0,421s",PASSED
"verifyElementVisible(findTestObject(""checkoutPayment/itemTotal""))",Chrome 114.0.0.0,,,2023-06-27 18:01:31,2023-06-27 18:01:32,"0,462s",PASSED
"verifyElementVisible(findTestObject(""checkoutPayment/tax""))",Chrome 114.0.0.0,,,2023-06-27 18:01:32,2023-06-27 18:01:32,"0,470s",PASSED
"verifyElementVisible(findTestObject(""checkoutPayment/total""))",Chrome 114.0.0.0,,,2023-06-27 18:01:32,2023-06-27 18:01:33,"0,438s",PASSED
"click(findTestObject(""checkoutPayment/buttonFinish""))",Chrome 114.0.0.0,,,2023-06-27 18:01:33,2023-06-27 18:01:33,"0,478s",PASSED
"verifyElementVisible(findTestObject(""checkoutPayment/checkoutComplete""))",Chrome 114.0.0.0,,,2023-06-27 18:01:33,2023-06-27 18:01:33,"0,484s",PASSED
"click(findTestObject(""checkoutPayment/buttonBackHome""))",Chrome 114.0.0.0,,,2023-06-27 18:01:33,2023-06-27 18:01:34,"0,460s",PASSED
"verifyElementVisible(findTestObject(""loginPage/sauceLabs/pageSwagLabs""))",Chrome 114.0.0.0,,,2023-06-27 18:01:34,2023-06-27 18:01:35,"0,577s",PASSED
,,,,,,,
Test Cases/CheckoutWithDataDriven2ItemOnCart,Chrome 114.0.0.0,,,2023-06-27 18:01:35,2023-06-27 18:01:51,"16,388s",PASSED
openBrowser(url),Chrome 114.0.0.0,,,2023-06-27 18:01:35,2023-06-27 18:01:38,"2,642s",PASSED
"setText(findTestObject(""loginPage/sauceLabs/username""), username)",Chrome 114.0.0.0,,,2023-06-27 18:01:38,2023-06-27 18:01:39,"0,961s",PASSED
"setText(findTestObject(""loginPage/sauceLabs/password""), password)",Chrome 114.0.0.0,,,2023-06-27 18:01:39,2023-06-27 18:01:40,"0,834s",PASSED
"click(findTestObject(""loginPage/sauceLabs/loginButton""))",Chrome 114.0.0.0,,,2023-06-27 18:01:40,2023-06-27 18:01:40,"0,564s",PASSED
"verifyElementVisible(findTestObject(""loginPage/sauceLabs/pageSwagLabs""))",Chrome 114.0.0.0,,,2023-06-27 18:01:40,2023-06-27 18:01:41,"0,488s",PASSED
"click(findTestObject(""checkoutPayment/buttonAddToCart""))",Chrome 114.0.0.0,,,2023-06-27 18:01:41,2023-06-27 18:01:42,"0,603s",PASSED
"click(findTestObject(""checkoutPayment/Page_Swag Labs/buttonAddToCartBike""))",Chrome 114.0.0.0,,,2023-06-27 18:01:42,2023-06-27 18:01:42,"0,505s",PASSED
"click(findTestObject(""checkoutPayment/cartLogo""))",Chrome 114.0.0.0,,,2023-06-27 18:01:42,2023-06-27 18:01:43,"0,607s",PASSED
"click(findTestObject(""checkoutPayment/buttonCheckout""))",Chrome 114.0.0.0,,,2023-06-27 18:01:43,2023-06-27 18:01:43,"0,638s",PASSED
"setText(findTestObject(""checkoutPayment/inputFirstName""), firstname)",Chrome 114.0.0.0,,,2023-06-27 18:01:43,2023-06-27 18:01:44,"0,930s",PASSED
"setText(findTestObject(""checkoutPayment/inputLastName""), lastname)",Chrome 114.0.0.0,,,2023-06-27 18:01:44,2023-06-27 18:01:45,"0,932s",PASSED
"setText(findTestObject(""checkoutPayment/inputZip""), zip)",Chrome 114.0.0.0,,,2023-06-27 18:01:45,2023-06-27 18:01:46,"0,927s",PASSED
"click(findTestObject(""checkoutPayment/continueButton""))",Chrome 114.0.0.0,,,2023-06-27 18:01:46,2023-06-27 18:01:47,"0,595s",PASSED
"verifyElementVisible(findTestObject(""checkoutPayment/paymentInformation""))",Chrome 114.0.0.0,,,2023-06-27 18:01:47,2023-06-27 18:01:47,"0,555s",PASSED
"verifyElementVisible(findTestObject(""checkoutPayment/shippingInformation""))",Chrome 114.0.0.0,,,2023-06-27 18:01:47,2023-06-27 18:01:48,"0,443s",PASSED
"verifyElementVisible(findTestObject(""checkoutPayment/itemTotal""))",Chrome 114.0.0.0,,,2023-06-27 18:01:48,2023-06-27 18:01:48,"0,435s",PASSED
"verifyElementVisible(findTestObject(""checkoutPayment/tax""))",Chrome 114.0.0.0,,,2023-06-27 18:01:48,2023-06-27 18:01:49,"0,447s",PASSED
"verifyElementVisible(findTestObject(""checkoutPayment/total""))",Chrome 114.0.0.0,,,2023-06-27 18:01:49,2023-06-27 18:01:49,"0,436s",PASSED
"click(findTestObject(""checkoutPayment/buttonFinish""))",Chrome 114.0.0.0,,,2023-06-27 18:01:49,2023-06-27 18:01:49,"0,476s",PASSED
"verifyElementVisible(findTestObject(""checkoutPayment/checkoutComplete""))",Chrome 114.0.0.0,,,2023-06-27 18:01:49,2023-06-27 18:01:50,"0,568s",PASSED
"click(findTestObject(""checkoutPayment/buttonBackHome""))",Chrome 114.0.0.0,,,2023-06-27 18:01:50,2023-06-27 18:01:51,"0,545s",PASSED
"verifyElementVisible(findTestObject(""loginPage/sauceLabs/pageSwagLabs""))",Chrome 114.0.0.0,,,2023-06-27 18:01:51,2023-06-27 18:01:51,"0,475s",PASSED
,,,,,,,
Test Cases/CheckoutWithDataDriven2ItemOnCart,Chrome 114.0.0.0,,,2023-06-27 18:01:51,2023-06-27 18:02:07,"15,852s",PASSED
openBrowser(url),Chrome 114.0.0.0,,,2023-06-27 18:01:51,2023-06-27 18:01:54,"2,984s",PASSED
"setText(findTestObject(""loginPage/sauceLabs/username""), username)",Chrome 114.0.0.0,,,2023-06-27 18:01:54,2023-06-27 18:01:55,"0,932s",PASSED
"setText(findTestObject(""loginPage/sauceLabs/password""), password)",Chrome 114.0.0.0,,,2023-06-27 18:01:55,2023-06-27 18:01:56,"0,821s",PASSED
"click(findTestObject(""loginPage/sauceLabs/loginButton""))",Chrome 114.0.0.0,,,2023-06-27 18:01:56,2023-06-27 18:01:56,"0,552s",PASSED
"verifyElementVisible(findTestObject(""loginPage/sauceLabs/pageSwagLabs""))",Chrome 114.0.0.0,,,2023-06-27 18:01:56,2023-06-27 18:01:57,"0,516s",PASSED
"click(findTestObject(""checkoutPayment/buttonAddToCart""))",Chrome 114.0.0.0,,,2023-06-27 18:01:57,2023-06-27 18:01:57,"0,495s",PASSED
"click(findTestObject(""checkoutPayment/Page_Swag Labs/buttonAddToCartBike""))",Chrome 114.0.0.0,,,2023-06-27 18:01:57,2023-06-27 18:01:58,"0,575s",PASSED
"click(findTestObject(""checkoutPayment/cartLogo""))",Chrome 114.0.0.0,,,2023-06-27 18:01:58,2023-06-27 18:01:59,"0,620s",PASSED
"click(findTestObject(""checkoutPayment/buttonCheckout""))",Chrome 114.0.0.0,,,2023-06-27 18:01:59,2023-06-27 18:01:59,"0,581s",PASSED
"setText(findTestObject(""checkoutPayment/inputFirstName""), firstname)",Chrome 114.0.0.0,,,2023-06-27 18:01:59,2023-06-27 18:02:00,"0,949s",PASSED
"setText(findTestObject(""checkoutPayment/inputLastName""), lastname)",Chrome 114.0.0.0,,,2023-06-27 18:02:00,2023-06-27 18:02:01,"0,938s",PASSED
"setText(findTestObject(""checkoutPayment/inputZip""), zip)",Chrome 114.0.0.0,,,2023-06-27 18:02:01,2023-06-27 18:02:02,"0,903s",PASSED
"click(findTestObject(""checkoutPayment/continueButton""))",Chrome 114.0.0.0,,,2023-06-27 18:02:02,2023-06-27 18:02:03,"0,580s",PASSED
"verifyElementVisible(findTestObject(""checkoutPayment/paymentInformation""))",Chrome 114.0.0.0,,,2023-06-27 18:02:03,2023-06-27 18:02:03,"0,546s",PASSED
"verifyElementVisible(findTestObject(""checkoutPayment/shippingInformation""))",Chrome 114.0.0.0,,,2023-06-27 18:02:03,2023-06-27 18:02:04,"0,447s",PASSED
"verifyElementVisible(findTestObject(""checkoutPayment/itemTotal""))",Chrome 114.0.0.0,,,2023-06-27 18:02:04,2023-06-27 18:02:04,"0,466s",PASSED
"verifyElementVisible(findTestObject(""checkoutPayment/tax""))",Chrome 114.0.0.0,,,2023-06-27 18:02:04,2023-06-27 18:02:05,"0,464s",PASSED
"verifyElementVisible(findTestObject(""checkoutPayment/total""))",Chrome 114.0.0.0,,,2023-06-27 18:02:05,2023-06-27 18:02:05,"0,452s",PASSED
"click(findTestObject(""checkoutPayment/buttonFinish""))",Chrome 114.0.0.0,,,2023-06-27 18:02:05,2023-06-27 18:02:05,"0,462s",PASSED
"verifyElementVisible(findTestObject(""checkoutPayment/checkoutComplete""))",Chrome 114.0.0.0,,,2023-06-27 18:02:05,2023-06-27 18:02:06,"0,554s",PASSED
"click(findTestObject(""checkoutPayment/buttonBackHome""))",Chrome 114.0.0.0,,,2023-06-27 18:02:06,2023-06-27 18:02:07,"0,509s",PASSED
"verifyElementVisible(findTestObject(""loginPage/sauceLabs/pageSwagLabs""))",Chrome 114.0.0.0,,,2023-06-27 18:02:07,2023-06-27 18:02:07,"0,476s",PASSED
,,,,,,,
Test Cases/CheckoutWithGlitchUser,Chrome 114.0.0.0,,,2023-06-27 18:02:07,2023-06-27 18:02:24,"17,430s",PASSED
openBrowser(url),Chrome 114.0.0.0,,,2023-06-27 18:02:08,2023-06-27 18:02:11,"2,692s",PASSED
"setText(findTestObject(""loginPage/sauceLabs/username""), ""performance_glitch_user"")",Chrome 114.0.0.0,,,2023-06-27 18:02:11,2023-06-27 18:02:12,"0,981s",PASSED
"setEncryptedText(findTestObject(""loginPage/sauceLabs/password""), ""qcu24s4901FyWDTwXGr6XA=="")",Chrome 114.0.0.0,,,2023-06-27 18:02:12,2023-06-27 18:02:12,"0,621s",PASSED
"click(findTestObject(""loginPage/sauceLabs/loginButton""))",Chrome 114.0.0.0,,,2023-06-27 18:02:12,2023-06-27 18:02:18,"5,539s",PASSED
"verifyElementVisible(findTestObject(""loginPage/sauceLabs/pageSwagLabs""))",Chrome 114.0.0.0,,,2023-06-27 18:02:18,2023-06-27 18:02:18,"0,546s",PASSED
"click(findTestObject(""checkoutPayment/buttonAddToCart""))",Chrome 114.0.0.0,,,2023-06-27 18:02:18,2023-06-27 18:02:19,"0,450s",PASSED
"click(findTestObject(""checkoutPayment/cartLogo""))",Chrome 114.0.0.0,,,2023-06-27 18:02:19,2023-06-27 18:02:19,"0,585s",PASSED
"click(findTestObject(""checkoutPayment/buttonCheckout""))",Chrome 114.0.0.0,,,2023-06-27 18:02:19,2023-06-27 18:02:20,"0,575s",PASSED
"setText(findTestObject(""checkoutPayment/inputFirstName""), ""Kesal"")",Chrome 114.0.0.0,,,2023-06-27 18:02:20,2023-06-27 18:02:21,"0,956s",PASSED
"setText(findTestObject(""checkoutPayment/inputLastName""), ""Bin Ajaib"")",Chrome 114.0.0.0,,,2023-06-27 18:02:21,2023-06-27 18:02:22,"0,921s",PASSED
"setText(findTestObject(""checkoutPayment/inputZip""), ""1241"")",Chrome 114.0.0.0,,,2023-06-27 18:02:22,2023-06-27 18:02:23,"0,935s",PASSED
"click(findTestObject(""checkoutPayment/continueButton""))",Chrome 114.0.0.0,,,2023-06-27 18:02:23,2023-06-27 18:02:23,"0,549s",PASSED
"verifyElementVisible(findTestObject(""checkoutPayment/buttonFinish""))",Chrome 114.0.0.0,,,2023-06-27 18:02:23,2023-06-27 18:02:24,"0,478s",PASSED
closeBrowser(),Chrome 114.0.0.0,,,2023-06-27 18:02:24,2023-06-27 18:02:24,"0,800s",PASSED
,,,,,,,
Test Cases/checkoutWithGlitchUser2ItemOnCart,Chrome 114.0.0.0,,,2023-06-27 18:02:24,2023-06-27 18:02:42,"17,172s",PASSED
openBrowser(url),Chrome 114.0.0.0,,,2023-06-27 18:02:25,2023-06-27 18:02:27,"1,898s",PASSED
"setText(findTestObject(""loginPage/sauceLabs/username""), ""performance_glitch_user"")",Chrome 114.0.0.0,,,2023-06-27 18:02:27,2023-06-27 18:02:28,"0,984s",PASSED
"setEncryptedText(findTestObject(""loginPage/sauceLabs/password""), ""qcu24s4901FyWDTwXGr6XA=="")",Chrome 114.0.0.0,,,2023-06-27 18:02:28,2023-06-27 18:02:29,"0,559s",PASSED
"click(findTestObject(""loginPage/sauceLabs/loginButton""))",Chrome 114.0.0.0,,,2023-06-27 18:02:29,2023-06-27 18:02:34,"5,598s",PASSED
"verifyElementVisible(findTestObject(""loginPage/sauceLabs/pageSwagLabs""))",Chrome 114.0.0.0,,,2023-06-27 18:02:34,2023-06-27 18:02:35,"0,491s",PASSED
"click(findTestObject(""checkoutPayment/buttonAddToCart""))",Chrome 114.0.0.0,,,2023-06-27 18:02:35,2023-06-27 18:02:35,"0,556s",PASSED
"click(findTestObject(""checkoutPayment/Page_Swag Labs/buttonAddToCartBike""))",Chrome 114.0.0.0,,,2023-06-27 18:02:35,2023-06-27 18:02:36,"0,574s",PASSED
"click(findTestObject(""checkoutPayment/cartLogo""))",Chrome 114.0.0.0,,,2023-06-27 18:02:36,2023-06-27 18:02:36,"0,575s",PASSED
"click(findTestObject(""checkoutPayment/buttonCheckout""))",Chrome 114.0.0.0,,,2023-06-27 18:02:36,2023-06-27 18:02:37,"0,572s",PASSED
"setText(findTestObject(""checkoutPayment/inputFirstName""), ""Kesal"")",Chrome 114.0.0.0,,,2023-06-27 18:02:37,2023-06-27 18:02:38,"0,948s",PASSED
"setText(findTestObject(""checkoutPayment/inputLastName""), ""Bin Ajaib"")",Chrome 114.0.0.0,,,2023-06-27 18:02:38,2023-06-27 18:02:39,"0,943s",PASSED
"setText(findTestObject(""checkoutPayment/inputZip""), ""1241"")",Chrome 114.0.0.0,,,2023-06-27 18:02:39,2023-06-27 18:02:40,"0,894s",PASSED
"click(findTestObject(""checkoutPayment/continueButton""))",Chrome 114.0.0.0,,,2023-06-27 18:02:40,2023-06-27 18:02:40,"0,568s",PASSED
"verifyElementVisible(findTestObject(""checkoutPayment/buttonFinish""))",Chrome 114.0.0.0,,,2023-06-27 18:02:40,2023-06-27 18:02:41,"0,573s",PASSED
closeBrowser(),Chrome 114.0.0.0,,,2023-06-27 18:02:41,2023-06-27 18:02:42,"0,771s",PASSED
,,,,,,,
Test Cases/checkoutWithProblemUser,Chrome 114.0.0.0,,,2023-06-27 18:02:42,2023-06-27 18:02:53,"11,791s",PASSED
openBrowser(url),Chrome 114.0.0.0,,,2023-06-27 18:02:42,2023-06-27 18:02:44,"2,130s",PASSED
"setText(findTestObject(""loginPage/sauceLabs/username""), ""problem_user"")",Chrome 114.0.0.0,,,2023-06-27 18:02:44,2023-06-27 18:02:45,"0,951s",PASSED
"setEncryptedText(findTestObject(""loginPage/sauceLabs/password""), ""qcu24s4901FyWDTwXGr6XA=="")",Chrome 114.0.0.0,,,2023-06-27 18:02:45,2023-06-27 18:02:46,"0,546s",PASSED
"click(findTestObject(""loginPage/sauceLabs/loginButton""))",Chrome 114.0.0.0,,,2023-06-27 18:02:46,2023-06-27 18:02:47,"0,617s",PASSED
"verifyElementVisible(findTestObject(""loginPage/sauceLabs/pageSwagLabs""))",Chrome 114.0.0.0,,,2023-06-27 18:02:47,2023-06-27 18:02:47,"0,464s",PASSED
"click(findTestObject(""checkoutPayment/buttonAddToCart""))",Chrome 114.0.0.0,,,2023-06-27 18:02:47,2023-06-27 18:02:48,"0,605s",PASSED
"click(findTestObject(""checkoutPayment/cartLogo""))",Chrome 114.0.0.0,,,2023-06-27 18:02:48,2023-06-27 18:02:48,"0,612s",PASSED
"click(findTestObject(""checkoutPayment/buttonCheckout""))",Chrome 114.0.0.0,,,2023-06-27 18:02:48,2023-06-27 18:02:49,"0,604s",PASSED
"setText(findTestObject(""checkoutPayment/inputFirstName""), ""Kesal"")",Chrome 114.0.0.0,,,2023-06-27 18:02:49,2023-06-27 18:02:50,"0,908s",PASSED
"setText(findTestObject(""checkoutPayment/inputLastName""), ""Bin Ajaib"")",Chrome 114.0.0.0,,,2023-06-27 18:02:50,2023-06-27 18:02:51,"0,978s",PASSED
"setText(findTestObject(""checkoutPayment/inputZip""), ""1241"")",Chrome 114.0.0.0,,,2023-06-27 18:02:51,2023-06-27 18:02:52,"0,955s",PASSED
"click(findTestObject(""checkoutPayment/continueButton""))",Chrome 114.0.0.0,,,2023-06-27 18:02:52,2023-06-27 18:02:52,"0,495s",PASSED
"verifyElementVisible(findTestObject(""checkoutPayment/Page_Swag Labs/ErrorLastNameIsRequired""))",Chrome 114.0.0.0,,,2023-06-27 18:02:52,2023-06-27 18:02:53,"0,535s",PASSED
closeBrowser(),Chrome 114.0.0.0,,,2023-06-27 18:02:53,2023-06-27 18:02:53,"0,759s",PASSED
