<svg xmlns="http://www.w3.org/2000/svg" viewBox="0 0 640 640">
  <defs>
    <style>.cls-1{fill:#e08696;}.cls-2{fill:#fff;fill-rule:evenodd;}</style>
  </defs>
  <title>badge-kaoruko_hanayagi</title>
  <g id="background">
    <circle class="cls-1" cx="320" cy="320" r="320"/>
  </g>
  <g id="main">
    <path class="cls-2" d="M414.3,193.7H235.7c0-7.9-.8-15.9.1-23.8,3.9-32.2,19.1-59.5,39.2-84.2,11.3-13.9,23.8-26.9,35.7-40.4,4.6-5.2,9.1-10.6,14-16.3,2.8,2.5,5.6,4.5,7.9,7.1,11.8,13.1,23.3,26.4,35.1,39.4,17.6,19.5,31.5,41.2,40.8,65.7a64,64,0,0,1,3.5,16.3C413.1,169.4,413.6,181.3,414.3,193.7ZM324.6,49.6c-.8.7-1.5,1.3-2.1,1.9-8.1,8.8-16,17.9-24.3,26.5-16.8,17.4-31.3,36.3-40.3,58.9-5,12.6-9.5,25.5-10,39.3-.2,5.7-.1,5.6,5.6,5.7,2.5,0,3.3-.7,3.6-3.3.9-7,1.8-14.1,3.7-20.9a145.23,145.23,0,0,1,28.1-54.3c8.9-10.6,18.5-20.6,27.8-30.9q3.75-4.2,7.8-8.4c7,7.6,13.7,14.6,20.1,22,8.4,9.7,17.3,19.1,24.4,29.7a132.55,132.55,0,0,1,21.5,59.1c.9,7.4,1.3,7.6,8.3,7.1,2.2-.2,2.9-1.2,2.5-3.1-1.5-8.3-2.5-16.8-4.6-24.9-7.1-26.6-20.6-49.5-40-69.1-6.7-6.7-13-13.8-19.5-20.8C333.1,59.3,329,54.5,324.6,49.6Z" transform="translate(-5 -5)"/>
    <path class="cls-2" d="M421.1,195.9c4.4-.7,8.6-1.8,12.9-2,13.4-.7,26.9-1.2,40.3-1.7,15-.5,30.1.1,44.3,5.2,15.7,5.6,31,12.2,46.4,18.5,12.2,5,24.3,10.4,36.4,15.6,1.2.5,2.4,1.1,3.7,1.8-5.4,8.8-10.7,17.3-15.7,25.8-7.3,12.5-13.7,25.5-21.6,37.5-7.8,11.8-14.2,24.6-24.4,34.8-14.4,14.4-30,27.2-49,34.8-4.9,2-10.6,1.9-16,2.5-.9.1-2.5-1.5-2.9-2.6-9.4-29.4-18.7-58.8-28.1-88.1l-25.5-79.5A13.66,13.66,0,0,1,421.1,195.9Zm63.5,157.7c22.9-8.4,49.9-29.6,64.4-51,5.4-8,9.8-16.7,14.7-25.1,4-6.9,7.9-13.9,11.9-20.8,3.3-5.7,6.5-11.3,10-17.2-1.9-.9-3.3-1.5-4.8-2.2-13.1-5.8-26.3-11.3-39.2-17.5-28.9-13.9-59.2-19.6-91.1-16.1-4.7.5-9.4,2.1-14,3.2,1.5,8.6,1.5,8.6,9.1,7.2h.4c24.7-5,48.9-2.1,72.2,6.2,17.9,6.4,34.9,15.1,52.4,22.8.5.2,1,.4,1.3.5-6.3,11.2-12.4,21.6-18,32.3a149,149,0,0,1-32.8,42.4,151.92,151.92,0,0,1-37.4,24.5c-1.1.5-2.5,2.2-2.3,2.9a52.33,52.33,0,0,0,3.2,7.9Z" transform="translate(-5 -5)"/>
    <path class="cls-2" d="M473.3,378.2a98.09,98.09,0,0,1,19.2,30.3c6.9,16.6,10.6,33.9,12.2,51.8,1.6,18.2-.2,36.1-2.2,54.1-1.7,15.5-2.7,31-4,46.6-.1.8-.2,1.7-.3,2.9-5.4-1.4-10.5-3-15.7-4.1-17.6-3.9-35.4-7.2-53-11.4-25.7-6.3-49.8-16.4-70.5-33.1-10.1-8.1-19.7-16.9-27.1-27.8-2.9-4.3-2.8-4.3,1.3-7.3q62.25-45.3,124.4-90.6C462.8,385.9,468,382.1,473.3,378.2Zm4,157.2c-1.4-.3-2.5-.5-3.6-.7-10.2-2.1-20.4-4.5-30.7-6.3-21.6-3.6-41.8-10.8-59.5-23.8-9.4-6.9-17.7-15.4-26.5-23-.9-.8-2.7-1.7-3.5-1.4-2.1,1-4,2.8-6.4,4.6,4.4,4.5,8.2,8.6,12.2,12.4a145.25,145.25,0,0,0,65.4,36.1c17.4,4.3,35,7.5,52.5,11.3,2.9.6,5.7,1.2,8.9,1.8.2-1.4.3-2.4.4-3.4.9-9.2,1.8-18.4,2.8-27.5,1.2-11.9,3.2-23.8,3.6-35.7A156.44,156.44,0,0,0,481,412.6c-2.6-6.3-6.9-12-10.4-18-7.8,5.1-7.8,5.1-4,11.8a8.26,8.26,0,0,1,.7,1.3c11.4,21,15.8,43.8,15.9,67.3,0,12.4-2,24.8-3.2,37.2-.7,7.7-1.7,15.2-2.7,23.2Z" transform="translate(-5 -5)"/>
    <path class="cls-2" d="M43.7,232.9c6.7-2.8,12.8-5.3,19-8,15-6.6,29.7-13.7,44.9-19.6,12.4-4.8,25.1-9.1,38.1-11.7,10.9-2.1,22.3-1.7,33.5-1.9,9.6-.2,19.2.1,28.8.7,6.4.4,12.7,1.9,19.9,3.1L172.7,365.2c-10.3,1.7-18.9-2.1-27.3-6.6a158.52,158.52,0,0,1-44.6-36,226.49,226.49,0,0,1-25.3-34.7c-10.3-17.6-20.5-35.3-30.8-53A8.34,8.34,0,0,0,43.7,232.9Zm19.4,6.6c1.1,2,2,3.7,3,5.4,6.8,11.6,13.9,23,20.3,34.9,10.5,19.7,23.8,37.2,40.8,51.6,9.2,7.7,18.6,15.1,30,19.4,8.1,3.1,8.1,3.1,9.5-6a16.18,16.18,0,0,0-1.8-1c-21.5-8.8-38-23.9-52.7-41.4-10.2-12.1-17.2-26.2-25-39.8-3.5-6.2-6.9-12.3-10.5-18.6l2.2-1.1c10.8-4.9,21.7-9.5,32.3-14.8a149.16,149.16,0,0,1,59.3-15.2,138.09,138.09,0,0,1,35.7,3.2c2.6.6,3.7-.1,4.3-2.4.5-1.9,1.1-3.7,1.9-6.4-7.6-1-14.7-2.1-21.8-2.9-22-2.5-43.8-.4-64.4,7.6C105.1,220.1,84.6,230,63.1,239.5Z" transform="translate(-5 -5)"/>
    <path class="cls-2" d="M153.7,562.8c-.5-6.7-.9-13.1-1.6-19.4-1.5-14.7-3.2-29.5-4.8-44.2a52.93,52.93,0,0,1-.5-5.6c0-14.2-.8-28.5.2-42.7.7-10.4,3.9-20.7,5.7-31.1,1.7-10.1,7.5-18,12.5-26.4,2.8-4.6,5.7-9,8.6-13.5l1.8-1.8,18.7,13.6,120.2,87.9c4.5,3.3,4.6,4,1.4,8.5a131.3,131.3,0,0,1-38.1,35.4c-23.6,14.6-49.1,23.8-76.4,28.7-15.2,2.7-30.2,6.5-45.2,9.8A9.17,9.17,0,0,1,153.7,562.8Zm18-27.4c-.3-2-.7-3.4-.8-4.9-.9-8.4-1.6-16.9-2.8-25.3-2.3-16.2-3.5-32.4-1.2-48.8a144,144,0,0,1,16-49.4c3.8-7,3.9-6.9-3-10.9-.3-.1-.7-.3-1-.4a2.65,2.65,0,0,0-.6.5A149.4,149.4,0,0,0,156.6,463c-1.3,15.9.5,31.6,2.7,47.3,1.4,9.9,2.3,19.8,3.1,29.7.6,6.9.3,6.8,6.9,5.4,14.7-3.1,29.5-6.1,44.2-9.2,27.8-5.8,52.9-17.4,74.6-35.7,5.3-4.4,9.6-9.9,14.6-15-1.7-1.4-2.6-2.2-3.6-3-4-3.2-4-3-7.4.8A125.89,125.89,0,0,1,279,495.9a142.56,142.56,0,0,1-54.5,27.8c-12,3.1-24.3,5.5-36.4,8.1-5.3,1.3-10.6,2.4-16.4,3.6Z" transform="translate(-5 -5)"/>
    <path class="cls-2" d="M330.6,391.5c0-16.4-.1-32.3.1-48.3,0-1,1.7-2.6,2.9-3,22.2-7.4,44.4-14.6,66.6-21.8,14.5-4.7,29.1-9.4,43.9-14.3,2.9,8.7,5.7,17.2,8.5,25.8,4.1,12.5,8,25.1,12.2,37.6.8,2.3.5,3.6-1.5,5-8.3,5.9-16.5,12-24.9,17.9a7.19,7.19,0,0,1-3.7,1.3q-51,.15-101.9,0A18,18,0,0,1,330.6,391.5Z" transform="translate(-5 -5)"/>
    <path class="cls-2" d="M433.3,271.2,331,304.5V204.7a27.18,27.18,0,0,1,3.1-.3q37.35,0,74.5-.1c2.4,0,3.5.7,4.3,2.9,6.6,20.7,13.3,41.3,20,62Z" transform="translate(-5 -5)"/>
    <path class="cls-2" d="M190,350.1c3-9.5,5.8-18.2,8.6-27,3.3-10.2,6.6-20.4,9.9-30.5.6-1.8,1.2-2.9,3.5-2.9q52,.15,104.1.1a12.64,12.64,0,0,1,2.1.3c0,5.6.1,11.4-.1,17,0,.8-1.8,1.9-2.9,2.3q-27.75,9.15-55.7,18.2l-65,21.2C193.4,349.2,192.1,349.5,190,350.1Z" transform="translate(-5 -5)"/>
    <path class="cls-2" d="M436.8,281.7c1.4,4.3,2.6,8.1,4,12.2l-70.7,22.9L193.5,374a8.58,8.58,0,0,1-9.4-2.6c-1.5-1.9,1.1-7.9,3.9-8.8,15-4.9,30.1-9.8,45.1-14.7l170.3-55.3Z" transform="translate(-5 -5)"/>
    <path class="cls-2" d="M318.2,345.1v46.7h-4.4c-31.8,0-63.5-.1-95.2.1-4.5,0-8.3-.9-11.6-3.9-1.9-1.6-3.9-3-6.3-4.8Z" transform="translate(-5 -5)"/>
    <path class="cls-2" d="M237.1,204.6h81V238H226.3C230,226.8,233.5,215.8,237.1,204.6Z" transform="translate(-5 -5)"/>
    <path class="cls-2" d="M419.7,404.1l-88.9,64.6V404.1Z" transform="translate(-5 -5)"/>
    <path class="cls-2" d="M229.1,404h89v64.7Z" transform="translate(-5 -5)"/>
    <path class="cls-2" d="M222.1,251.1h96.1v26.2H213.6C216.4,268.5,219.3,259.8,222.1,251.1Z" transform="translate(-5 -5)"/>
  </g>
</svg>