Biprocess 0 (that is, the initial process):
{1}let pk_EL: public_ekey = mergepk(pube(sk_EL_1)) in
(
    {2}let id: agent_id = idA in
    {3}let is_target_voter: bool = true in
    {4}let Sk_id: private_ekey = ske(id) in
    {5}let VCks_id: bitstring = Enc_s(KSkey(SVK(id)),Sk_id,pk_EL) in
    {6}out(c, VCks_id);
    (
        {7}if is_target_voter then
        {8}let (hpCCA1: num,hpCCB1: num) = (H(pCC(Sk_id,v(jA1))),H(pCC(Sk_id,v(jB1)))) in
        {9}let (lpCCA1: num,lpCCB1: num) = (H((hpCCA1,VC(id))),H((hpCCB1,VC(id)))) in
        {10}let pCA1: num = tild(kCCR(VC(id)),H(pCC(Sk_id,v(jA1)))) in
        {11}let pCB1: num = tild(kCCR(VC(id)),H(pCC(Sk_id,v(jB1)))) in
        {12}let lCCA1: num = H(H((VC(id),pCA1))) in
        {13}let lCCB1: num = H(H((VC(id),pCB1))) in
        {14}let kCCR_all: private_ekey = merge_keys(kCCR'(1,VC(id)),kCCR'(2,VC(id))) in
        {15}let lVCC_1: num = tild(kCCR'(1,VC(id)),H(tild(Sk_id,H(BCK(id))))) in
        {16}let lVCC_2: num = tild(kCCR'(2,VC(id)),H(tild(Sk_id,H(BCK(id))))) in
        {17}let hlVCC_1: num = H((lVCC_1,VC(id))) in
        {18}let hlVCC_2: num = H((lVCC_2,VC(id))) in
        {19}let hhlVCC: num = H((hlVCC_1,hlVCC_2,VC(id))) in
        {20}insert L_lVCC(hhlVCC);
        {21}let pVCC: num = tild(kCCR_all,H(tild(Sk_id,H(BCK(id))))) in
        {22}let lVCC: num = H(H((VC(id),pVCC))) in
        (
            {23}out(c, choice[lpCCA1,lpCCB1])
        ) | (
            {24}out(c, choice[lpCCB1,lpCCA1])
        ) | (
            {25}out(c, choice[lCCA1,lCCB1])
        ) | (
            {26}out(c, choice[lCCB1,lCCA1])
        ) | (
            {27}out(c, (hlVCC_2,hhlVCC));
            {28}out(c, lVCC);
            {29}let ee_1: election_event = ee in
            {30}let SVK_id: password = SVK(id) in
            {31}let EA_id: extended_auth = EA(id) in
            {32}let salt: salt_type = H((ee_1,credentialId)) in
            {33}let credentialId_id: bitstring = Argon2id(SVK_id,salt) in
            {34}let credentialId_id_1: bitstring = credentialId_id in
            {35}let salt_1: salt_type = H((ee_1,hAuth)) in
            {36}let k: bitstring = (EA_id,SVK_id) in
            {37}let hAuth_id: bitstring = Argon2id(k,salt_1) in
            {38}let hAuth_id_1: bitstring = hAuth_id in
            {39}out(c, (credentialId_id_1,hAuth_id_1))
        )
    ) | (
        {40}!
        {41}in(c, J: num);
        {42}if (not(is_target_voter) || ((J ≠ jA1) && (J ≠ jB1))) then
        {43}let hpCC: num = H(pCC(Sk_id,v(J))) in
        {44}let lpCC: num = H((hpCC,VC(id))) in
        {45}let pC: num = tild(kCCR(VC(id)),H(pCC(Sk_id,v(J)))) in
        {46}let lCC: num = H(H((VC(id),pC))) in
        {47}let kCCR_all_1: private_ekey = merge_keys(kCCR'(1,VC(id)),kCCR'(2,VC(id))) in
        {48}let lVCC_3: num = tild(kCCR'(1,VC(id)),H(tild(Sk_id,H(BCK(id))))) in
        {49}let lVCC_4: num = tild(kCCR'(2,VC(id)),H(tild(Sk_id,H(BCK(id))))) in
        {50}let hlVCC: num = H((lVCC_3,VC(id))) in
        {51}let hlVCC_3: num = H((lVCC_4,VC(id))) in
        {52}let hhlVCC_1: num = H((hlVCC,hlVCC_3,VC(id))) in
        {53}insert L_lVCC(hhlVCC_1);
        {54}let pVCC_1: num = tild(kCCR_all_1,H(tild(Sk_id,H(BCK(id))))) in
        {55}let lVCC_5: num = H(H((VC(id),pVCC_1))) in
        {56}out(c, (lpCC,lCC,lVCC_5));
        {57}out(c, (hlVCC_3,hhlVCC_1));
        {58}let ee_2: election_event = ee in
        {59}let SVK_id_1: password = SVK(id) in
        {60}let EA_id_1: extended_auth = EA(id) in
        {61}let salt_2: salt_type = H((ee_2,credentialId)) in
        {62}let credentialId_id_2: bitstring = Argon2id(SVK_id_1,salt_2) in
        {63}let credentialId_id_3: bitstring = credentialId_id_2 in
        {64}let salt_3: salt_type = H((ee_2,hAuth)) in
        {65}let k_1: bitstring = (EA_id_1,SVK_id_1) in
        {66}let hAuth_id_2: bitstring = Argon2id(k_1,salt_3) in
        {67}let hAuth_id_3: bitstring = hAuth_id_2 in
        {68}out(c, (credentialId_id_3,hAuth_id_3))
    )
) | (
    {69}let id_1: agent_id = idB in
    {70}let is_target_voter_1: bool = true in
    {71}let Sk_id_1: private_ekey = ske(id_1) in
    {72}let VCks_id_1: bitstring = Enc_s(KSkey(SVK(id_1)),Sk_id_1,pk_EL) in
    {73}out(c, VCks_id_1);
    (
        {74}if is_target_voter_1 then
        {75}let (hpCCA1_1: num,hpCCB1_1: num) = (H(pCC(Sk_id_1,v(jA1))),H(pCC(Sk_id_1,v(jB1)))) in
        {76}let (lpCCA1_1: num,lpCCB1_1: num) = (H((hpCCA1_1,VC(id_1))),H((hpCCB1_1,VC(id_1)))) in
        {77}let pCA1_1: num = tild(kCCR(VC(id_1)),H(pCC(Sk_id_1,v(jA1)))) in
        {78}let pCB1_1: num = tild(kCCR(VC(id_1)),H(pCC(Sk_id_1,v(jB1)))) in
        {79}let lCCA1_1: num = H(H((VC(id_1),pCA1_1))) in
        {80}let lCCB1_1: num = H(H((VC(id_1),pCB1_1))) in
        {81}let kCCR_all_2: private_ekey = merge_keys(kCCR'(1,VC(id_1)),kCCR'(2,VC(id_1))) in
        {82}let lVCC_6: num = tild(kCCR'(1,VC(id_1)),H(tild(Sk_id_1,H(BCK(id_1))))) in
        {83}let lVCC_7: num = tild(kCCR'(2,VC(id_1)),H(tild(Sk_id_1,H(BCK(id_1))))) in
        {84}let hlVCC_4: num = H((lVCC_6,VC(id_1))) in
        {85}let hlVCC_5: num = H((lVCC_7,VC(id_1))) in
        {86}let hhlVCC_2: num = H((hlVCC_4,hlVCC_5,VC(id_1))) in
        {87}insert L_lVCC(hhlVCC_2);
        {88}let pVCC_2: num = tild(kCCR_all_2,H(tild(Sk_id_1,H(BCK(id_1))))) in
        {89}let lVCC_8: num = H(H((VC(id_1),pVCC_2))) in
        (
            {90}out(c, choice[lpCCA1_1,lpCCB1_1])
        ) | (
            {91}out(c, choice[lpCCB1_1,lpCCA1_1])
        ) | (
            {92}out(c, choice[lCCA1_1,lCCB1_1])
        ) | (
            {93}out(c, choice[lCCB1_1,lCCA1_1])
        ) | (
            {94}out(c, (hlVCC_5,hhlVCC_2));
            {95}out(c, lVCC_8);
            {96}let ee_3: election_event = ee in
            {97}let SVK_id_2: password = SVK(id_1) in
            {98}let EA_id_2: extended_auth = EA(id_1) in
            {99}let salt_4: salt_type = H((ee_3,credentialId)) in
            {100}let credentialId_id_4: bitstring = Argon2id(SVK_id_2,salt_4) in
            {101}let credentialId_id_5: bitstring = credentialId_id_4 in
            {102}let salt_5: salt_type = H((ee_3,hAuth)) in
            {103}let k_2: bitstring = (EA_id_2,SVK_id_2) in
            {104}let hAuth_id_4: bitstring = Argon2id(k_2,salt_5) in
            {105}let hAuth_id_5: bitstring = hAuth_id_4 in
            {106}out(c, (credentialId_id_5,hAuth_id_5))
        )
    ) | (
        {107}!
        {108}in(c, J_1: num);
        {109}if (not(is_target_voter_1) || ((J_1 ≠ jA1) && (J_1 ≠ jB1))) then
        {110}let hpCC_1: num = H(pCC(Sk_id_1,v(J_1))) in
        {111}let lpCC_1: num = H((hpCC_1,VC(id_1))) in
        {112}let pC_1: num = tild(kCCR(VC(id_1)),H(pCC(Sk_id_1,v(J_1)))) in
        {113}let lCC_1: num = H(H((VC(id_1),pC_1))) in
        {114}let kCCR_all_3: private_ekey = merge_keys(kCCR'(1,VC(id_1)),kCCR'(2,VC(id_1))) in
        {115}let lVCC_9: num = tild(kCCR'(1,VC(id_1)),H(tild(Sk_id_1,H(BCK(id_1))))) in
        {116}let lVCC_10: num = tild(kCCR'(2,VC(id_1)),H(tild(Sk_id_1,H(BCK(id_1))))) in
        {117}let hlVCC_6: num = H((lVCC_9,VC(id_1))) in
        {118}let hlVCC_7: num = H((lVCC_10,VC(id_1))) in
        {119}let hhlVCC_3: num = H((hlVCC_6,hlVCC_7,VC(id_1))) in
        {120}insert L_lVCC(hhlVCC_3);
        {121}let pVCC_3: num = tild(kCCR_all_3,H(tild(Sk_id_1,H(BCK(id_1))))) in
        {122}let lVCC_11: num = H(H((VC(id_1),pVCC_3))) in
        {123}out(c, (lpCC_1,lCC_1,lVCC_11));
        {124}out(c, (hlVCC_7,hhlVCC_3));
        {125}let ee_4: election_event = ee in
        {126}let SVK_id_3: password = SVK(id_1) in
        {127}let EA_id_3: extended_auth = EA(id_1) in
        {128}let salt_6: salt_type = H((ee_4,credentialId)) in
        {129}let credentialId_id_6: bitstring = Argon2id(SVK_id_3,salt_6) in
        {130}let credentialId_id_7: bitstring = credentialId_id_6 in
        {131}let salt_7: salt_type = H((ee_4,hAuth)) in
        {132}let k_3: bitstring = (EA_id_3,SVK_id_3) in
        {133}let hAuth_id_6: bitstring = Argon2id(k_3,salt_7) in
        {134}let hAuth_id_7: bitstring = hAuth_id_6 in
        {135}out(c, (credentialId_id_7,hAuth_id_7))
    )
) | (
    {136}out(c, pube(sk_EL_1));
    {137}out(c, pk_EL);
    {138}let Id: agent_id = idA in
    {139}out(c, pube(ske(Id)));
    {140}let Id_1: agent_id = idB in
    {141}out(c, pube(ske(Id_1)));
    (
        {142}let InitData: bitstring = AliceData(idA) in
        {143}let J1: num = choice[jA1,jB1] in
        {144}let (SVK_id_4: password,EA_id_4: extended_auth,VC_id: bitstring,BCK_id: num,VCCid: bitstring,CCid1: bitstring) = GetAliceData(InitData,J1) in
        {145}new T_init: timestamp;
        {146}out(c, T_init);
        {147}let ee_5: election_event = ee in
        {148}let authStep: bitstring = authenticateVoter in
        {149}let T: timestamp = T_init in
        {150}let salt_8: salt_type = H((ee_5,credentialId)) in
        {151}let credentialId_id_8: bitstring = Argon2id(SVK_id_4,salt_8) in
        {152}let credentialId_id_9: bitstring = credentialId_id_8 in
        {153}let salt_9: salt_type = H((ee_5,hAuth)) in
        {154}let k_4: bitstring = (EA_id_4,SVK_id_4) in
        {155}let hAuth_id_8: bitstring = Argon2id(k_4,salt_9) in
        {156}let hAuth_id_9: bitstring = hAuth_id_8 in
        {157}new nonce: Nonce;
        {158}let salt_10: salt_type = H((ee_5,credentialId_id_9,dAuth,authStep,nonce)) in
        {159}let hhAuth_id: bitstring = Argon2id((hAuth_id_9,T),salt_10) in
        {160}let (credentialId_id_init: bitstring,hhAuth_id_init: bitstring,nonce_init: Nonce) = (credentialId_id_9,hhAuth_id,nonce) in
        {161}out(c, (credentialId_id_init,hhAuth_id_init,nonce_init));
        {162}in(c, (VCks_id_2: bitstring,pk_EL_1: public_ekey));
        {163}let KSkey_id: symmetric_ekey = KSkey(SVK_id_4) in
        {164}let Sk_id_2: private_ekey = catch-fail(Dec_s(KSkey_id,VCks_id_2,pk_EL_1)) in
        {165}let v_1: bool = not-caught-fail(Sk_id_2) in
        {166}let Sk_id_3: private_ekey = (if v_1 then Sk_id_2 else fail-any_type) in
        {167}let Pk_id: public_ekey = pube(Sk_id_3) in
        {168}let V: num = v(J1) in
        {169}new R: num;
        {170}let E1: bitstring = Enc(pk_EL_1,V,R) in
        {171}let E2: bitstring = pCC(Sk_id_3,v(J1)) in
        {172}let P: bitstring = ZKP(pk_EL_1,Pk_id,VC_id,E1,E2,R,Sk_id_3) in
        {173}let ballot: bitstring = (E1,E2,tild(Sk_id_3,E1),Pk_id,P) in
        {174}new T_vote: timestamp;
        {175}out(c, T_vote);
        {176}let ee_6: election_event = ee in
        {177}let authStep_1: bitstring = authenticateVoter in
        {178}let T_1: timestamp = T_vote in
        {179}let salt_11: salt_type = H((ee_6,credentialId)) in
        {180}let credentialId_id_10: bitstring = Argon2id(SVK_id_4,salt_11) in
        {181}let credentialId_id_11: bitstring = credentialId_id_10 in
        {182}let salt_12: salt_type = H((ee_6,hAuth)) in
        {183}let k_5: bitstring = (EA_id_4,SVK_id_4) in
        {184}let hAuth_id_10: bitstring = Argon2id(k_5,salt_12) in
        {185}let hAuth_id_11: bitstring = hAuth_id_10 in
        {186}new nonce_1: Nonce;
        {187}let salt_13: salt_type = H((ee_6,credentialId_id_11,dAuth,authStep_1,nonce_1)) in
        {188}let hhAuth_id_1: bitstring = Argon2id((hAuth_id_11,T_1),salt_13) in
        {189}let (credentialId_id_vote: bitstring,hhAuth_id_vote: bitstring,nonce_vote: Nonce) = (credentialId_id_11,hhAuth_id_1,nonce_1) in
        {190}out(c, (ballot,hhAuth_id_vote,nonce_vote));
        {191}in(c, Rcv_CC_1: bitstring);
        {192}if (Rcv_CC_1 = CCid1) then
        {193}new T_confirm: timestamp;
        {194}out(c, T_confirm);
        {195}let ee_7: election_event = ee in
        {196}let authStep_2: bitstring = authenticateVoter in
        {197}let T_2: timestamp = T_confirm in
        {198}let salt_14: salt_type = H((ee_7,credentialId)) in
        {199}let credentialId_id_12: bitstring = Argon2id(SVK_id_4,salt_14) in
        {200}let credentialId_id_13: bitstring = credentialId_id_12 in
        {201}let salt_15: salt_type = H((ee_7,hAuth)) in
        {202}let k_6: bitstring = (EA_id_4,SVK_id_4) in
        {203}let hAuth_id_12: bitstring = Argon2id(k_6,salt_15) in
        {204}let hAuth_id_13: bitstring = hAuth_id_12 in
        {205}new nonce_2: Nonce;
        {206}let salt_16: salt_type = H((ee_7,credentialId_id_13,dAuth,authStep_2,nonce_2)) in
        {207}let hhAuth_id_2: bitstring = Argon2id((hAuth_id_13,T_2),salt_16) in
        {208}let (credentialId_id_confirm: bitstring,hhAuth_id_confirm: bitstring,nonce_confirm: Nonce) = (credentialId_id_13,hhAuth_id_2,nonce_2) in
        {209}out(c, (tild(Sk_id_3,H(BCK_id)),hhAuth_id_confirm,nonce_confirm));
        {210}in(c, =VCCid)
    ) | (
        {211}let InitData_1: bitstring = AliceData(idB) in
        {212}let J1_1: num = choice[jB1,jA1] in
        {213}let (SVK_id_5: password,EA_id_5: extended_auth,VC_id_1: bitstring,BCK_id_1: num,VCCid_1: bitstring,CCid1_1: bitstring) = GetAliceData(InitData_1,J1_1) in
        {214}new T_init_1: timestamp;
        {215}out(c, T_init_1);
        {216}let ee_8: election_event = ee in
        {217}let authStep_3: bitstring = authenticateVoter in
        {218}let T_3: timestamp = T_init_1 in
        {219}let salt_17: salt_type = H((ee_8,credentialId)) in
        {220}let credentialId_id_14: bitstring = Argon2id(SVK_id_5,salt_17) in
        {221}let credentialId_id_15: bitstring = credentialId_id_14 in
        {222}let salt_18: salt_type = H((ee_8,hAuth)) in
        {223}let k_7: bitstring = (EA_id_5,SVK_id_5) in
        {224}let hAuth_id_14: bitstring = Argon2id(k_7,salt_18) in
        {225}let hAuth_id_15: bitstring = hAuth_id_14 in
        {226}new nonce_3: Nonce;
        {227}let salt_19: salt_type = H((ee_8,credentialId_id_15,dAuth,authStep_3,nonce_3)) in
        {228}let hhAuth_id_3: bitstring = Argon2id((hAuth_id_15,T_3),salt_19) in
        {229}let (credentialId_id_init_1: bitstring,hhAuth_id_init_1: bitstring,nonce_init_1: Nonce) = (credentialId_id_15,hhAuth_id_3,nonce_3) in
        {230}out(c, (credentialId_id_init_1,hhAuth_id_init_1,nonce_init_1));
        {231}in(c, (VCks_id_3: bitstring,pk_EL_2: public_ekey));
        {232}let KSkey_id_1: symmetric_ekey = KSkey(SVK_id_5) in
        {233}let Sk_id_4: private_ekey = catch-fail(Dec_s(KSkey_id_1,VCks_id_3,pk_EL_2)) in
        {234}let v_2: bool = not-caught-fail(Sk_id_4) in
        {235}let Sk_id_5: private_ekey = (if v_2 then Sk_id_4 else fail-any_type) in
        {236}let Pk_id_1: public_ekey = pube(Sk_id_5) in
        {237}let V_1: num = v(J1_1) in
        {238}new R_1: num;
        {239}let E1_1: bitstring = Enc(pk_EL_2,V_1,R_1) in
        {240}let E2_1: bitstring = pCC(Sk_id_5,v(J1_1)) in
        {241}let P_1: bitstring = ZKP(pk_EL_2,Pk_id_1,VC_id_1,E1_1,E2_1,R_1,Sk_id_5) in
        {242}let ballot_1: bitstring = (E1_1,E2_1,tild(Sk_id_5,E1_1),Pk_id_1,P_1) in
        {243}new T_vote_1: timestamp;
        {244}out(c, T_vote_1);
        {245}let ee_9: election_event = ee in
        {246}let authStep_4: bitstring = authenticateVoter in
        {247}let T_4: timestamp = T_vote_1 in
        {248}let salt_20: salt_type = H((ee_9,credentialId)) in
        {249}let credentialId_id_16: bitstring = Argon2id(SVK_id_5,salt_20) in
        {250}let credentialId_id_17: bitstring = credentialId_id_16 in
        {251}let salt_21: salt_type = H((ee_9,hAuth)) in
        {252}let k_8: bitstring = (EA_id_5,SVK_id_5) in
        {253}let hAuth_id_16: bitstring = Argon2id(k_8,salt_21) in
        {254}let hAuth_id_17: bitstring = hAuth_id_16 in
        {255}new nonce_4: Nonce;
        {256}let salt_22: salt_type = H((ee_9,credentialId_id_17,dAuth,authStep_4,nonce_4)) in
        {257}let hhAuth_id_4: bitstring = Argon2id((hAuth_id_17,T_4),salt_22) in
        {258}let (credentialId_id_vote_1: bitstring,hhAuth_id_vote_1: bitstring,nonce_vote_1: Nonce) = (credentialId_id_17,hhAuth_id_4,nonce_4) in
        {259}out(c, (ballot_1,hhAuth_id_vote_1,nonce_vote_1));
        {260}in(c, Rcv_CC: bitstring);
        {261}if (Rcv_CC = CCid1_1) then
        {262}new T_confirm_1: timestamp;
        {263}out(c, T_confirm_1);
        {264}let ee_10: election_event = ee in
        {265}let authStep_5: bitstring = authenticateVoter in
        {266}let T_5: timestamp = T_confirm_1 in
        {267}let salt_23: salt_type = H((ee_10,credentialId)) in
        {268}let credentialId_id_18: bitstring = Argon2id(SVK_id_5,salt_23) in
        {269}let credentialId_id_19: bitstring = credentialId_id_18 in
        {270}let salt_24: salt_type = H((ee_10,hAuth)) in
        {271}let k_9: bitstring = (EA_id_5,SVK_id_5) in
        {272}let hAuth_id_18: bitstring = Argon2id(k_9,salt_24) in
        {273}let hAuth_id_19: bitstring = hAuth_id_18 in
        {274}new nonce_5: Nonce;
        {275}let salt_25: salt_type = H((ee_10,credentialId_id_19,dAuth,authStep_5,nonce_5)) in
        {276}let hhAuth_id_5: bitstring = Argon2id((hAuth_id_19,T_5),salt_25) in
        {277}let (credentialId_id_confirm_1: bitstring,hhAuth_id_confirm_1: bitstring,nonce_confirm_1: Nonce) = (credentialId_id_19,hhAuth_id_5,nonce_5) in
        {278}out(c, (tild(Sk_id_5,H(BCK_id_1)),hhAuth_id_confirm_1,nonce_confirm_1));
        {279}in(c, =VCCid_1)
    ) | (
        {280}new idC: agent_id;
        {281}out(c, AliceData(idC));
        {282}let id_2: agent_id = idC in
        {283}let is_target_voter_2: bool = false in
        {284}let Sk_id_6: private_ekey = ske(id_2) in
        {285}let VCks_id_4: bitstring = Enc_s(KSkey(SVK(id_2)),Sk_id_6,pk_EL) in
        {286}out(c, VCks_id_4);
        (
            {287}if is_target_voter_2 then
            {288}let (hpCCA1_2: num,hpCCB1_2: num) = (H(pCC(Sk_id_6,v(jA1))),H(pCC(Sk_id_6,v(jB1)))) in
            {289}let (lpCCA1_2: num,lpCCB1_2: num) = (H((hpCCA1_2,VC(id_2))),H((hpCCB1_2,VC(id_2)))) in
            {290}let pCA1_2: num = tild(kCCR(VC(id_2)),H(pCC(Sk_id_6,v(jA1)))) in
            {291}let pCB1_2: num = tild(kCCR(VC(id_2)),H(pCC(Sk_id_6,v(jB1)))) in
            {292}let lCCA1_2: num = H(H((VC(id_2),pCA1_2))) in
            {293}let lCCB1_2: num = H(H((VC(id_2),pCB1_2))) in
            {294}let kCCR_all_4: private_ekey = merge_keys(kCCR'(1,VC(id_2)),kCCR'(2,VC(id_2))) in
            {295}let lVCC_12: num = tild(kCCR'(1,VC(id_2)),H(tild(Sk_id_6,H(BCK(id_2))))) in
            {296}let lVCC_13: num = tild(kCCR'(2,VC(id_2)),H(tild(Sk_id_6,H(BCK(id_2))))) in
            {297}let hlVCC_8: num = H((lVCC_12,VC(id_2))) in
            {298}let hlVCC_9: num = H((lVCC_13,VC(id_2))) in
            {299}let hhlVCC_4: num = H((hlVCC_8,hlVCC_9,VC(id_2))) in
            {300}insert L_lVCC(hhlVCC_4);
            {301}let pVCC_4: num = tild(kCCR_all_4,H(tild(Sk_id_6,H(BCK(id_2))))) in
            {302}let lVCC_14: num = H(H((VC(id_2),pVCC_4))) in
            (
                {303}out(c, choice[lpCCA1_2,lpCCB1_2])
            ) | (
                {304}out(c, choice[lpCCB1_2,lpCCA1_2])
            ) | (
                {305}out(c, choice[lCCA1_2,lCCB1_2])
            ) | (
                {306}out(c, choice[lCCB1_2,lCCA1_2])
            ) | (
                {307}out(c, (hlVCC_9,hhlVCC_4));
                {308}out(c, lVCC_14);
                {309}let ee_11: election_event = ee in
                {310}let SVK_id_6: password = SVK(id_2) in
                {311}let EA_id_6: extended_auth = EA(id_2) in
                {312}let salt_26: salt_type = H((ee_11,credentialId)) in
                {313}let credentialId_id_20: bitstring = Argon2id(SVK_id_6,salt_26) in
                {314}let credentialId_id_21: bitstring = credentialId_id_20 in
                {315}let salt_27: salt_type = H((ee_11,hAuth)) in
                {316}let k_10: bitstring = (EA_id_6,SVK_id_6) in
                {317}let hAuth_id_20: bitstring = Argon2id(k_10,salt_27) in
                {318}let hAuth_id_21: bitstring = hAuth_id_20 in
                {319}out(c, (credentialId_id_21,hAuth_id_21))
            )
        ) | (
            {320}!
            {321}in(c, J_2: num);
            {322}if (not(is_target_voter_2) || ((J_2 ≠ jA1) && (J_2 ≠ jB1))) then
            {323}let hpCC_2: num = H(pCC(Sk_id_6,v(J_2))) in
            {324}let lpCC_2: num = H((hpCC_2,VC(id_2))) in
            {325}let pC_2: num = tild(kCCR(VC(id_2)),H(pCC(Sk_id_6,v(J_2)))) in
            {326}let lCC_2: num = H(H((VC(id_2),pC_2))) in
            {327}let kCCR_all_5: private_ekey = merge_keys(kCCR'(1,VC(id_2)),kCCR'(2,VC(id_2))) in
            {328}let lVCC_15: num = tild(kCCR'(1,VC(id_2)),H(tild(Sk_id_6,H(BCK(id_2))))) in
            {329}let lVCC_16: num = tild(kCCR'(2,VC(id_2)),H(tild(Sk_id_6,H(BCK(id_2))))) in
            {330}let hlVCC_10: num = H((lVCC_15,VC(id_2))) in
            {331}let hlVCC_11: num = H((lVCC_16,VC(id_2))) in
            {332}let hhlVCC_5: num = H((hlVCC_10,hlVCC_11,VC(id_2))) in
            {333}insert L_lVCC(hhlVCC_5);
            {334}let pVCC_5: num = tild(kCCR_all_5,H(tild(Sk_id_6,H(BCK(id_2))))) in
            {335}let lVCC_17: num = H(H((VC(id_2),pVCC_5))) in
            {336}out(c, (lpCC_2,lCC_2,lVCC_17));
            {337}out(c, (hlVCC_11,hhlVCC_5));
            {338}let ee_12: election_event = ee in
            {339}let SVK_id_7: password = SVK(id_2) in
            {340}let EA_id_7: extended_auth = EA(id_2) in
            {341}let salt_28: salt_type = H((ee_12,credentialId)) in
            {342}let credentialId_id_22: bitstring = Argon2id(SVK_id_7,salt_28) in
            {343}let credentialId_id_23: bitstring = credentialId_id_22 in
            {344}let salt_29: salt_type = H((ee_12,hAuth)) in
            {345}let k_11: bitstring = (EA_id_7,SVK_id_7) in
            {346}let hAuth_id_22: bitstring = Argon2id(k_11,salt_29) in
            {347}let hAuth_id_23: bitstring = hAuth_id_22 in
            {348}out(c, (credentialId_id_23,hAuth_id_23))
        )
    ) | (
        {349}!
        {350}let i: nat = 1 in
        {351}in(c, (vcid: bitstring,B: bitstring));
        {352}let (E1_2: bitstring,E2_2: bitstring,EC: num,KVCId: public_ekey,P_2: bitstring) = B in
        {353}let v_3: bitstring = B in
        {354}let v_4: bool = success?(1-proj-5-tuple(v_3)) in
        {355}let P_3: bitstring = (if v_4 then 5-proj-5-tuple(v_3) else caught-fail) in
        {356}let Pk_id_2: public_ekey = (if v_4 then 4-proj-5-tuple(v_3) else caught-fail) in
        {357}let EC_1: num = (if v_4 then 3-proj-5-tuple(v_3) else caught-fail) in
        {358}let E2_3: bitstring = (if v_4 then 2-proj-5-tuple(v_3) else caught-fail) in
        {359}let E1_3: bitstring = (if v_4 then 1-proj-5-tuple(v_3) else caught-fail) in
        {360}let Ok: bool = (if v_4 then catch-fail(VerifP(pk_EL,Pk_id_2,vcid,E1_3,E2_3,P_3)) else caught-fail) in
        {361}let v_5: bool = not-caught-fail(Ok) in
        {362}if (if v_4 then (if v_5 then true else fail-any_type) else fail-any_type) then
        {363}in(c, (=CMTag,pCM: bitstring));
        {364}let lVCC_id_1: num = tild(kCCR'(i,vcid),H(pCM)) in
        {365}let hlVCC_id_1: num = H((lVCC_id_1,vcid)) in
        {366}out(c, hlVCC_id_1);
        {367}in(c, hlVCC_id_2: bitstring);
        {368}let hhlVCC_id: num = H((hlVCC_id_1,hlVCC_id_2,vcid)) in
        {371}get L_lVCC(=hhlVCC_id) in
        {369}insert ConfirmedVotes(i,vcid,B);
        {370}out(c, lVCC_id_1)
    ) | (
        {372}!
        {373}let i_1: nat = 1 in
        {374}in(c, (vcid_1: bitstring,B_1: bitstring,hlVCC_id: num,hlVCC_id_3: num));
        {375}let v_6: bitstring = B_1 in
        {376}let v_7: bool = success?(1-proj-5-tuple(v_6)) in
        {377}let P_4: bitstring = (if v_7 then 5-proj-5-tuple(v_6) else caught-fail) in
        {378}let Pk_id_3: public_ekey = (if v_7 then 4-proj-5-tuple(v_6) else caught-fail) in
        {379}let EC_2: num = (if v_7 then 3-proj-5-tuple(v_6) else caught-fail) in
        {380}let E2_4: bitstring = (if v_7 then 2-proj-5-tuple(v_6) else caught-fail) in
        {381}let E1_4: bitstring = (if v_7 then 1-proj-5-tuple(v_6) else caught-fail) in
        {382}let Ok_1: bool = (if v_7 then catch-fail(VerifP(pk_EL,Pk_id_3,vcid_1,E1_4,E2_4,P_4)) else caught-fail) in
        {383}let v_8: bool = not-caught-fail(Ok_1) in
        {384}if (if v_7 then (if v_8 then true else fail-any_type) else fail-any_type) then
        {386}get L_lVCC(=H((hlVCC_id,hlVCC_id_3,vcid_1))) in
        {385}insert ConfirmedVotes(i_1,vcid_1,B_1)
    ) | (
        {387}!
        {388}let sk_EL: private_ekey = sk_EL_1 in
        {389}let idA_1: agent_id = idA in
        {390}let idB_1: agent_id = idB in
        {391}in(c_priv, =ok);
        {478}get ConfirmedVotes(1,=VC(idA_1),B1: bitstring) in
        (
            {456}get ConfirmedVotes(1,=VC(idB_1),B2: bitstring) in
            (
                {392}let (E1_5: bitstring,E2_5: bitstring,EC1: num,Pk_id1: public_ekey,P1: bitstring) = B1 in
                {393}let (E1_6: bitstring,E2_6: bitstring,EC2: num,Pk_id2: public_ekey,P2: bitstring) = B2 in
                {394}let VC_id_2: bitstring = VC(idA_1) in
                {395}let v_9: bitstring = B1 in
                {396}let v_10: bool = success?(1-proj-5-tuple(v_9)) in
                {397}let P_5: bitstring = (if v_10 then 5-proj-5-tuple(v_9) else caught-fail) in
                {398}let Pk_id_4: public_ekey = (if v_10 then 4-proj-5-tuple(v_9) else caught-fail) in
                {399}let EC_3: num = (if v_10 then 3-proj-5-tuple(v_9) else caught-fail) in
                {400}let E2_7: bitstring = (if v_10 then 2-proj-5-tuple(v_9) else caught-fail) in
                {401}let E1_7: bitstring = (if v_10 then 1-proj-5-tuple(v_9) else caught-fail) in
                {402}let Ok_2: bool = (if v_10 then catch-fail(VerifP(pk_EL,Pk_id_4,VC_id_2,E1_7,E2_7,P_5)) else caught-fail) in
                {403}let v_11: bool = not-caught-fail(Ok_2) in
                {404}let Ok1: bool = (if v_10 then (if v_11 then true else fail-any_type) else fail-any_type) in
                {405}let VC_id_3: bitstring = VC(idB_1) in
                {406}let v_12: bitstring = B2 in
                {407}let v_13: bool = success?(1-proj-5-tuple(v_12)) in
                {408}let P_6: bitstring = (if v_13 then 5-proj-5-tuple(v_12) else caught-fail) in
                {409}let Pk_id_5: public_ekey = (if v_13 then 4-proj-5-tuple(v_12) else caught-fail) in
                {410}let EC_4: num = (if v_13 then 3-proj-5-tuple(v_12) else caught-fail) in
                {411}let E2_8: bitstring = (if v_13 then 2-proj-5-tuple(v_12) else caught-fail) in
                {412}let E1_8: bitstring = (if v_13 then 1-proj-5-tuple(v_12) else caught-fail) in
                {413}let Ok_3: bool = (if v_13 then catch-fail(VerifP(pk_EL,Pk_id_5,VC_id_3,E1_8,E2_8,P_6)) else caught-fail) in
                {414}let v_14: bool = not-caught-fail(Ok_3) in
                {415}let Ok2: bool = (if v_13 then (if v_14 then true else fail-any_type) else fail-any_type) in
                (
                    {416}out(mix, choice[E1_5,E1_6])
                ) | (
                    {417}out(mix, choice[E1_6,E1_5])
                ) | (
                    {418}in(mix, m1: bitstring);
                    {419}in(mix, m2: bitstring);
                    {442}get ConfirmedVotes(1,VC_id3: bitstring,B3: bitstring) suchthat ((VC_id3 ≠ VC(idA_1)) && (VC_id3 ≠ VC(idB_1))) in
                    (
                        {420}event CommitOnVCIDs(1,(VC(idA_1),VC(idB_1)));
                        {421}out(c_toCCMs, H((VC(idA_1),B1,VC(idB_1),B2,VC_id3,B3)));
                        {422}in(c_toCCM1, =H((VC(idA_1),B1,VC(idB_1),B2,VC_id3,B3)));
                        {423}let (E1_9: bitstring,E2_9: bitstring,EC3: num,Pk_id3: public_ekey,P3: bitstring) = B3 in
                        {424}let v_15: bitstring = B3 in
                        {425}let v_16: bool = success?(1-proj-5-tuple(v_15)) in
                        {426}let P_7: bitstring = (if v_16 then 5-proj-5-tuple(v_15) else caught-fail) in
                        {427}let Pk_id_6: public_ekey = (if v_16 then 4-proj-5-tuple(v_15) else caught-fail) in
                        {428}let EC_5: num = (if v_16 then 3-proj-5-tuple(v_15) else caught-fail) in
                        {429}let E2_10: bitstring = (if v_16 then 2-proj-5-tuple(v_15) else caught-fail) in
                        {430}let E1_10: bitstring = (if v_16 then 1-proj-5-tuple(v_15) else caught-fail) in
                        {431}let Ok_4: bool = (if v_16 then catch-fail(VerifP(pk_EL,Pk_id_6,VC_id3,E1_10,E2_10,P_7)) else caught-fail) in
                        {432}let v_17: bool = not-caught-fail(Ok_4) in
                        {433}let Ok3: bool = (if v_16 then (if v_17 then true else fail-any_type) else fail-any_type) in
                        {434}let m3: bitstring = E1_9 in
                        {435}out(c, (PDec(sk_EL,m1),PDec(sk_EL,m2),PDec(sk_EL,m3)));
                        {436}out(c, PMix(sk_EL,(E1_5,E1_6,E1_9),(PDec(sk_EL,m1),PDec(sk_EL,m2),PDec(sk_EL,m3))))
                    )
                    else
                        {437}event CommitOnVCIDs(1,(VC(idA_1),VC(idB_1)));
                        {438}out(c_toCCMs, H((VC(idA_1),B1,VC(idB_1),B2)));
                        {439}in(c_toCCM1, =H((VC(idA_1),B1,VC(idB_1),B2)));
                        {440}out(c, (PDec(sk_EL,m1),PDec(sk_EL,m2)));
                        {441}out(c, PMix(sk_EL,(E1_5,E1_6),(PDec(sk_EL,m1),PDec(sk_EL,m2))))
                )
            )
            else
                {455}get ConfirmedVotes(1,VC_id3_1: bitstring,B3_1: bitstring) suchthat ((VC_id3_1 ≠ VC(idA_1)) && (VC_id3_1 ≠ VC(idB_1))) in
                (
                    {443}event CommitOnVCIDs(1,(VC(idA_1),VC_id3_1));
                    {444}out(c_toCCMs, H((VC(idA_1),B1,VC_id3_1,B3_1)));
                    {445}in(c_toCCM1, =H((VC(idA_1),B1,VC_id3_1,B3_1)));
                    {446}let (E1_11: bitstring,E2_11: bitstring,EC1_1: num,Pk_id1_1: public_ekey,P1_1: bitstring) = B1 in
                    {447}let (E1_12: bitstring,E2_12: bitstring,EC3_1: num,Pk_id3_1: public_ekey,P3_1: bitstring) = B3_1 in
                    {448}out(c, (PDec(sk_EL,E1_11),PDec(sk_EL,E1_12)));
                    {449}out(c, PMix(sk_EL,(E1_11,E1_12),(PDec(sk_EL,E1_11),PDec(sk_EL,E1_12))))
                )
                else
                    {450}event CommitOnVCIDs(1,VC(idA_1));
                    {451}out(c_toCCMs, H((VC(idA_1),B1)));
                    {452}in(c_toCCM1, =H((VC(idA_1),B1)));
                    {453}let (E1_13: bitstring,E2_13: bitstring,EC1_2: num,Pk_id1_2: public_ekey,P1_2: bitstring) = B1 in
                    {454}out(c, PDec(sk_EL,E1_13))
        )
        else
            {477}get ConfirmedVotes(1,=VC(idB_1),B2_1: bitstring) in
            (
                {470}get ConfirmedVotes(1,VC_id3_2: bitstring,B3_2: bitstring) suchthat ((VC_id3_2 ≠ VC(idA_1)) && (VC_id3_2 ≠ VC(idB_1))) in
                (
                    {457}let (E1_14: bitstring,E2_14: bitstring,EC2_1: num,Pk_id2_1: public_ekey,P2_1: bitstring) = B2_1 in
                    {458}let (E1_15: bitstring,E2_15: bitstring,EC3_2: num,Pk_id3_2: public_ekey,P3_2: bitstring) = B3_2 in
                    {459}event CommitOnVCIDs(1,(VC(idB_1),VC_id3_2));
                    {460}out(c_toCCMs, H((VC(idB_1),B2_1,VC_id3_2,B3_2)));
                    {461}in(c_toCCM1, =H((VC(idB_1),B2_1,VC_id3_2,B3_2)));
                    {462}out(c, (PDec(sk_EL,E1_14),PDec(sk_EL,E1_15)));
                    {463}out(c, PMix(sk_EL,(E1_14,E1_15),(PDec(sk_EL,E1_14),PDec(sk_EL,E1_15))))
                )
                else
                    {469}get ConfirmedVotes(1,VC_id3_3: bitstring,B3_3: bitstring) suchthat ((VC_id3_3 ≠ VC(idA_1)) && (VC_id3_3 ≠ VC(idB_1))) in
                    {464}event CommitOnVCIDs(1,VC_id3_3);
                    {465}out(c_toCCMs, H((VC_id3_3,B3_3)));
                    {466}in(c_toCCM1, =H((VC_id3_3,B3_3)));
                    {467}let (E1_16: bitstring,E2_16: bitstring,EC3_3: num,Pk_id3_3: public_ekey,P3_3: bitstring) = B3_3 in
                    {468}out(c, PDec(sk_EL,E1_16))
            )
            else
                {476}get ConfirmedVotes(1,VC_id3_4: bitstring,B3_4: bitstring) suchthat ((VC_id3_4 ≠ VC(idA_1)) && (VC_id3_4 ≠ VC(idB_1))) in
                {471}event CommitOnVCIDs(1,VC_id3_4);
                {472}out(c_toCCMs, H((VC_id3_4,B3_4)));
                {473}in(c_toCCM1, =H((VC_id3_4,B3_4)));
                {474}let (E1_17: bitstring,E2_17: bitstring,EC3_4: num,Pk_id3_4: public_ekey,P3_4: bitstring) = B3_4 in
                {475}out(c, PDec(sk_EL,E1_17))
    ) | (
        {479}!
        {480}in(c, vcid_2: bitstring);
        {481}out(c, kCCR'(2,vcid_2))
    ) | (
        {482}!
        (
            {483}in(c, (vcid_3: bitstring,B_2: bitstring,(hlVCC_1_1: bitstring,hlVCC_1_2: bitstring)));
            {484}in(c, (vcid_4: bitstring,B_3: bitstring,(hlVCC_2_1: bitstring,hlVCC_2_2: bitstring)));
            {485}in(c, (vcid_5: bitstring,B_4: bitstring,(hlVCC_3_1: bitstring,hlVCC_3_2: bitstring)));
            {486}let v_18: bitstring = B_2 in
            {487}let v_19: bool = success?(1-proj-5-tuple(v_18)) in
            {488}let P_8: bitstring = (if v_19 then 5-proj-5-tuple(v_18) else caught-fail) in
            {489}let Pk_id_7: public_ekey = (if v_19 then 4-proj-5-tuple(v_18) else caught-fail) in
            {490}let EC_6: num = (if v_19 then 3-proj-5-tuple(v_18) else caught-fail) in
            {491}let E2_18: bitstring = (if v_19 then 2-proj-5-tuple(v_18) else caught-fail) in
            {492}let E1_18: bitstring = (if v_19 then 1-proj-5-tuple(v_18) else caught-fail) in
            {493}let Ok_5: bool = (if v_19 then catch-fail(VerifP(pk_EL,Pk_id_7,vcid_3,E1_18,E2_18,P_8)) else caught-fail) in
            {494}let v_20: bool = not-caught-fail(Ok_5) in
            {495}let Ok1_1: bool = (if v_19 then (if v_20 then true else fail-any_type) else fail-any_type) in
            {496}let v_21: bitstring = B_3 in
            {497}let v_22: bool = success?(1-proj-5-tuple(v_21)) in
            {498}let P_9: bitstring = (if v_22 then 5-proj-5-tuple(v_21) else caught-fail) in
            {499}let Pk_id_8: public_ekey = (if v_22 then 4-proj-5-tuple(v_21) else caught-fail) in
            {500}let EC_7: num = (if v_22 then 3-proj-5-tuple(v_21) else caught-fail) in
            {501}let E2_19: bitstring = (if v_22 then 2-proj-5-tuple(v_21) else caught-fail) in
            {502}let E1_19: bitstring = (if v_22 then 1-proj-5-tuple(v_21) else caught-fail) in
            {503}let Ok_6: bool = (if v_22 then catch-fail(VerifP(pk_EL,Pk_id_8,vcid_4,E1_19,E2_19,P_9)) else caught-fail) in
            {504}let v_23: bool = not-caught-fail(Ok_6) in
            {505}let Ok2_1: bool = (if v_22 then (if v_23 then true else fail-any_type) else fail-any_type) in
            {506}let v_24: bitstring = B_4 in
            {507}let v_25: bool = success?(1-proj-5-tuple(v_24)) in
            {508}let P_10: bitstring = (if v_25 then 5-proj-5-tuple(v_24) else caught-fail) in
            {509}let Pk_id_9: public_ekey = (if v_25 then 4-proj-5-tuple(v_24) else caught-fail) in
            {510}let EC_8: num = (if v_25 then 3-proj-5-tuple(v_24) else caught-fail) in
            {511}let E2_20: bitstring = (if v_25 then 2-proj-5-tuple(v_24) else caught-fail) in
            {512}let E1_20: bitstring = (if v_25 then 1-proj-5-tuple(v_24) else caught-fail) in
            {513}let Ok_7: bool = (if v_25 then catch-fail(VerifP(pk_EL,Pk_id_9,vcid_5,E1_20,E2_20,P_10)) else caught-fail) in
            {514}let v_26: bool = not-caught-fail(Ok_7) in
            {515}let Ok3_1: bool = (if v_25 then (if v_26 then true else fail-any_type) else fail-any_type) in
            {523}get L_lVCC(=H((hlVCC_1_1,hlVCC_1_2,vcid_3))) in
            {522}get L_lVCC(=H((hlVCC_2_1,hlVCC_2_2,vcid_4))) in
            {521}get L_lVCC(=H((hlVCC_3_1,hlVCC_3_2,vcid_5))) in
            {516}event CommitOnVCIDs(2,(vcid_3,vcid_4));
            (
                {517}!
                {518}out(c_toCCM1, H((vcid_3,B_2,vcid_4,B_3,vcid_5,B_4)))
            ) | (
                {519}in(c_toCCMs, =H((vcid_3,B_2,vcid_4,B_3,vcid_5,B_4)));
                {520}out(c_priv, ok)
            )
        ) | (
            {524}in(c, (vcid_6: bitstring,B_5: bitstring,(hlVCC_1: bitstring,hlVCC_1_3: bitstring)));
            {525}in(c, (vcid_7: bitstring,B_6: bitstring,(hlVCC_2: bitstring,hlVCC_2_3: bitstring)));
            {526}let v_27: bitstring = B_5 in
            {527}let v_28: bool = success?(1-proj-5-tuple(v_27)) in
            {528}let P_11: bitstring = (if v_28 then 5-proj-5-tuple(v_27) else caught-fail) in
            {529}let Pk_id_10: public_ekey = (if v_28 then 4-proj-5-tuple(v_27) else caught-fail) in
            {530}let EC_9: num = (if v_28 then 3-proj-5-tuple(v_27) else caught-fail) in
            {531}let E2_21: bitstring = (if v_28 then 2-proj-5-tuple(v_27) else caught-fail) in
            {532}let E1_21: bitstring = (if v_28 then 1-proj-5-tuple(v_27) else caught-fail) in
            {533}let Ok_8: bool = (if v_28 then catch-fail(VerifP(pk_EL,Pk_id_10,vcid_6,E1_21,E2_21,P_11)) else caught-fail) in
            {534}let v_29: bool = not-caught-fail(Ok_8) in
            {535}let Ok1_2: bool = (if v_28 then (if v_29 then true else fail-any_type) else fail-any_type) in
            {536}let v_30: bitstring = B_6 in
            {537}let v_31: bool = success?(1-proj-5-tuple(v_30)) in
            {538}let P_12: bitstring = (if v_31 then 5-proj-5-tuple(v_30) else caught-fail) in
            {539}let Pk_id_11: public_ekey = (if v_31 then 4-proj-5-tuple(v_30) else caught-fail) in
            {540}let EC_10: num = (if v_31 then 3-proj-5-tuple(v_30) else caught-fail) in
            {541}let E2_22: bitstring = (if v_31 then 2-proj-5-tuple(v_30) else caught-fail) in
            {542}let E1_22: bitstring = (if v_31 then 1-proj-5-tuple(v_30) else caught-fail) in
            {543}let Ok_9: bool = (if v_31 then catch-fail(VerifP(pk_EL,Pk_id_11,vcid_7,E1_22,E2_22,P_12)) else caught-fail) in
            {544}let v_32: bool = not-caught-fail(Ok_9) in
            {545}let Ok2_2: bool = (if v_31 then (if v_32 then true else fail-any_type) else fail-any_type) in
            {552}get L_lVCC(=H((hlVCC_1,hlVCC_1_3,vcid_6))) in
            {551}get L_lVCC(=H((hlVCC_2,hlVCC_2_3,vcid_7))) in
            {546}event CommitOnVCIDs(2,(vcid_6,vcid_7));
            (
                {547}!
                {548}out(c_toCCM1, H((vcid_6,B_5,vcid_7,B_6)))
            ) | (
                {549}in(c_toCCMs, =H((vcid_6,B_5,vcid_7,B_6)));
                {550}out(c_priv, ok)
            )
        ) | (
            {553}in(c, (vcid_8: bitstring,B_7: bitstring,(hlVCC_1_4: bitstring,hlVCC_1_5: bitstring)));
            {554}let v_33: bitstring = B_7 in
            {555}let v_34: bool = success?(1-proj-5-tuple(v_33)) in
            {556}let P_13: bitstring = (if v_34 then 5-proj-5-tuple(v_33) else caught-fail) in
            {557}let Pk_id_12: public_ekey = (if v_34 then 4-proj-5-tuple(v_33) else caught-fail) in
            {558}let EC_11: num = (if v_34 then 3-proj-5-tuple(v_33) else caught-fail) in
            {559}let E2_23: bitstring = (if v_34 then 2-proj-5-tuple(v_33) else caught-fail) in
            {560}let E1_23: bitstring = (if v_34 then 1-proj-5-tuple(v_33) else caught-fail) in
            {561}let Ok_10: bool = (if v_34 then catch-fail(VerifP(pk_EL,Pk_id_12,vcid_8,E1_23,E2_23,P_13)) else caught-fail) in
            {562}let v_35: bool = not-caught-fail(Ok_10) in
            {563}let Ok1_3: bool = (if v_34 then (if v_35 then true else fail-any_type) else fail-any_type) in
            {569}get L_lVCC(=H((hlVCC_1_4,hlVCC_1_5,vcid_8))) in
            {564}event CommitOnVCIDs(2,vcid_8);
            (
                {565}!
                {566}out(c_toCCM1, H((vcid_8,B_7)))
            ) | (
                {567}in(c_toCCMs, =H((vcid_8,B_7)));
                {568}out(c_priv, ok)
            )
        )
    )
)

--  Biprocess 1 (that is, biprocess 0, with let moved downwards):
{1}let pk_EL: public_ekey = mergepk(pube(sk_EL_1)) in
(
    {2}let id: agent_id = idA in
    {4}let Sk_id: private_ekey = ske(id) in
    {5}let VCks_id: bitstring = Enc_s(KSkey(SVK(id)),Sk_id,pk_EL) in
    {6}out(c, VCks_id);
    {3}let is_target_voter: bool = true in
    (
        {7}if is_target_voter then
        {8}let (hpCCA1: num,hpCCB1: num) = (H(pCC(Sk_id,v(jA1))),H(pCC(Sk_id,v(jB1)))) in
        {9}let (lpCCA1: num,lpCCB1: num) = (H((hpCCA1,VC(id))),H((hpCCB1,VC(id)))) in
        {16}let lVCC_2: num = tild(kCCR'(2,VC(id)),H(tild(Sk_id,H(BCK(id))))) in
        {18}let hlVCC_2: num = H((lVCC_2,VC(id))) in
        {15}let lVCC_1: num = tild(kCCR'(1,VC(id)),H(tild(Sk_id,H(BCK(id))))) in
        {17}let hlVCC_1: num = H((lVCC_1,VC(id))) in
        {19}let hhlVCC: num = H((hlVCC_1,hlVCC_2,VC(id))) in
        {20}insert L_lVCC(hhlVCC);
        (
            {23}out(c, choice[lpCCA1,lpCCB1])
        ) | (
            {24}out(c, choice[lpCCB1,lpCCA1])
        ) | (
            {11}let pCB1: num = tild(kCCR(VC(id)),H(pCC(Sk_id,v(jB1)))) in
            {13}let lCCB1: num = H(H((VC(id),pCB1))) in
            {10}let pCA1: num = tild(kCCR(VC(id)),H(pCC(Sk_id,v(jA1)))) in
            {12}let lCCA1: num = H(H((VC(id),pCA1))) in
            (
                {25}out(c, choice[lCCA1,lCCB1])
            ) | (
                {26}out(c, choice[lCCB1,lCCA1])
            ) | (
                {27}out(c, (hlVCC_2,hhlVCC));
                {14}let kCCR_all: private_ekey = merge_keys(kCCR'(1,VC(id)),kCCR'(2,VC(id))) in
                {21}let pVCC: num = tild(kCCR_all,H(tild(Sk_id,H(BCK(id))))) in
                {22}let lVCC: num = H(H((VC(id),pVCC))) in
                {28}out(c, lVCC);
                {31}let EA_id: extended_auth = EA(id) in
                {30}let SVK_id: password = SVK(id) in
                {36}let k: bitstring = (EA_id,SVK_id) in
                {29}let ee_1: election_event = ee in
                {35}let salt_1: salt_type = H((ee_1,hAuth)) in
                {37}let hAuth_id: bitstring = Argon2id(k,salt_1) in
                {38}let hAuth_id_1: bitstring = hAuth_id in
                {32}let salt: salt_type = H((ee_1,credentialId)) in
                {33}let credentialId_id: bitstring = Argon2id(SVK_id,salt) in
                {34}let credentialId_id_1: bitstring = credentialId_id in
                {39}out(c, (credentialId_id_1,hAuth_id_1))
            )
        )
    ) | (
        {40}!
        {41}in(c, J: num);
        {42}if (not(is_target_voter) || ((J ≠ jA1) && (J ≠ jB1))) then
        {49}let lVCC_4: num = tild(kCCR'(2,VC(id)),H(tild(Sk_id,H(BCK(id))))) in
        {51}let hlVCC_3: num = H((lVCC_4,VC(id))) in
        {48}let lVCC_3: num = tild(kCCR'(1,VC(id)),H(tild(Sk_id,H(BCK(id))))) in
        {50}let hlVCC: num = H((lVCC_3,VC(id))) in
        {52}let hhlVCC_1: num = H((hlVCC,hlVCC_3,VC(id))) in
        {53}insert L_lVCC(hhlVCC_1);
        {47}let kCCR_all_1: private_ekey = merge_keys(kCCR'(1,VC(id)),kCCR'(2,VC(id))) in
        {54}let pVCC_1: num = tild(kCCR_all_1,H(tild(Sk_id,H(BCK(id))))) in
        {55}let lVCC_5: num = H(H((VC(id),pVCC_1))) in
        {45}let pC: num = tild(kCCR(VC(id)),H(pCC(Sk_id,v(J)))) in
        {46}let lCC: num = H(H((VC(id),pC))) in
        {43}let hpCC: num = H(pCC(Sk_id,v(J))) in
        {44}let lpCC: num = H((hpCC,VC(id))) in
        {56}out(c, (lpCC,lCC,lVCC_5));
        {57}out(c, (hlVCC_3,hhlVCC_1));
        {60}let EA_id_1: extended_auth = EA(id) in
        {59}let SVK_id_1: password = SVK(id) in
        {65}let k_1: bitstring = (EA_id_1,SVK_id_1) in
        {58}let ee_2: election_event = ee in
        {64}let salt_3: salt_type = H((ee_2,hAuth)) in
        {66}let hAuth_id_2: bitstring = Argon2id(k_1,salt_3) in
        {67}let hAuth_id_3: bitstring = hAuth_id_2 in
        {61}let salt_2: salt_type = H((ee_2,credentialId)) in
        {62}let credentialId_id_2: bitstring = Argon2id(SVK_id_1,salt_2) in
        {63}let credentialId_id_3: bitstring = credentialId_id_2 in
        {68}out(c, (credentialId_id_3,hAuth_id_3))
    )
) | (
    {69}let id_1: agent_id = idB in
    {71}let Sk_id_1: private_ekey = ske(id_1) in
    {72}let VCks_id_1: bitstring = Enc_s(KSkey(SVK(id_1)),Sk_id_1,pk_EL) in
    {73}out(c, VCks_id_1);
    {70}let is_target_voter_1: bool = true in
    (
        {74}if is_target_voter_1 then
        {75}let (hpCCA1_1: num,hpCCB1_1: num) = (H(pCC(Sk_id_1,v(jA1))),H(pCC(Sk_id_1,v(jB1)))) in
        {76}let (lpCCA1_1: num,lpCCB1_1: num) = (H((hpCCA1_1,VC(id_1))),H((hpCCB1_1,VC(id_1)))) in
        {83}let lVCC_7: num = tild(kCCR'(2,VC(id_1)),H(tild(Sk_id_1,H(BCK(id_1))))) in
        {85}let hlVCC_5: num = H((lVCC_7,VC(id_1))) in
        {82}let lVCC_6: num = tild(kCCR'(1,VC(id_1)),H(tild(Sk_id_1,H(BCK(id_1))))) in
        {84}let hlVCC_4: num = H((lVCC_6,VC(id_1))) in
        {86}let hhlVCC_2: num = H((hlVCC_4,hlVCC_5,VC(id_1))) in
        {87}insert L_lVCC(hhlVCC_2);
        (
            {90}out(c, choice[lpCCA1_1,lpCCB1_1])
        ) | (
            {91}out(c, choice[lpCCB1_1,lpCCA1_1])
        ) | (
            {78}let pCB1_1: num = tild(kCCR(VC(id_1)),H(pCC(Sk_id_1,v(jB1)))) in
            {80}let lCCB1_1: num = H(H((VC(id_1),pCB1_1))) in
            {77}let pCA1_1: num = tild(kCCR(VC(id_1)),H(pCC(Sk_id_1,v(jA1)))) in
            {79}let lCCA1_1: num = H(H((VC(id_1),pCA1_1))) in
            (
                {92}out(c, choice[lCCA1_1,lCCB1_1])
            ) | (
                {93}out(c, choice[lCCB1_1,lCCA1_1])
            ) | (
                {94}out(c, (hlVCC_5,hhlVCC_2));
                {81}let kCCR_all_2: private_ekey = merge_keys(kCCR'(1,VC(id_1)),kCCR'(2,VC(id_1))) in
                {88}let pVCC_2: num = tild(kCCR_all_2,H(tild(Sk_id_1,H(BCK(id_1))))) in
                {89}let lVCC_8: num = H(H((VC(id_1),pVCC_2))) in
                {95}out(c, lVCC_8);
                {98}let EA_id_2: extended_auth = EA(id_1) in
                {97}let SVK_id_2: password = SVK(id_1) in
                {103}let k_2: bitstring = (EA_id_2,SVK_id_2) in
                {96}let ee_3: election_event = ee in
                {102}let salt_5: salt_type = H((ee_3,hAuth)) in
                {104}let hAuth_id_4: bitstring = Argon2id(k_2,salt_5) in
                {105}let hAuth_id_5: bitstring = hAuth_id_4 in
                {99}let salt_4: salt_type = H((ee_3,credentialId)) in
                {100}let credentialId_id_4: bitstring = Argon2id(SVK_id_2,salt_4) in
                {101}let credentialId_id_5: bitstring = credentialId_id_4 in
                {106}out(c, (credentialId_id_5,hAuth_id_5))
            )
        )
    ) | (
        {107}!
        {108}in(c, J_1: num);
        {109}if (not(is_target_voter_1) || ((J_1 ≠ jA1) && (J_1 ≠ jB1))) then
        {116}let lVCC_10: num = tild(kCCR'(2,VC(id_1)),H(tild(Sk_id_1,H(BCK(id_1))))) in
        {118}let hlVCC_7: num = H((lVCC_10,VC(id_1))) in
        {115}let lVCC_9: num = tild(kCCR'(1,VC(id_1)),H(tild(Sk_id_1,H(BCK(id_1))))) in
        {117}let hlVCC_6: num = H((lVCC_9,VC(id_1))) in
        {119}let hhlVCC_3: num = H((hlVCC_6,hlVCC_7,VC(id_1))) in
        {120}insert L_lVCC(hhlVCC_3);
        {114}let kCCR_all_3: private_ekey = merge_keys(kCCR'(1,VC(id_1)),kCCR'(2,VC(id_1))) in
        {121}let pVCC_3: num = tild(kCCR_all_3,H(tild(Sk_id_1,H(BCK(id_1))))) in
        {122}let lVCC_11: num = H(H((VC(id_1),pVCC_3))) in
        {112}let pC_1: num = tild(kCCR(VC(id_1)),H(pCC(Sk_id_1,v(J_1)))) in
        {113}let lCC_1: num = H(H((VC(id_1),pC_1))) in
        {110}let hpCC_1: num = H(pCC(Sk_id_1,v(J_1))) in
        {111}let lpCC_1: num = H((hpCC_1,VC(id_1))) in
        {123}out(c, (lpCC_1,lCC_1,lVCC_11));
        {124}out(c, (hlVCC_7,hhlVCC_3));
        {127}let EA_id_3: extended_auth = EA(id_1) in
        {126}let SVK_id_3: password = SVK(id_1) in
        {132}let k_3: bitstring = (EA_id_3,SVK_id_3) in
        {125}let ee_4: election_event = ee in
        {131}let salt_7: salt_type = H((ee_4,hAuth)) in
        {133}let hAuth_id_6: bitstring = Argon2id(k_3,salt_7) in
        {134}let hAuth_id_7: bitstring = hAuth_id_6 in
        {128}let salt_6: salt_type = H((ee_4,credentialId)) in
        {129}let credentialId_id_6: bitstring = Argon2id(SVK_id_3,salt_6) in
        {130}let credentialId_id_7: bitstring = credentialId_id_6 in
        {135}out(c, (credentialId_id_7,hAuth_id_7))
    )
) | (
    {136}out(c, pube(sk_EL_1));
    {137}out(c, pk_EL);
    {138}let Id: agent_id = idA in
    {139}out(c, pube(ske(Id)));
    {140}let Id_1: agent_id = idB in
    {141}out(c, pube(ske(Id_1)));
    (
        {143}let J1: num = choice[jA1,jB1] in
        {142}let InitData: bitstring = AliceData(idA) in
        {144}let (SVK_id_4: password,EA_id_4: extended_auth,VC_id: bitstring,BCK_id: num,VCCid: bitstring,CCid1: bitstring) = GetAliceData(InitData,J1) in
        {145}new T_init: timestamp;
        {146}out(c, T_init);
        {157}new nonce: Nonce;
        {147}let ee_5: election_event = ee in
        {150}let salt_8: salt_type = H((ee_5,credentialId)) in
        {151}let credentialId_id_8: bitstring = Argon2id(SVK_id_4,salt_8) in
        {152}let credentialId_id_9: bitstring = credentialId_id_8 in
        {148}let authStep: bitstring = authenticateVoter in
        {158}let salt_10: salt_type = H((ee_5,credentialId_id_9,dAuth,authStep,nonce)) in
        {154}let k_4: bitstring = (EA_id_4,SVK_id_4) in
        {153}let salt_9: salt_type = H((ee_5,hAuth)) in
        {155}let hAuth_id_8: bitstring = Argon2id(k_4,salt_9) in
        {156}let hAuth_id_9: bitstring = hAuth_id_8 in
        {149}let T: timestamp = T_init in
        {159}let hhAuth_id: bitstring = Argon2id((hAuth_id_9,T),salt_10) in
        {160}let (credentialId_id_init: bitstring,hhAuth_id_init: bitstring,nonce_init: Nonce) = (credentialId_id_9,hhAuth_id,nonce) in
        {161}out(c, (credentialId_id_init,hhAuth_id_init,nonce_init));
        {162}in(c, (VCks_id_2: bitstring,pk_EL_1: public_ekey));
        {163}let KSkey_id: symmetric_ekey = KSkey(SVK_id_4) in
        {164}let Sk_id_2: private_ekey = catch-fail(Dec_s(KSkey_id,VCks_id_2,pk_EL_1)) in
        {165}let v_1: bool = not-caught-fail(Sk_id_2) in
        {166}let Sk_id_3: private_ekey = (if v_1 then Sk_id_2 else fail-any_type) in
        {169}new R: num;
        {174}new T_vote: timestamp;
        {175}out(c, T_vote);
        {186}new nonce_1: Nonce;
        {176}let ee_6: election_event = ee in
        {179}let salt_11: salt_type = H((ee_6,credentialId)) in
        {180}let credentialId_id_10: bitstring = Argon2id(SVK_id_4,salt_11) in
        {181}let credentialId_id_11: bitstring = credentialId_id_10 in
        {177}let authStep_1: bitstring = authenticateVoter in
        {187}let salt_13: salt_type = H((ee_6,credentialId_id_11,dAuth,authStep_1,nonce_1)) in
        {183}let k_5: bitstring = (EA_id_4,SVK_id_4) in
        {182}let salt_12: salt_type = H((ee_6,hAuth)) in
        {184}let hAuth_id_10: bitstring = Argon2id(k_5,salt_12) in
        {185}let hAuth_id_11: bitstring = hAuth_id_10 in
        {178}let T_1: timestamp = T_vote in
        {188}let hhAuth_id_1: bitstring = Argon2id((hAuth_id_11,T_1),salt_13) in
        {189}let (credentialId_id_vote: bitstring,hhAuth_id_vote: bitstring,nonce_vote: Nonce) = (credentialId_id_11,hhAuth_id_1,nonce_1) in
        {171}let E2: bitstring = pCC(Sk_id_3,v(J1)) in
        {168}let V: num = v(J1) in
        {170}let E1: bitstring = Enc(pk_EL_1,V,R) in
        {167}let Pk_id: public_ekey = pube(Sk_id_3) in
        {172}let P: bitstring = ZKP(pk_EL_1,Pk_id,VC_id,E1,E2,R,Sk_id_3) in
        {173}let ballot: bitstring = (E1,E2,tild(Sk_id_3,E1),Pk_id,P) in
        {190}out(c, (ballot,hhAuth_id_vote,nonce_vote));
        {191}in(c, Rcv_CC_1: bitstring);
        {192}if (Rcv_CC_1 = CCid1) then
        {193}new T_confirm: timestamp;
        {194}out(c, T_confirm);
        {205}new nonce_2: Nonce;
        {195}let ee_7: election_event = ee in
        {198}let salt_14: salt_type = H((ee_7,credentialId)) in
        {199}let credentialId_id_12: bitstring = Argon2id(SVK_id_4,salt_14) in
        {200}let credentialId_id_13: bitstring = credentialId_id_12 in
        {196}let authStep_2: bitstring = authenticateVoter in
        {206}let salt_16: salt_type = H((ee_7,credentialId_id_13,dAuth,authStep_2,nonce_2)) in
        {202}let k_6: bitstring = (EA_id_4,SVK_id_4) in
        {201}let salt_15: salt_type = H((ee_7,hAuth)) in
        {203}let hAuth_id_12: bitstring = Argon2id(k_6,salt_15) in
        {204}let hAuth_id_13: bitstring = hAuth_id_12 in
        {197}let T_2: timestamp = T_confirm in
        {207}let hhAuth_id_2: bitstring = Argon2id((hAuth_id_13,T_2),salt_16) in
        {208}let (credentialId_id_confirm: bitstring,hhAuth_id_confirm: bitstring,nonce_confirm: Nonce) = (credentialId_id_13,hhAuth_id_2,nonce_2) in
        {209}out(c, (tild(Sk_id_3,H(BCK_id)),hhAuth_id_confirm,nonce_confirm));
        {210}in(c, =VCCid)
    ) | (
        {212}let J1_1: num = choice[jB1,jA1] in
        {211}let InitData_1: bitstring = AliceData(idB) in
        {213}let (SVK_id_5: password,EA_id_5: extended_auth,VC_id_1: bitstring,BCK_id_1: num,VCCid_1: bitstring,CCid1_1: bitstring) = GetAliceData(InitData_1,J1_1) in
        {214}new T_init_1: timestamp;
        {215}out(c, T_init_1);
        {226}new nonce_3: Nonce;
        {216}let ee_8: election_event = ee in
        {219}let salt_17: salt_type = H((ee_8,credentialId)) in
        {220}let credentialId_id_14: bitstring = Argon2id(SVK_id_5,salt_17) in
        {221}let credentialId_id_15: bitstring = credentialId_id_14 in
        {217}let authStep_3: bitstring = authenticateVoter in
        {227}let salt_19: salt_type = H((ee_8,credentialId_id_15,dAuth,authStep_3,nonce_3)) in
        {223}let k_7: bitstring = (EA_id_5,SVK_id_5) in
        {222}let salt_18: salt_type = H((ee_8,hAuth)) in
        {224}let hAuth_id_14: bitstring = Argon2id(k_7,salt_18) in
        {225}let hAuth_id_15: bitstring = hAuth_id_14 in
        {218}let T_3: timestamp = T_init_1 in
        {228}let hhAuth_id_3: bitstring = Argon2id((hAuth_id_15,T_3),salt_19) in
        {229}let (credentialId_id_init_1: bitstring,hhAuth_id_init_1: bitstring,nonce_init_1: Nonce) = (credentialId_id_15,hhAuth_id_3,nonce_3) in
        {230}out(c, (credentialId_id_init_1,hhAuth_id_init_1,nonce_init_1));
        {231}in(c, (VCks_id_3: bitstring,pk_EL_2: public_ekey));
        {232}let KSkey_id_1: symmetric_ekey = KSkey(SVK_id_5) in
        {233}let Sk_id_4: private_ekey = catch-fail(Dec_s(KSkey_id_1,VCks_id_3,pk_EL_2)) in
        {234}let v_2: bool = not-caught-fail(Sk_id_4) in
        {235}let Sk_id_5: private_ekey = (if v_2 then Sk_id_4 else fail-any_type) in
        {238}new R_1: num;
        {243}new T_vote_1: timestamp;
        {244}out(c, T_vote_1);
        {255}new nonce_4: Nonce;
        {245}let ee_9: election_event = ee in
        {248}let salt_20: salt_type = H((ee_9,credentialId)) in
        {249}let credentialId_id_16: bitstring = Argon2id(SVK_id_5,salt_20) in
        {250}let credentialId_id_17: bitstring = credentialId_id_16 in
        {246}let authStep_4: bitstring = authenticateVoter in
        {256}let salt_22: salt_type = H((ee_9,credentialId_id_17,dAuth,authStep_4,nonce_4)) in
        {252}let k_8: bitstring = (EA_id_5,SVK_id_5) in
        {251}let salt_21: salt_type = H((ee_9,hAuth)) in
        {253}let hAuth_id_16: bitstring = Argon2id(k_8,salt_21) in
        {254}let hAuth_id_17: bitstring = hAuth_id_16 in
        {247}let T_4: timestamp = T_vote_1 in
        {257}let hhAuth_id_4: bitstring = Argon2id((hAuth_id_17,T_4),salt_22) in
        {258}let (credentialId_id_vote_1: bitstring,hhAuth_id_vote_1: bitstring,nonce_vote_1: Nonce) = (credentialId_id_17,hhAuth_id_4,nonce_4) in
        {240}let E2_1: bitstring = pCC(Sk_id_5,v(J1_1)) in
        {237}let V_1: num = v(J1_1) in
        {239}let E1_1: bitstring = Enc(pk_EL_2,V_1,R_1) in
        {236}let Pk_id_1: public_ekey = pube(Sk_id_5) in
        {241}let P_1: bitstring = ZKP(pk_EL_2,Pk_id_1,VC_id_1,E1_1,E2_1,R_1,Sk_id_5) in
        {242}let ballot_1: bitstring = (E1_1,E2_1,tild(Sk_id_5,E1_1),Pk_id_1,P_1) in
        {259}out(c, (ballot_1,hhAuth_id_vote_1,nonce_vote_1));
        {260}in(c, Rcv_CC: bitstring);
        {261}if (Rcv_CC = CCid1_1) then
        {262}new T_confirm_1: timestamp;
        {263}out(c, T_confirm_1);
        {274}new nonce_5: Nonce;
        {264}let ee_10: election_event = ee in
        {267}let salt_23: salt_type = H((ee_10,credentialId)) in
        {268}let credentialId_id_18: bitstring = Argon2id(SVK_id_5,salt_23) in
        {269}let credentialId_id_19: bitstring = credentialId_id_18 in
        {265}let authStep_5: bitstring = authenticateVoter in
        {275}let salt_25: salt_type = H((ee_10,credentialId_id_19,dAuth,authStep_5,nonce_5)) in
        {271}let k_9: bitstring = (EA_id_5,SVK_id_5) in
        {270}let salt_24: salt_type = H((ee_10,hAuth)) in
        {272}let hAuth_id_18: bitstring = Argon2id(k_9,salt_24) in
        {273}let hAuth_id_19: bitstring = hAuth_id_18 in
        {266}let T_5: timestamp = T_confirm_1 in
        {276}let hhAuth_id_5: bitstring = Argon2id((hAuth_id_19,T_5),salt_25) in
        {277}let (credentialId_id_confirm_1: bitstring,hhAuth_id_confirm_1: bitstring,nonce_confirm_1: Nonce) = (credentialId_id_19,hhAuth_id_5,nonce_5) in
        {278}out(c, (tild(Sk_id_5,H(BCK_id_1)),hhAuth_id_confirm_1,nonce_confirm_1));
        {279}in(c, =VCCid_1)
    ) | (
        {280}new idC: agent_id;
        {281}out(c, AliceData(idC));
        {282}let id_2: agent_id = idC in
        {284}let Sk_id_6: private_ekey = ske(id_2) in
        {285}let VCks_id_4: bitstring = Enc_s(KSkey(SVK(id_2)),Sk_id_6,pk_EL) in
        {286}out(c, VCks_id_4);
        {283}let is_target_voter_2: bool = false in
        (
            {287}if is_target_voter_2 then
            {288}let (hpCCA1_2: num,hpCCB1_2: num) = (H(pCC(Sk_id_6,v(jA1))),H(pCC(Sk_id_6,v(jB1)))) in
            {289}let (lpCCA1_2: num,lpCCB1_2: num) = (H((hpCCA1_2,VC(id_2))),H((hpCCB1_2,VC(id_2)))) in
            {296}let lVCC_13: num = tild(kCCR'(2,VC(id_2)),H(tild(Sk_id_6,H(BCK(id_2))))) in
            {298}let hlVCC_9: num = H((lVCC_13,VC(id_2))) in
            {295}let lVCC_12: num = tild(kCCR'(1,VC(id_2)),H(tild(Sk_id_6,H(BCK(id_2))))) in
            {297}let hlVCC_8: num = H((lVCC_12,VC(id_2))) in
            {299}let hhlVCC_4: num = H((hlVCC_8,hlVCC_9,VC(id_2))) in
            {300}insert L_lVCC(hhlVCC_4);
            (
                {303}out(c, choice[lpCCA1_2,lpCCB1_2])
            ) | (
                {304}out(c, choice[lpCCB1_2,lpCCA1_2])
            ) | (
                {291}let pCB1_2: num = tild(kCCR(VC(id_2)),H(pCC(Sk_id_6,v(jB1)))) in
                {293}let lCCB1_2: num = H(H((VC(id_2),pCB1_2))) in
                {290}let pCA1_2: num = tild(kCCR(VC(id_2)),H(pCC(Sk_id_6,v(jA1)))) in
                {292}let lCCA1_2: num = H(H((VC(id_2),pCA1_2))) in
                (
                    {305}out(c, choice[lCCA1_2,lCCB1_2])
                ) | (
                    {306}out(c, choice[lCCB1_2,lCCA1_2])
                ) | (
                    {307}out(c, (hlVCC_9,hhlVCC_4));
                    {294}let kCCR_all_4: private_ekey = merge_keys(kCCR'(1,VC(id_2)),kCCR'(2,VC(id_2))) in
                    {301}let pVCC_4: num = tild(kCCR_all_4,H(tild(Sk_id_6,H(BCK(id_2))))) in
                    {302}let lVCC_14: num = H(H((VC(id_2),pVCC_4))) in
                    {308}out(c, lVCC_14);
                    {311}let EA_id_6: extended_auth = EA(id_2) in
                    {310}let SVK_id_6: password = SVK(id_2) in
                    {316}let k_10: bitstring = (EA_id_6,SVK_id_6) in
                    {309}let ee_11: election_event = ee in
                    {315}let salt_27: salt_type = H((ee_11,hAuth)) in
                    {317}let hAuth_id_20: bitstring = Argon2id(k_10,salt_27) in
                    {318}let hAuth_id_21: bitstring = hAuth_id_20 in
                    {312}let salt_26: salt_type = H((ee_11,credentialId)) in
                    {313}let credentialId_id_20: bitstring = Argon2id(SVK_id_6,salt_26) in
                    {314}let credentialId_id_21: bitstring = credentialId_id_20 in
                    {319}out(c, (credentialId_id_21,hAuth_id_21))
                )
            )
        ) | (
            {320}!
            {321}in(c, J_2: num);
            {322}if (not(is_target_voter_2) || ((J_2 ≠ jA1) && (J_2 ≠ jB1))) then
            {329}let lVCC_16: num = tild(kCCR'(2,VC(id_2)),H(tild(Sk_id_6,H(BCK(id_2))))) in
            {331}let hlVCC_11: num = H((lVCC_16,VC(id_2))) in
            {328}let lVCC_15: num = tild(kCCR'(1,VC(id_2)),H(tild(Sk_id_6,H(BCK(id_2))))) in
            {330}let hlVCC_10: num = H((lVCC_15,VC(id_2))) in
            {332}let hhlVCC_5: num = H((hlVCC_10,hlVCC_11,VC(id_2))) in
            {333}insert L_lVCC(hhlVCC_5);
            {327}let kCCR_all_5: private_ekey = merge_keys(kCCR'(1,VC(id_2)),kCCR'(2,VC(id_2))) in
            {334}let pVCC_5: num = tild(kCCR_all_5,H(tild(Sk_id_6,H(BCK(id_2))))) in
            {335}let lVCC_17: num = H(H((VC(id_2),pVCC_5))) in
            {325}let pC_2: num = tild(kCCR(VC(id_2)),H(pCC(Sk_id_6,v(J_2)))) in
            {326}let lCC_2: num = H(H((VC(id_2),pC_2))) in
            {323}let hpCC_2: num = H(pCC(Sk_id_6,v(J_2))) in
            {324}let lpCC_2: num = H((hpCC_2,VC(id_2))) in
            {336}out(c, (lpCC_2,lCC_2,lVCC_17));
            {337}out(c, (hlVCC_11,hhlVCC_5));
            {340}let EA_id_7: extended_auth = EA(id_2) in
            {339}let SVK_id_7: password = SVK(id_2) in
            {345}let k_11: bitstring = (EA_id_7,SVK_id_7) in
            {338}let ee_12: election_event = ee in
            {344}let salt_29: salt_type = H((ee_12,hAuth)) in
            {346}let hAuth_id_22: bitstring = Argon2id(k_11,salt_29) in
            {347}let hAuth_id_23: bitstring = hAuth_id_22 in
            {341}let salt_28: salt_type = H((ee_12,credentialId)) in
            {342}let credentialId_id_22: bitstring = Argon2id(SVK_id_7,salt_28) in
            {343}let credentialId_id_23: bitstring = credentialId_id_22 in
            {348}out(c, (credentialId_id_23,hAuth_id_23))
        )
    ) | (
        {349}!
        {351}in(c, (vcid: bitstring,B: bitstring));
        {352}let (E1_2: bitstring,E2_2: bitstring,EC: num,KVCId: public_ekey,P_2: bitstring) = B in
        {353}let v_3: bitstring = B in
        {354}let v_4: bool = success?(1-proj-5-tuple(v_3)) in
        {355}let P_3: bitstring = (if v_4 then 5-proj-5-tuple(v_3) else caught-fail) in
        {356}let Pk_id_2: public_ekey = (if v_4 then 4-proj-5-tuple(v_3) else caught-fail) in
        {357}let EC_1: num = (if v_4 then 3-proj-5-tuple(v_3) else caught-fail) in
        {358}let E2_3: bitstring = (if v_4 then 2-proj-5-tuple(v_3) else caught-fail) in
        {359}let E1_3: bitstring = (if v_4 then 1-proj-5-tuple(v_3) else caught-fail) in
        {360}let Ok: bool = (if v_4 then catch-fail(VerifP(pk_EL,Pk_id_2,vcid,E1_3,E2_3,P_3)) else caught-fail) in
        {361}let v_5: bool = not-caught-fail(Ok) in
        {362}if (if v_4 then (if v_5 then true else fail-any_type) else fail-any_type) then
        {363}in(c, (=CMTag,pCM: bitstring));
        {350}let i: nat = 1 in
        {364}let lVCC_id_1: num = tild(kCCR'(i,vcid),H(pCM)) in
        {365}let hlVCC_id_1: num = H((lVCC_id_1,vcid)) in
        {366}out(c, hlVCC_id_1);
        {367}in(c, hlVCC_id_2: bitstring);
        {368}let hhlVCC_id: num = H((hlVCC_id_1,hlVCC_id_2,vcid)) in
        {371}get L_lVCC(=hhlVCC_id) in
        {369}insert ConfirmedVotes(i,vcid,B);
        {370}out(c, lVCC_id_1)
    ) | (
        {372}!
        {374}in(c, (vcid_1: bitstring,B_1: bitstring,hlVCC_id: num,hlVCC_id_3: num));
        {375}let v_6: bitstring = B_1 in
        {376}let v_7: bool = success?(1-proj-5-tuple(v_6)) in
        {377}let P_4: bitstring = (if v_7 then 5-proj-5-tuple(v_6) else caught-fail) in
        {378}let Pk_id_3: public_ekey = (if v_7 then 4-proj-5-tuple(v_6) else caught-fail) in
        {379}let EC_2: num = (if v_7 then 3-proj-5-tuple(v_6) else caught-fail) in
        {380}let E2_4: bitstring = (if v_7 then 2-proj-5-tuple(v_6) else caught-fail) in
        {381}let E1_4: bitstring = (if v_7 then 1-proj-5-tuple(v_6) else caught-fail) in
        {382}let Ok_1: bool = (if v_7 then catch-fail(VerifP(pk_EL,Pk_id_3,vcid_1,E1_4,E2_4,P_4)) else caught-fail) in
        {383}let v_8: bool = not-caught-fail(Ok_1) in
        {384}if (if v_7 then (if v_8 then true else fail-any_type) else fail-any_type) then
        {386}get L_lVCC(=H((hlVCC_id,hlVCC_id_3,vcid_1))) in
        {373}let i_1: nat = 1 in
        {385}insert ConfirmedVotes(i_1,vcid_1,B_1)
    ) | (
        {387}!
        {391}in(c_priv, =ok);
        {390}let idB_1: agent_id = idB in
        {389}let idA_1: agent_id = idA in
        {388}let sk_EL: private_ekey = sk_EL_1 in
        {478}get ConfirmedVotes(1,=VC(idA_1),B1: bitstring) in
        (
            {456}get ConfirmedVotes(1,=VC(idB_1),B2: bitstring) in
            (
                {392}let (E1_5: bitstring,E2_5: bitstring,EC1: num,Pk_id1: public_ekey,P1: bitstring) = B1 in
                {393}let (E1_6: bitstring,E2_6: bitstring,EC2: num,Pk_id2: public_ekey,P2: bitstring) = B2 in
                {395}let v_9: bitstring = B1 in
                {396}let v_10: bool = success?(1-proj-5-tuple(v_9)) in
                {397}let P_5: bitstring = (if v_10 then 5-proj-5-tuple(v_9) else caught-fail) in
                {398}let Pk_id_4: public_ekey = (if v_10 then 4-proj-5-tuple(v_9) else caught-fail) in
                {399}let EC_3: num = (if v_10 then 3-proj-5-tuple(v_9) else caught-fail) in
                {400}let E2_7: bitstring = (if v_10 then 2-proj-5-tuple(v_9) else caught-fail) in
                {401}let E1_7: bitstring = (if v_10 then 1-proj-5-tuple(v_9) else caught-fail) in
                {394}let VC_id_2: bitstring = VC(idA_1) in
                {402}let Ok_2: bool = (if v_10 then catch-fail(VerifP(pk_EL,Pk_id_4,VC_id_2,E1_7,E2_7,P_5)) else caught-fail) in
                {403}let v_11: bool = not-caught-fail(Ok_2) in
                {404}let Ok1: bool = (if v_10 then (if v_11 then true else fail-any_type) else fail-any_type) in
                {406}let v_12: bitstring = B2 in
                {407}let v_13: bool = success?(1-proj-5-tuple(v_12)) in
                {408}let P_6: bitstring = (if v_13 then 5-proj-5-tuple(v_12) else caught-fail) in
                {409}let Pk_id_5: public_ekey = (if v_13 then 4-proj-5-tuple(v_12) else caught-fail) in
                {410}let EC_4: num = (if v_13 then 3-proj-5-tuple(v_12) else caught-fail) in
                {411}let E2_8: bitstring = (if v_13 then 2-proj-5-tuple(v_12) else caught-fail) in
                {412}let E1_8: bitstring = (if v_13 then 1-proj-5-tuple(v_12) else caught-fail) in
                {405}let VC_id_3: bitstring = VC(idB_1) in
                {413}let Ok_3: bool = (if v_13 then catch-fail(VerifP(pk_EL,Pk_id_5,VC_id_3,E1_8,E2_8,P_6)) else caught-fail) in
                {414}let v_14: bool = not-caught-fail(Ok_3) in
                {415}let Ok2: bool = (if v_13 then (if v_14 then true else fail-any_type) else fail-any_type) in
                (
                    {416}out(mix, choice[E1_5,E1_6])
                ) | (
                    {417}out(mix, choice[E1_6,E1_5])
                ) | (
                    {418}in(mix, m1: bitstring);
                    {419}in(mix, m2: bitstring);
                    {442}get ConfirmedVotes(1,VC_id3: bitstring,B3: bitstring) suchthat ((VC_id3 ≠ VC(idA_1)) && (VC_id3 ≠ VC(idB_1))) in
                    (
                        {420}event CommitOnVCIDs(1,(VC(idA_1),VC(idB_1)));
                        {421}out(c_toCCMs, H((VC(idA_1),B1,VC(idB_1),B2,VC_id3,B3)));
                        {422}in(c_toCCM1, =H((VC(idA_1),B1,VC(idB_1),B2,VC_id3,B3)));
                        {423}let (E1_9: bitstring,E2_9: bitstring,EC3: num,Pk_id3: public_ekey,P3: bitstring) = B3 in
                        {424}let v_15: bitstring = B3 in
                        {425}let v_16: bool = success?(1-proj-5-tuple(v_15)) in
                        {426}let P_7: bitstring = (if v_16 then 5-proj-5-tuple(v_15) else caught-fail) in
                        {427}let Pk_id_6: public_ekey = (if v_16 then 4-proj-5-tuple(v_15) else caught-fail) in
                        {428}let EC_5: num = (if v_16 then 3-proj-5-tuple(v_15) else caught-fail) in
                        {429}let E2_10: bitstring = (if v_16 then 2-proj-5-tuple(v_15) else caught-fail) in
                        {430}let E1_10: bitstring = (if v_16 then 1-proj-5-tuple(v_15) else caught-fail) in
                        {431}let Ok_4: bool = (if v_16 then catch-fail(VerifP(pk_EL,Pk_id_6,VC_id3,E1_10,E2_10,P_7)) else caught-fail) in
                        {432}let v_17: bool = not-caught-fail(Ok_4) in
                        {433}let Ok3: bool = (if v_16 then (if v_17 then true else fail-any_type) else fail-any_type) in
                        {434}let m3: bitstring = E1_9 in
                        {435}out(c, (PDec(sk_EL,m1),PDec(sk_EL,m2),PDec(sk_EL,m3)));
                        {436}out(c, PMix(sk_EL,(E1_5,E1_6,E1_9),(PDec(sk_EL,m1),PDec(sk_EL,m2),PDec(sk_EL,m3))))
                    )
                    else
                        {437}event CommitOnVCIDs(1,(VC(idA_1),VC(idB_1)));
                        {438}out(c_toCCMs, H((VC(idA_1),B1,VC(idB_1),B2)));
                        {439}in(c_toCCM1, =H((VC(idA_1),B1,VC(idB_1),B2)));
                        {440}out(c, (PDec(sk_EL,m1),PDec(sk_EL,m2)));
                        {441}out(c, PMix(sk_EL,(E1_5,E1_6),(PDec(sk_EL,m1),PDec(sk_EL,m2))))
                )
            )
            else
                {455}get ConfirmedVotes(1,VC_id3_1: bitstring,B3_1: bitstring) suchthat ((VC_id3_1 ≠ VC(idA_1)) && (VC_id3_1 ≠ VC(idB_1))) in
                (
                    {443}event CommitOnVCIDs(1,(VC(idA_1),VC_id3_1));
                    {444}out(c_toCCMs, H((VC(idA_1),B1,VC_id3_1,B3_1)));
                    {445}in(c_toCCM1, =H((VC(idA_1),B1,VC_id3_1,B3_1)));
                    {446}let (E1_11: bitstring,E2_11: bitstring,EC1_1: num,Pk_id1_1: public_ekey,P1_1: bitstring) = B1 in
                    {447}let (E1_12: bitstring,E2_12: bitstring,EC3_1: num,Pk_id3_1: public_ekey,P3_1: bitstring) = B3_1 in
                    {448}out(c, (PDec(sk_EL,E1_11),PDec(sk_EL,E1_12)));
                    {449}out(c, PMix(sk_EL,(E1_11,E1_12),(PDec(sk_EL,E1_11),PDec(sk_EL,E1_12))))
                )
                else
                    {450}event CommitOnVCIDs(1,VC(idA_1));
                    {451}out(c_toCCMs, H((VC(idA_1),B1)));
                    {452}in(c_toCCM1, =H((VC(idA_1),B1)));
                    {453}let (E1_13: bitstring,E2_13: bitstring,EC1_2: num,Pk_id1_2: public_ekey,P1_2: bitstring) = B1 in
                    {454}out(c, PDec(sk_EL,E1_13))
        )
        else
            {477}get ConfirmedVotes(1,=VC(idB_1),B2_1: bitstring) in
            (
                {470}get ConfirmedVotes(1,VC_id3_2: bitstring,B3_2: bitstring) suchthat ((VC_id3_2 ≠ VC(idA_1)) && (VC_id3_2 ≠ VC(idB_1))) in
                (
                    {457}let (E1_14: bitstring,E2_14: bitstring,EC2_1: num,Pk_id2_1: public_ekey,P2_1: bitstring) = B2_1 in
                    {458}let (E1_15: bitstring,E2_15: bitstring,EC3_2: num,Pk_id3_2: public_ekey,P3_2: bitstring) = B3_2 in
                    {459}event CommitOnVCIDs(1,(VC(idB_1),VC_id3_2));
                    {460}out(c_toCCMs, H((VC(idB_1),B2_1,VC_id3_2,B3_2)));
                    {461}in(c_toCCM1, =H((VC(idB_1),B2_1,VC_id3_2,B3_2)));
                    {462}out(c, (PDec(sk_EL,E1_14),PDec(sk_EL,E1_15)));
                    {463}out(c, PMix(sk_EL,(E1_14,E1_15),(PDec(sk_EL,E1_14),PDec(sk_EL,E1_15))))
                )
                else
                    {469}get ConfirmedVotes(1,VC_id3_3: bitstring,B3_3: bitstring) suchthat ((VC_id3_3 ≠ VC(idA_1)) && (VC_id3_3 ≠ VC(idB_1))) in
                    {464}event CommitOnVCIDs(1,VC_id3_3);
                    {465}out(c_toCCMs, H((VC_id3_3,B3_3)));
                    {466}in(c_toCCM1, =H((VC_id3_3,B3_3)));
                    {467}let (E1_16: bitstring,E2_16: bitstring,EC3_3: num,Pk_id3_3: public_ekey,P3_3: bitstring) = B3_3 in
                    {468}out(c, PDec(sk_EL,E1_16))
            )
            else
                {476}get ConfirmedVotes(1,VC_id3_4: bitstring,B3_4: bitstring) suchthat ((VC_id3_4 ≠ VC(idA_1)) && (VC_id3_4 ≠ VC(idB_1))) in
                {471}event CommitOnVCIDs(1,VC_id3_4);
                {472}out(c_toCCMs, H((VC_id3_4,B3_4)));
                {473}in(c_toCCM1, =H((VC_id3_4,B3_4)));
                {474}let (E1_17: bitstring,E2_17: bitstring,EC3_4: num,Pk_id3_4: public_ekey,P3_4: bitstring) = B3_4 in
                {475}out(c, PDec(sk_EL,E1_17))
    ) | (
        {479}!
        {480}in(c, vcid_2: bitstring);
        {481}out(c, kCCR'(2,vcid_2))
    ) | (
        {482}!
        (
            {483}in(c, (vcid_3: bitstring,B_2: bitstring,(hlVCC_1_1: bitstring,hlVCC_1_2: bitstring)));
            {484}in(c, (vcid_4: bitstring,B_3: bitstring,(hlVCC_2_1: bitstring,hlVCC_2_2: bitstring)));
            {485}in(c, (vcid_5: bitstring,B_4: bitstring,(hlVCC_3_1: bitstring,hlVCC_3_2: bitstring)));
            {486}let v_18: bitstring = B_2 in
            {487}let v_19: bool = success?(1-proj-5-tuple(v_18)) in
            {488}let P_8: bitstring = (if v_19 then 5-proj-5-tuple(v_18) else caught-fail) in
            {489}let Pk_id_7: public_ekey = (if v_19 then 4-proj-5-tuple(v_18) else caught-fail) in
            {490}let EC_6: num = (if v_19 then 3-proj-5-tuple(v_18) else caught-fail) in
            {491}let E2_18: bitstring = (if v_19 then 2-proj-5-tuple(v_18) else caught-fail) in
            {492}let E1_18: bitstring = (if v_19 then 1-proj-5-tuple(v_18) else caught-fail) in
            {493}let Ok_5: bool = (if v_19 then catch-fail(VerifP(pk_EL,Pk_id_7,vcid_3,E1_18,E2_18,P_8)) else caught-fail) in
            {494}let v_20: bool = not-caught-fail(Ok_5) in
            {495}let Ok1_1: bool = (if v_19 then (if v_20 then true else fail-any_type) else fail-any_type) in
            {496}let v_21: bitstring = B_3 in
            {497}let v_22: bool = success?(1-proj-5-tuple(v_21)) in
            {498}let P_9: bitstring = (if v_22 then 5-proj-5-tuple(v_21) else caught-fail) in
            {499}let Pk_id_8: public_ekey = (if v_22 then 4-proj-5-tuple(v_21) else caught-fail) in
            {500}let EC_7: num = (if v_22 then 3-proj-5-tuple(v_21) else caught-fail) in
            {501}let E2_19: bitstring = (if v_22 then 2-proj-5-tuple(v_21) else caught-fail) in
            {502}let E1_19: bitstring = (if v_22 then 1-proj-5-tuple(v_21) else caught-fail) in
            {503}let Ok_6: bool = (if v_22 then catch-fail(VerifP(pk_EL,Pk_id_8,vcid_4,E1_19,E2_19,P_9)) else caught-fail) in
            {504}let v_23: bool = not-caught-fail(Ok_6) in
            {505}let Ok2_1: bool = (if v_22 then (if v_23 then true else fail-any_type) else fail-any_type) in
            {506}let v_24: bitstring = B_4 in
            {507}let v_25: bool = success?(1-proj-5-tuple(v_24)) in
            {508}let P_10: bitstring = (if v_25 then 5-proj-5-tuple(v_24) else caught-fail) in
            {509}let Pk_id_9: public_ekey = (if v_25 then 4-proj-5-tuple(v_24) else caught-fail) in
            {510}let EC_8: num = (if v_25 then 3-proj-5-tuple(v_24) else caught-fail) in
            {511}let E2_20: bitstring = (if v_25 then 2-proj-5-tuple(v_24) else caught-fail) in
            {512}let E1_20: bitstring = (if v_25 then 1-proj-5-tuple(v_24) else caught-fail) in
            {513}let Ok_7: bool = (if v_25 then catch-fail(VerifP(pk_EL,Pk_id_9,vcid_5,E1_20,E2_20,P_10)) else caught-fail) in
            {514}let v_26: bool = not-caught-fail(Ok_7) in
            {515}let Ok3_1: bool = (if v_25 then (if v_26 then true else fail-any_type) else fail-any_type) in
            {523}get L_lVCC(=H((hlVCC_1_1,hlVCC_1_2,vcid_3))) in
            {522}get L_lVCC(=H((hlVCC_2_1,hlVCC_2_2,vcid_4))) in
            {521}get L_lVCC(=H((hlVCC_3_1,hlVCC_3_2,vcid_5))) in
            {516}event CommitOnVCIDs(2,(vcid_3,vcid_4));
            (
                {517}!
                {518}out(c_toCCM1, H((vcid_3,B_2,vcid_4,B_3,vcid_5,B_4)))
            ) | (
                {519}in(c_toCCMs, =H((vcid_3,B_2,vcid_4,B_3,vcid_5,B_4)));
                {520}out(c_priv, ok)
            )
        ) | (
            {524}in(c, (vcid_6: bitstring,B_5: bitstring,(hlVCC_1: bitstring,hlVCC_1_3: bitstring)));
            {525}in(c, (vcid_7: bitstring,B_6: bitstring,(hlVCC_2: bitstring,hlVCC_2_3: bitstring)));
            {526}let v_27: bitstring = B_5 in
            {527}let v_28: bool = success?(1-proj-5-tuple(v_27)) in
            {528}let P_11: bitstring = (if v_28 then 5-proj-5-tuple(v_27) else caught-fail) in
            {529}let Pk_id_10: public_ekey = (if v_28 then 4-proj-5-tuple(v_27) else caught-fail) in
            {530}let EC_9: num = (if v_28 then 3-proj-5-tuple(v_27) else caught-fail) in
            {531}let E2_21: bitstring = (if v_28 then 2-proj-5-tuple(v_27) else caught-fail) in
            {532}let E1_21: bitstring = (if v_28 then 1-proj-5-tuple(v_27) else caught-fail) in
            {533}let Ok_8: bool = (if v_28 then catch-fail(VerifP(pk_EL,Pk_id_10,vcid_6,E1_21,E2_21,P_11)) else caught-fail) in
            {534}let v_29: bool = not-caught-fail(Ok_8) in
            {535}let Ok1_2: bool = (if v_28 then (if v_29 then true else fail-any_type) else fail-any_type) in
            {536}let v_30: bitstring = B_6 in
            {537}let v_31: bool = success?(1-proj-5-tuple(v_30)) in
            {538}let P_12: bitstring = (if v_31 then 5-proj-5-tuple(v_30) else caught-fail) in
            {539}let Pk_id_11: public_ekey = (if v_31 then 4-proj-5-tuple(v_30) else caught-fail) in
            {540}let EC_10: num = (if v_31 then 3-proj-5-tuple(v_30) else caught-fail) in
            {541}let E2_22: bitstring = (if v_31 then 2-proj-5-tuple(v_30) else caught-fail) in
            {542}let E1_22: bitstring = (if v_31 then 1-proj-5-tuple(v_30) else caught-fail) in
            {543}let Ok_9: bool = (if v_31 then catch-fail(VerifP(pk_EL,Pk_id_11,vcid_7,E1_22,E2_22,P_12)) else caught-fail) in
            {544}let v_32: bool = not-caught-fail(Ok_9) in
            {545}let Ok2_2: bool = (if v_31 then (if v_32 then true else fail-any_type) else fail-any_type) in
            {552}get L_lVCC(=H((hlVCC_1,hlVCC_1_3,vcid_6))) in
            {551}get L_lVCC(=H((hlVCC_2,hlVCC_2_3,vcid_7))) in
            {546}event CommitOnVCIDs(2,(vcid_6,vcid_7));
            (
                {547}!
                {548}out(c_toCCM1, H((vcid_6,B_5,vcid_7,B_6)))
            ) | (
                {549}in(c_toCCMs, =H((vcid_6,B_5,vcid_7,B_6)));
                {550}out(c_priv, ok)
            )
        ) | (
            {553}in(c, (vcid_8: bitstring,B_7: bitstring,(hlVCC_1_4: bitstring,hlVCC_1_5: bitstring)));
            {554}let v_33: bitstring = B_7 in
            {555}let v_34: bool = success?(1-proj-5-tuple(v_33)) in
            {556}let P_13: bitstring = (if v_34 then 5-proj-5-tuple(v_33) else caught-fail) in
            {557}let Pk_id_12: public_ekey = (if v_34 then 4-proj-5-tuple(v_33) else caught-fail) in
            {558}let EC_11: num = (if v_34 then 3-proj-5-tuple(v_33) else caught-fail) in
            {559}let E2_23: bitstring = (if v_34 then 2-proj-5-tuple(v_33) else caught-fail) in
            {560}let E1_23: bitstring = (if v_34 then 1-proj-5-tuple(v_33) else caught-fail) in
            {561}let Ok_10: bool = (if v_34 then catch-fail(VerifP(pk_EL,Pk_id_12,vcid_8,E1_23,E2_23,P_13)) else caught-fail) in
            {562}let v_35: bool = not-caught-fail(Ok_10) in
            {563}let Ok1_3: bool = (if v_34 then (if v_35 then true else fail-any_type) else fail-any_type) in
            {569}get L_lVCC(=H((hlVCC_1_4,hlVCC_1_5,vcid_8))) in
            {564}event CommitOnVCIDs(2,vcid_8);
            (
                {565}!
                {566}out(c_toCCM1, H((vcid_8,B_7)))
            ) | (
                {567}in(c_toCCMs, =H((vcid_8,B_7)));
                {568}out(c_priv, ok)
            )
        )
    )
)

-- Restriction event(CommitOnVCIDs(1,vcids)) && event(CommitOnVCIDs(2,vcids')) ==> (vcids = VC(idA[]) && vcids' = VC(idB[])) || (vcids = VC(idB[]) && vcids' = VC(idA[])) || (vcids = (VC(idA[]),x) && vcids' = (y,VC(idB[]))) || (vcids = (VC(idA[]),x) && vcids' = (VC(idB[]),y)) || (vcids = (x,VC(idA[])) && vcids' = (y,VC(idB[]))) || (vcids = (x,VC(idA[])) && vcids' = (VC(idB[]),y)) || (vcids = (VC(idB[]),x) && vcids' = (y,VC(idA[]))) || (vcids = (VC(idB[]),x) && vcids' = (VC(idA[]),y)) || (vcids = (x,VC(idB[])) && vcids' = (y,VC(idA[]))) || (vcids = (x,VC(idB[])) && vcids' = (VC(idA[]),y)) || vcids = (VC(idA[]),VC(idB[])) || vcids = (VC(idB[]),VC(idA[])) || vcids' = (VC(idA[]),VC(idB[])) || vcids' = (VC(idB[]),VC(idA[])) encoded as event2(CommitOnVCIDs(1,vcids),CommitOnVCIDs(1,vcids)) && event2(CommitOnVCIDs(2,vcids'),CommitOnVCIDs(2,vcids')) ==> (vcids = VC(idA[]) && vcids' = VC(idB[])) || (vcids = VC(idB[]) && vcids' = VC(idA[])) || (vcids = (VC(idA[]),x) && vcids' = (y,VC(idB[]))) || (vcids = (VC(idA[]),x) && vcids' = (VC(idB[]),y)) || (vcids = (x,VC(idA[])) && vcids' = (y,VC(idB[]))) || (vcids = (x,VC(idA[])) && vcids' = (VC(idB[]),y)) || (vcids = (VC(idB[]),x) && vcids' = (y,VC(idA[]))) || (vcids = (VC(idB[]),x) && vcids' = (VC(idA[]),y)) || (vcids = (x,VC(idB[])) && vcids' = (y,VC(idA[]))) || (vcids = (x,VC(idB[])) && vcids' = (VC(idA[]),y)) || vcids = (VC(idA[]),VC(idB[])) || vcids = (VC(idB[]),VC(idA[])) || vcids' = (VC(idA[]),VC(idB[])) || vcids' = (VC(idB[]),VC(idA[])) in biprocess 1.
-- Diff-equivalence in biprocess 1.
Translating the process into Horn clauses...
Termination warning: v_36 ≠ v_37 && attacker2(v_38,v_36) && attacker2(v_38,v_37) -> bad
Selecting 0
Termination warning: v_36 ≠ v_37 && attacker2(v_36,v_38) && attacker2(v_37,v_38) -> bad
Selecting 0
Completing...
Termination warning: v_36 ≠ v_37 && attacker2(v_38,v_36) && attacker2(v_38,v_37) -> bad
Selecting 0
Termination warning: v_36 ≠ v_37 && attacker2(v_36,v_38) && attacker2(v_37,v_38) -> bad
Selecting 0
200 rules inserted. Base: 200 rules (79 with conclusion selected). Queue: 258 rules.
400 rules inserted. Base: 396 rules (103 with conclusion selected). Queue: 321 rules.
600 rules inserted. Base: 573 rules (118 with conclusion selected). Queue: 224 rules.
800 rules inserted. Base: 748 rules (132 with conclusion selected). Queue: 219 rules.
1000 rules inserted. Base: 908 rules (132 with conclusion selected). Queue: 148 rules.
1200 rules inserted. Base: 1086 rules (133 with conclusion selected). Queue: 146 rules.
1400 rules inserted. Base: 1184 rules (136 with conclusion selected). Queue: 142 rules.
1600 rules inserted. Base: 1321 rules (138 with conclusion selected). Queue: 126 rules.
1800 rules inserted. Base: 1283 rules (146 with conclusion selected). Queue: 99 rules.
2000 rules inserted. Base: 1337 rules (158 with conclusion selected). Queue: 117 rules.
2200 rules inserted. Base: 1400 rules (169 with conclusion selected). Queue: 165 rules.
2400 rules inserted. Base: 1456 rules (192 with conclusion selected). Queue: 171 rules.
2600 rules inserted. Base: 1554 rules (203 with conclusion selected). Queue: 155 rules.
2800 rules inserted. Base: 1612 rules (207 with conclusion selected). Queue: 145 rules.
3000 rules inserted. Base: 1699 rules (221 with conclusion selected). Queue: 170 rules.
3200 rules inserted. Base: 1782 rules (243 with conclusion selected). Queue: 209 rules.
3400 rules inserted. Base: 1912 rules (265 with conclusion selected). Queue: 245 rules.
3600 rules inserted. Base: 2014 rules (290 with conclusion selected). Queue: 243 rules.
3800 rules inserted. Base: 2157 rules (306 with conclusion selected). Queue: 217 rules.
4000 rules inserted. Base: 2310 rules (320 with conclusion selected). Queue: 214 rules.
4200 rules inserted. Base: 2438 rules (324 with conclusion selected). Queue: 150 rules.
4400 rules inserted. Base: 2541 rules (324 with conclusion selected). Queue: 131 rules.
4600 rules inserted. Base: 2638 rules (329 with conclusion selected). Queue: 103 rules.
4800 rules inserted. Base: 2744 rules (337 with conclusion selected). Queue: 63 rules.
5000 rules inserted. Base: 2855 rules (342 with conclusion selected). Queue: 20 rules.
RESULT Diff-equivalence is true.

--------------------------------------------------------------
Verification summary:

Query(ies):
 - Diff-equivalence is true.
Associated restriction(s):
 - Restriction event(CommitOnVCIDs(1,vcids)) && event(CommitOnVCIDs(2,vcids')) ==> (vcids = VC(idA[]) && vcids' = VC(idB[])) || (vcids = VC(idB[]) && vcids' = VC(idA[])) || (vcids = (VC(idA[]),x) && vcids' = (y,VC(idB[]))) || (vcids = (VC(idA[]),x) && vcids' = (VC(idB[]),y)) || (vcids = (x,VC(idA[])) && vcids' = (y,VC(idB[]))) || (vcids = (x,VC(idA[])) && vcids' = (VC(idB[]),y)) || (vcids = (VC(idB[]),x) && vcids' = (y,VC(idA[]))) || (vcids = (VC(idB[]),x) && vcids' = (VC(idA[]),y)) || (vcids = (x,VC(idB[])) && vcids' = (y,VC(idA[]))) || (vcids = (x,VC(idB[])) && vcids' = (VC(idA[]),y)) || vcids = (VC(idA[]),VC(idB[])) || vcids = (VC(idB[]),VC(idA[])) || vcids' = (VC(idA[]),VC(idB[])) || vcids' = (VC(idB[]),VC(idA[])) encoded as event2(CommitOnVCIDs(1,vcids),CommitOnVCIDs(1,vcids)) && event2(CommitOnVCIDs(2,vcids'),CommitOnVCIDs(2,vcids')) ==> (vcids = VC(idA[]) && vcids' = VC(idB[])) || (vcids = VC(idB[]) && vcids' = VC(idA[])) || (vcids = (VC(idA[]),x) && vcids' = (y,VC(idB[]))) || (vcids = (VC(idA[]),x) && vcids' = (VC(idB[]),y)) || (vcids = (x,VC(idA[])) && vcids' = (y,VC(idB[]))) || (vcids = (x,VC(idA[])) && vcids' = (VC(idB[]),y)) || (vcids = (VC(idB[]),x) && vcids' = (y,VC(idA[]))) || (vcids = (VC(idB[]),x) && vcids' = (VC(idA[]),y)) || (vcids = (x,VC(idB[])) && vcids' = (y,VC(idA[]))) || (vcids = (x,VC(idB[])) && vcids' = (VC(idA[]),y)) || vcids = (VC(idA[]),VC(idB[])) || vcids = (VC(idB[]),VC(idA[])) || vcids' = (VC(idA[]),VC(idB[])) || vcids' = (VC(idB[]),VC(idA[])) in biprocess 1.

--------------------------------------------------------------

