{
	"root": true,
	"ignorePatterns": [
		"**/*"
	],
	"plugins": [
		"@nx"
	],
	"overrides": [
		{
			"files": [
				"*.ts",
				"*.tsx",
				"*.js",
				"*.jsx"
			],
			"rules": {
				"@nx/enforce-module-boundaries": [
					"error",
					{
						"enforceBuildableLibDependency": true,
						"allow": [],
						"depConstraints": [
							{
								"sourceTag": "type:app",
								"onlyDependOnLibsWithTags": [
									"type:app",
									"type:step",
									"type:feature",
									"type:ui",
									"type:data-access",
									"type:util"
								]
							},
							{
								"sourceTag": "type:step",
								"onlyDependOnLibsWithTags": [
									"type:step",
									"type:feature",
									"type:ui",
									"type:util"
								]
							},
							{
								"sourceTag": "type:feature",
								"onlyDependOnLibsWithTags": [
									"type:feature",
									"type:ui",
									"type:util"
								]
							},
							{
								"sourceTag": "type:ui",
								"onlyDependOnLibsWithTags": [
									"type:ui",
									"type:data-access",
									"type:util"
								]
							},
							{
								"sourceTag": "type:data-access",
								"onlyDependOnLibsWithTags": [
									"type:data-access",
									"type:util"
								]
							},
							{
								"sourceTag": "type:util",
								"onlyDependOnLibsWithTags": [
									"type:util"
								]
							}
						]
					}
				]
			}
		},
		{
			"files": [
				"*.ts",
				"*.tsx"
			],
			"extends": [
				"plugin:@nx/typescript"
			],
			"rules": {}
		},
		{
			"files": [
				"*.js",
				"*.jsx"
			],
			"extends": [
				"plugin:@nx/javascript"
			],
			"rules": {}
		},
		{
			"files": [
				"*.spec.ts",
				"*.spec.tsx",
				"*.spec.js",
				"*.spec.jsx"
			],
			"env": {
				"jest": true
			},
			"rules": {}
		}
	]
}
