{
	"name": "util-types",
	"$schema": "../../node_modules/nx/schemas/project-schema.json",
	"sourceRoot": "libs/util-types/src",
	"projectType": "library",
	"targets": {
		"build": {
			"executor": "@nx/js:tsc",
			"outputs": [
				"{options.outputPath}"
			],
			"options": {
				"outputPath": "dist/libs/util-types",
				"main": "libs/util-types/src/index.ts",
				"tsConfig": "libs/util-types/tsconfig.lib.json",
				"assets": [
					"libs/util-types/*.md"
				]
			}
		},
		"lint": {
			"executor": "@nx/eslint:lint",
			"outputs": [
				"{options.outputFile}"
			],
			"options": {
				"lintFilePatterns": [
					"libs/util-types/**/*.ts",
					"libs/util-types/package.json"
				]
			}
		},
		"test": {
			"executor": "@nx/jest:jest",
			"outputs": [
				"{workspaceRoot}/coverage/{projectRoot}"
			],
			"options": {
				"jestConfig": "libs/util-types/jest.config.ts",
				"passWithNoTests": true
			},
			"configurations": {
				"ci": {
					"ci": true,
					"codeCoverage": true
				}
			}
		}
	},
	"tags": [
		"type:util"
	]
}
