{
	"identification": "dob",
	"contestsCapabilities": {
		"writeIns": false
	},
	"requestTimeout": {
		"authenticateVoter": 30000,
		"sendVote": 30000,
		"confirmVote": 15000
	},
	"header": {
		"logoPath": {
			"desktop": "post-logo.svg",
			"mobile": "post-logo.svg"
		},
		"logoHeight": {
			"desktop": 72,
			"mobile": 56
		},
		"background": "#fff"
	},
	"translatePlaceholders": {
		"en": {
			"logo_title": "Swiss Post",
			"voting_card_1": "card 1",
			"voting_card_2": "card 2",
			"voting_card_3": "card 3",
			"voting_card_4": "card 4",
			"voting_card_5": "card 5",
			"voting_card_6": "card 6",
			"support": "the [support team](mailto:en@support.ch)",
			"voting_card_remark_1": "There you can also obtain the voting materials for postal voting or voting at the ballot box.",
			"voting_card_remark_2": "You can obtain the voting materials for postal voting or voting at the ballot box from <a href=\"https://www.evoting.ch\" target=\"_blank\">your municipality</a>.",
			"voting_card_remark_3": "As long as you have not entered the confirmation code, you can cancel the electronic voting process and instead vote by mail or at the polling station. You can obtain the voting material for postal voting or voting at the polling station from <a href=\"https://www.evoting.ch\" target=\"_blank\">your municipality</a>."
		},
		"de": {
			"logo_title": "Die Post",
			"voting_card_1": "Stimmrechtsausweis",
			"voting_card_2": "dem Stimmrechtsausweis",
			"voting_card_3": "Dieser Stimmrechtsausweis",
			"voting_card_4": "der Stimmrechtsausweis",
			"voting_card_5": "Ihr Stimmrechtsausweis",
			"voting_card_6": "Karte 6",
			"support": "das [Supportteam](mailto:evoting@post.ch)",
			"voting_card_remark_1": "Dort erhalten Sie auch das Stimmmaterial für die Stimmabgabe per Brief oder an der Urne.",
			"voting_card_remark_2": "Das Stimmaterial für die Stimmabgabe per Brief oder an der Urne erhalten Sie bei <a href=\"https://www.evoting.ch\" target=\"_blank\">Ihrer Gemeinde</a>.",
			"voting_card_remark_3": "Solange Sie den Bestätigungscode noch nicht eingegeben haben, können Sie den Prozess der elektronischen Stimmabgabe abbrechen und stattdessen brieflich oder an der Urne abstimmen bzw. wählen. Das Stimmmaterial für die Stimmabgabe per Brief oder an der Urne erhalten Sie bei <a href=\"https://www.evoting.ch\" target=\"_blank\">Ihrer Gemeinde</a>."
		},
		"fr": {
			"logo_title": "La Poste",
			"voting_card_1": "carte de vote",
			"voting_card_2": "la carte de vote",
			"voting_card_3": "Cette carte de vote",
			"voting_card_4": "la carte de vote",
			"voting_card_5": "Votre carte de vote",
			"voting_card_6": "la",
			"support": "[l’équipe d’assistance](mailto:evoting@post.ch)",
			"voting_card_remark_1": "Là, vous pouvez également obtenir le matériel de vote pour le vote par correspondance ou dans l'urne.",
			"voting_card_remark_2": "Vous pouvez obtenir le matériel de vote pour le vote par correspondance ou dans l'urne auprès de <a href=\"https://www.evoting.ch\" target=\"_blank\">votre commune</a>.",
			"voting_card_remark_3": "Tant que vous n'avez pas saisi le code de confirmation, vous pouvez annuler le processus de vote électronique et choisir de voter par correspondance ou dans un bureau de vote. Vous pouvez obtenir le matériel de vote pour le vote par correspondance ou dans un bureau de vote auprès de <a href=\"https://www.evoting.ch\" target=\"_blank\">votre commune</a>."
		},
		"it": {
			"logo_title": "La Posta",
			"voting_card_1": "carta 1",
			"voting_card_2": "carta 2",
			"voting_card_3": "carta 3",
			"voting_card_4": "carta 4",
			"voting_card_5": "carta 5",
			"voting_card_6": "carta 6",
			"support": "[l’assistenza](mailto:evoting@post.ch)",
			"voting_card_remark_1": "Lì potete anche ottenere il materiale di voto per la votazione per corrispondenza o all'urna.",
			"voting_card_remark_2": "Potete ottenere il materiale di voto per la votazione per corrispondenza o all'urna presso <a href=\"https://www.evoting.ch\" target=\"_blank\">il vostro comune</a>.",
			"voting_card_remark_3": "Fintanto che non avete inserito il codice di conferma, potete annullare il processo di voto elettronico e invece votare per corrispondenza o al seggio elettorale. Il materiale di voto per la votazione per corrispondenza o al seggio elettorale può essere ottenuto presso <a href=\"https://www.evoting.ch\" target=\"_blank\">il vostro comune</a>."
		},
		"rm": {
			"logo_title": "La Posta",
			"voting_card_1": "**Karte 1",
			"voting_card_2": "**Karte 2",
			"voting_card_3": "**Karte 3",
			"voting_card_4": "**Karte 4",
			"voting_card_5": "**Karte 5",
			"voting_card_6": "**Karte 6",
			"support": "il [team da support](mailto:evoting@post.ch)",
			"voting_card_remark_1": "Là pudais Vus era retrair il material da votaziun per la votaziun per corrispundenza u a l'urna.",
			"voting_card_remark_2": "Vus pudais retrair il material da votaziun per la votaziun per corrispundenza u a l'urna tar <a href=\"https://www.evoting.ch\" target=\"_blank\">Vossa vischnanca</a>.",
			"voting_card_remark_3": "Dumogn che vus n'avais betg ancunterà il code da confermaziun, pudais vus interrumper il process da votaziun electronic e votar empè per posta o a l'urna. Il material da votaziun per la votaziun per posta o a l'urna pudais retrer tar <a href=\"https://www.evoting.ch\" target=\"_blank\">vossa vischnanca</a>."
		}
	},
	"additionalLegalTerms": {
		"de": {
			"stepper": "Erläuterungen und gesetzliche Bestimmungen",
			"mainTitle": "Erläuterungen und gesetzliche Bestimmungen",
			"sections": [
				{
					"sectionTitle": "Teilnahme an der elektronischen Stimmabgabe",
					"terms": [
						"Mit der elektronischen Abgabe Ihrer Stimme nehmen Sie am Urnengang teil, wie wenn Sie Ihre Stimme brieflich oder persönlich abgeben."
					],
					"confirm": "Ich gebe meine Stimme elektronisch ab."
				},
				{
					"sectionTitle": "Abstimmungsvorlagen und Erläuterungen des Bundesrates",
					"terms": [
						"Die Erläuterungen des Bundesrates zu den eidgenössischen Abstimmungsvorlagen ([Art. 11 Abs. 2 des Bundesgesetztes über die politischen Rechte, BPR: SR 161.1](https://www.your-website.com)) sowie zu den kantonalen, regionalen und kommunalen Vorlagen werden elektronisch bereitgestellt.",
						"**[Zu den Abstimmungsvorlagen und Erläuterungen](https://www.your-website.com)**."
					],
					"confirm": "Ja, ich habe die Strafbestimmungen und die Erläuterungen zur Kenntnis genommen."
				}
			]
		},
		"fr": {
			"stepper": "Explications et réglementations légales",
			"mainTitle": "Explications et réglementations légales",
			"sections": [
				{
					"sectionTitle": "Explications du Conseil fédéral",
					"terms": [
						"Les explications du Conseil fédéral sur les propositions de vote fédérales ([art. 11, alinéa 2, de la loi fédérale sur les droits politiques, RPB : RS 161.1](https://www.your-website.com)) ainsi que sur les propositions cantonales, les modèles régionaux et municipaux sont fournis par voie électronique.",
						"**[Vers les modèles de vote et explications](https://www.your-website.com)**."
					],
					"confirm": "Oui, j'ai pris connaissance des dispositions pénales et des explications."
				}
			]
		}
	},
	"additionalFAQs": {
		"de": [
			{
				"title": "DE FAQ Title 1",
				"content": [
					"For example, you can write **bold** or *italic*.",
					"And add a second paragraph with a [link](https://www.your-website.com).",
					"- Bullet 1. \n - Bullet 2."
				]
			},
			{
				"title": "DE FAQ Title 2",
				"content": [
					"For example, you can write **bold** or *italic*.",
					"And add a second paragraph with a [link](https://www.your-website.com)."
				]
			}
		],
		"fr": [
			{
				"title": "FR FAQ Title 1",
				"content": [
					"For example, you can write **bold** or *italic*.",
					"And add a second paragraph with a [link](https://www.your-website.com)."
				]
			}
		],
		"it": [
			{
				"title": "IT FAQ Title 1",
				"content": [
					"For example, you can write **bold** or *italic*.",
					"And add a second paragraph with a [link](https://www.your-website.com)"
				]
			}
		],
		"rm": [
			{
				"title": "RM FAQ Title 1",
				"content": [
					"For example, you can write **bold** or *italic*.",
					"And add a second paragraph with a [link](https://www.your-website.com)"
				]
			}
		]
	}
}