{
	"name": "tally-process-day3",
	"$schema": "../../../node_modules/nx/schemas/project-schema.json",
	"sourceRoot": "libs/tally/process-day3/src",
	"prefix": "sdm",
	"tags": [
		"scope:tally",
		"type:process"
	],
	"projectType": "library",
	"targets": {
		"test": {
			"executor": "@nx/jest:jest",
			"outputs": [
				"{workspaceRoot}/coverage/{projectRoot}"
			],
			"options": {
				"jestConfig": "libs/tally/process-day3/jest.config.ts"
			}
		},
		"lint": {
			"executor": "@nx/eslint:lint",
			"outputs": [
				"{options.outputFile}"
			]
		}
	}
}
