{
	"name": "shared-feature-passwords",
	"$schema": "../../../node_modules/nx/schemas/project-schema.json",
	"sourceRoot": "libs/shared/feature-passwords/src",
	"prefix": "sdm",
	"tags": [
		"scope:shared",
		"type:feature"
	],
	"projectType": "library",
	"targets": {
		"test": {
			"executor": "@nx/jest:jest",
			"outputs": [
				"{workspaceRoot}/coverage/{projectRoot}"
			],
			"options": {
				"jestConfig": "libs/shared/feature-passwords/jest.config.ts"
			}
		},
		"lint": {
			"executor": "@nx/eslint:lint",
			"outputs": [
				"{options.outputFile}"
			]
		}
	}
}
