{
	"name": "feature-question",
	"$schema": "../../node_modules/nx/schemas/project-schema.json",
	"sourceRoot": "libs/feature-question/src",
	"prefix": "vp",
	"tags": [
		"type:feature"
	],
	"projectType": "library",
	"targets": {
		"test": {
			"executor": "@nx/jest:jest",
			"outputs": [
				"{workspaceRoot}/coverage/{projectRoot}"
			],
			"options": {
				"jestConfig": "libs/feature-question/jest.config.ts",
				"passWithNoTests": true
			},
			"configurations": {
				"ci": {
					"ci": true,
					"codeCoverage": true
				}
			}
		},
		"lint": {
			"executor": "@nx/eslint:lint",
			"outputs": [
				"{options.outputFile}"
			],
			"options": {
				"lintFilePatterns": [
					"libs/feature-question/**/*.ts",
					"libs/feature-question/**/*.html"
				]
			}
		}
	}
}
