@startsalt Search-Widget
{^ Search Widget
    City | ^Dont Care^
    Rent | ^Less Than^| $ |"200 "
    Postcode |^Is^ |"SW10   "
    Bedrooms | ^Between^ |"1"|and|"3"
    Type | ^Flat^
    Street | ^Is^ |"unknown "
    Area | ^Any of^ | {+
        [-] |"Hammersmith Green"
        [-] |"Waterloo"
        [+]
    }|*

    [Search] | [Reset]

}
@endsalt