<?xml version="1.0" encoding="UTF-8" standalone="no"?><svg xmlns="http://www.w3.org/2000/svg" xmlns:xlink="http://www.w3.org/1999/xlink" contentScriptType="application/ecmascript" contentStyleType="text/css" height="173px" preserveAspectRatio="none" style="width:192px;height:173px;" version="1.1" viewBox="0 0 192 173" width="192px" zoomAndPan="magnify"><defs/><g><rect fill="#EEEEEE" height="19.0938" rx="5" ry="5" style="stroke:#000000;stroke-width:2.5;" width="12" x="8.5" y="8.5"/><text fill="#000000" font-family="sans-serif" font-size="12" lengthAdjust="spacing" textLength="4" x="12.5" y="22.957">-</text><text fill="#000000" font-family="sans-serif" font-size="12" lengthAdjust="spacing" textLength="20" x="7" y="60.6445">City</text><text fill="#000000" font-family="sans-serif" font-size="12" lengthAdjust="spacing" textLength="42" x="67" y="60.6445">London</text><text fill="#000000" font-family="sans-serif" font-size="12" lengthAdjust="spacing" textLength="36" x="7" y="77.7383">Rent $</text><text fill="#000000" font-family="sans-serif" font-size="12" lengthAdjust="spacing" textLength="21" x="67" y="77.7383">200</text><text fill="#000000" font-family="sans-serif" font-size="12" lengthAdjust="spacing" textLength="52" x="7" y="94.832">Postcode</text><text fill="#000000" font-family="sans-serif" font-size="12" lengthAdjust="spacing" textLength="27" x="67" y="94.832">WC1</text><text fill="#000000" font-family="sans-serif" font-size="12" lengthAdjust="spacing" textLength="58" x="7" y="111.9258">Bedrooms</text><text fill="#000000" font-family="sans-serif" font-size="12" lengthAdjust="spacing" textLength="7" x="67" y="111.9258">2</text><text fill="#000000" font-family="sans-serif" font-size="12" lengthAdjust="spacing" textLength="37" x="7" y="129.0195">House</text><text fill="#000000" font-family="sans-serif" font-size="12" lengthAdjust="spacing" textLength="32" x="7" y="146.1133">Street</text><text fill="#000000" font-family="sans-serif" font-size="12" lengthAdjust="spacing" textLength="79" x="67" y="146.1133">Bogus Rd 153</text><text fill="#000000" font-family="sans-serif" font-size="12" lengthAdjust="spacing" textLength="25" x="7" y="163.207">Area</text><text fill="#000000" font-family="sans-serif" font-size="12" lengthAdjust="spacing" textLength="117" x="67" y="163.207">Hammersmith Green</text><line style="stroke:#000000;stroke-width:1.0;" x1="6" x2="66" y1="39.6406" y2="39.6406"/><line style="stroke:#000000;stroke-width:1.0;" x1="66" x2="185" y1="39.6406" y2="39.6406"/><line style="stroke:#000000;stroke-width:1.0;" x1="6" x2="66" y1="166.8438" y2="166.8438"/><line style="stroke:#000000;stroke-width:1.0;" x1="66" x2="185" y1="166.8438" y2="166.8438"/><line style="stroke:#000000;stroke-width:1.0;" x1="6" x2="6" y1="39.6406" y2="64.2813"/><line style="stroke:#000000;stroke-width:1.0;" x1="185" x2="185" y1="81.375" y2="98.4688"/><line style="stroke:#000000;stroke-width:1.0;" x1="185" x2="185" y1="39.6406" y2="64.2813"/><line style="stroke:#000000;stroke-width:1.0;" x1="6" x2="6" y1="132.6563" y2="149.75"/><line style="stroke:#000000;stroke-width:1.0;" x1="6" x2="6" y1="98.4688" y2="115.5625"/><line style="stroke:#000000;stroke-width:1.0;" x1="185" x2="185" y1="132.6563" y2="149.75"/><line style="stroke:#000000;stroke-width:1.0;" x1="6" x2="6" y1="64.2813" y2="81.375"/><line style="stroke:#000000;stroke-width:1.0;" x1="185" x2="185" y1="98.4688" y2="115.5625"/><line style="stroke:#000000;stroke-width:1.0;" x1="185" x2="185" y1="64.2813" y2="81.375"/><line style="stroke:#000000;stroke-width:1.0;" x1="6" x2="6" y1="149.75" y2="166.8438"/><line style="stroke:#000000;stroke-width:1.0;" x1="6" x2="6" y1="115.5625" y2="132.6563"/><line style="stroke:#000000;stroke-width:1.0;" x1="185" x2="185" y1="149.75" y2="166.8438"/><line style="stroke:#000000;stroke-width:1.0;" x1="6" x2="6" y1="81.375" y2="98.4688"/><line style="stroke:#000000;stroke-width:1.0;" x1="185" x2="185" y1="115.5625" y2="132.6563"/><rect fill="#FFFFFF" height="15.0938" style="stroke:#FFFFFF;stroke-width:1.0;" width="80" x="12" y="32.0938"/><text fill="#000000" font-family="sans-serif" font-size="12" lengthAdjust="spacing" textLength="80" x="12" y="44.5508">Details Widget</text><!--MD5=[1e3dfa73eb5269c85582ab1868bfa2c6]
@startsalt Details-Widget
{[-]
{^Details Widget
    City | London
    Rent $ |200
    Postcode | WC1
    Bedrooms | 2
    House
    Street | Bogus Rd 153
    Area | Hammersmith Green
}}
@endsalt

PlantUML version 1.2021.4(Sun Apr 04 04:49:39 EDT 2021)
(GPL source distribution)
Java Runtime: OpenJDK Runtime Environment
JVM: OpenJDK 64-Bit Server VM
Default Encoding: Cp1252
Language: en
Country: US
--></g></svg>