<?xml version="1.0" encoding="UTF-8" standalone="no"?><svg xmlns="http://www.w3.org/2000/svg" xmlns:xlink="http://www.w3.org/1999/xlink" contentScriptType="application/ecmascript" contentStyleType="text/css" height="427px" preserveAspectRatio="none" style="width:312px;height:427px;" version="1.1" viewBox="0 0 312 427" width="312px" zoomAndPan="magnify"><defs><filter height="300%" id="fgz2i4ra6khv9" width="300%" x="-1" y="-1"><feGaussianBlur result="blurOut" stdDeviation="2.0"/><feColorMatrix in="blurOut" result="blurOut2" type="matrix" values="0 0 0 0 0 0 0 0 0 0 0 0 0 0 0 0 0 0 .4 0"/><feOffset dx="4.0" dy="4.0" in="blurOut2" result="blurOut3"/><feBlend in="SourceGraphic" in2="blurOut3" mode="normal"/></filter></defs><g><!--MD5=[975d7fda8cf98ff1a26ca528bf10cecf]
cluster App--><polygon fill="#FFFFFF" filter="url(#fgz2i4ra6khv9)" points="16,16,26,6,295,6,295,176,285,186,16,186,16,16" style="stroke:#000000;stroke-width:1.5;"/><line style="stroke:#000000;stroke-width:1.5;" x1="285" x2="295" y1="16" y2="6"/><line style="stroke:#000000;stroke-width:1.5;" x1="16" x2="285" y1="16" y2="16"/><line style="stroke:#000000;stroke-width:1.5;" x1="285" x2="285" y1="16" y2="186"/><text fill="#000000" font-family="sans-serif" font-size="14" font-weight="bold" lengthAdjust="spacing" textLength="27" x="138" y="33.5332">App</text><!--MD5=[3b20cb9868f2b7a63ea58feb6c8ce185]
cluster API Server--><rect fill="#FFFFFF" filter="url(#fgz2i4ra6khv9)" height="107" style="stroke:#000000;stroke-width:1.5;" width="102" x="169" y="55"/><rect fill="#FFFFFF" height="10" style="stroke:#000000;stroke-width:1.5;" width="15" x="251" y="60"/><rect fill="#FFFFFF" height="2" style="stroke:#000000;stroke-width:1.5;" width="4" x="249" y="62"/><rect fill="#FFFFFF" height="2" style="stroke:#000000;stroke-width:1.5;" width="4" x="249" y="66"/><text fill="#000000" font-family="sans-serif" font-size="14" font-weight="bold" lengthAdjust="spacing" textLength="74" x="183" y="82.5332">API Server</text><!--MD5=[e169ac431914a6adb8cf110c9da1459f]
cluster DB--><polygon fill="#FFFFFF" filter="url(#fgz2i4ra6khv9)" points="51,220,61,210,268,210,268,410,258,420,51,420,51,220" style="stroke:#000000;stroke-width:1.5;"/><line style="stroke:#000000;stroke-width:1.5;" x1="258" x2="268" y1="220" y2="210"/><line style="stroke:#000000;stroke-width:1.5;" x1="51" x2="258" y1="220" y2="220"/><line style="stroke:#000000;stroke-width:1.5;" x1="258" x2="258" y1="220" y2="420"/><text fill="#000000" font-family="sans-serif" font-size="14" font-weight="bold" lengthAdjust="spacing" textLength="20" x="145.5" y="237.5332">DB</text><!--MD5=[5358f19665500acb1e5b193c6bff82da]
cluster MongoDB--><path d="M83,277 C83,267 159.5,267 159.5,267 C159.5,267 236,267 236,277 L236,378 C236,388 159.5,388 159.5,388 C159.5,388 83,388 83,378 L83,277 " fill="#FFFFFF" filter="url(#fgz2i4ra6khv9)" style="stroke:#000000;stroke-width:1.5;"/><path d="M83,277 C83,287 159.5,287 159.5,287 C159.5,287 236,287 236,277 " fill="none" style="stroke:#000000;stroke-width:1.5;"/><text fill="#000000" font-family="sans-serif" font-size="14" font-weight="bold" lengthAdjust="spacing" textLength="69" x="125" y="303.5332">MongoDB</text><!--MD5=[118f42602524ad482f02b27ef22fc383]
entity D--><rect fill="#FEFECE" filter="url(#fgz2i4ra6khv9)" height="47.6094" style="stroke:#A80036;stroke-width:1.5;" width="118" x="32" y="94.5"/><rect fill="#FEFECE" height="10" style="stroke:#A80036;stroke-width:1.5;" width="15" x="130" y="99.5"/><rect fill="#FEFECE" height="2" style="stroke:#A80036;stroke-width:1.5;" width="4" x="128" y="101.5"/><rect fill="#FEFECE" height="2" style="stroke:#A80036;stroke-width:1.5;" width="4" x="128" y="105.5"/><text fill="#000000" font-family="sans-serif" font-size="14" lengthAdjust="spacing" textLength="78" x="47" y="129.0332">DB Interface</text><!--MD5=[fd9c43008b2f44f487ec681f2a69a4b7]
entity NodeJS\nExpress--><text fill="#000000" font-family="sans-serif" font-size="14" lengthAdjust="spacing" textLength="48" x="195" y="115.5332">NodeJS</text><text fill="#000000" font-family="sans-serif" font-size="14" lengthAdjust="spacing" textLength="50" x="195" y="133.1426">Express</text><!--MD5=[1bae5ee47b1409b96449c4de5083f081]
entity Properties--><text fill="#000000" font-family="sans-serif" font-size="14" lengthAdjust="spacing" textLength="65" x="136.5" y="350.5332">Properties</text><!--MD5=[8956e2c6d86a41e7a6fbcf914969fe4a]
link D to MongoDB--><path d="M91,142.68 C91,170.91 91,220.12 91,262.82 C91,264.1544 91,265.4824 91,266.8032 " fill="none" id="D-to-MongoDB" style="stroke:#A80036;stroke-width:1.0;"/><polygon fill="#A80036" points="91,266.8032,95,257.8032,91,261.8032,87,257.8032,91,266.8032" style="stroke:#A80036;stroke-width:1.0;"/><!--MD5=[828a4f2977fc06108139571e404f001d]
@startuml SWComp
node App{
    component "API Server"{
        label "NodeJS\nExpress"
    }
    component "DB Interface" as D
}
node DB{
    database MongoDB{
        label Properties
    }
}
D- ->MongoDB
@enduml

PlantUML version 1.2021.4(Sun Apr 04 04:49:39 EDT 2021)
(GPL source distribution)
Java Runtime: OpenJDK Runtime Environment
JVM: OpenJDK 64-Bit Server VM
Default Encoding: Cp1252
Language: en
Country: US
--></g></svg>