@startuml DreamHome-Classes
class DB{
    +Query(DBStatement query,string... args):ResultSet
    +Query(string query,string... args):ResultSet
    +Compile(string query):DBStatement
}
note top of DB: DBStatement and ResultSet are\nprovided by the database package

class SearchPreparer <<Singleton>>{
    +Prepare(SearchMessage):Search
    -Map<SearchSpec,DBStatement> stmts
    -Collect()
    -int compiles
}
class SearchSpec{
    -Predicate[] preds`
    -string[] keys
    -int[] cnts
    +Equals(SearchSpec other):bool
    +int lives
}
note bottom of SearchSpec: lives is for collection of old statements
class Search{
    +Execute():SearchResults
    -DBStatement s
    -List<string> args
}
note bottom of Search: Types are included from\nthe protocol spec file
@enduml