{
  "https://opensource-demo.orangehrmlive.com/web/index.php/auth/login" : {
    "transaction" : "https://opensource-demo.orangehrmlive.com/web/index.php/auth/login",
    "sampleCount" : 3,
    "errorCount" : 0,
    "errorPct" : 0.0,
    "meanResTime" : 5468.0,
    "medianResTime" : 5411.0,
    "minResTime" : 5202.0,
    "maxResTime" : 5791.0,
    "pct1ResTime" : 5791.0,
    "pct2ResTime" : 5791.0,
    "pct3ResTime" : 5791.0,
    "throughput" : 0.5180452426178552,
    "receivedKBytesPerSec" : 2181.1011631734586,
    "sentKBytesPerSec" : 1.7615561863236056
  },
  "https://opensource-demo.orangehrmlive.com/web/index.php/auth/login-5" : {
    "transaction" : "https://opensource-demo.orangehrmlive.com/web/index.php/auth/login-5",
    "sampleCount" : 3,
    "errorCount" : 0,
    "errorPct" : 0.0,
    "meanResTime" : 3495.0,
    "medianResTime" : 3608.0,
    "minResTime" : 3191.0,
    "maxResTime" : 3686.0,
    "pct1ResTime" : 3686.0,
    "pct2ResTime" : 3686.0,
    "pct3ResTime" : 3686.0,
    "throughput" : 0.813890396093326,
    "receivedKBytesPerSec" : 1196.8703370862725,
    "sentKBytesPerSec" : 0.4657614962018448
  },
  "https://opensource-demo.orangehrmlive.com/web/index.php/auth/login-4" : {
    "transaction" : "https://opensource-demo.orangehrmlive.com/web/index.php/auth/login-4",
    "sampleCount" : 3,
    "errorCount" : 0,
    "errorPct" : 0.0,
    "meanResTime" : 3655.0,
    "medianResTime" : 3799.0,
    "minResTime" : 3360.0,
    "maxResTime" : 3806.0,
    "pct1ResTime" : 3806.0,
    "pct2ResTime" : 3806.0,
    "pct3ResTime" : 3806.0,
    "throughput" : 0.7836990595611285,
    "receivedKBytesPerSec" : 1201.5660205231193,
    "sentKBytesPerSec" : 0.4561373432601881
  },
  "https://opensource-demo.orangehrmlive.com/web/index.php/auth/logout" : {
    "transaction" : "https://opensource-demo.orangehrmlive.com/web/index.php/auth/logout",
    "sampleCount" : 3,
    "errorCount" : 0,
    "errorPct" : 0.0,
    "meanResTime" : 942.3333333333334,
    "medianResTime" : 929.0,
    "minResTime" : 847.0,
    "maxResTime" : 1051.0,
    "pct1ResTime" : 1051.0,
    "pct2ResTime" : 1051.0,
    "pct3ResTime" : 1051.0,
    "throughput" : 0.10835801488116738,
    "receivedKBytesPerSec" : 1.1578293745033592,
    "sentKBytesPerSec" : 0.48179105640034675
  },
  "https://opensource-demo.orangehrmlive.com/web/index.php/auth/login-1" : {
    "transaction" : "https://opensource-demo.orangehrmlive.com/web/index.php/auth/login-1",
    "sampleCount" : 3,
    "errorCount" : 0,
    "errorPct" : 0.0,
    "meanResTime" : 203.0,
    "medianResTime" : 206.0,
    "minResTime" : 196.0,
    "maxResTime" : 207.0,
    "pct1ResTime" : 207.0,
    "pct2ResTime" : 207.0,
    "pct3ResTime" : 207.0,
    "throughput" : 14.084507042253522,
    "receivedKBytesPerSec" : 23.02486795774648,
    "sentKBytesPerSec" : 8.087588028169014
  },
  "https://opensource-demo.orangehrmlive.com/web/index.php/auth/login-0" : {
    "transaction" : "https://opensource-demo.orangehrmlive.com/web/index.php/auth/login-0",
    "sampleCount" : 3,
    "errorCount" : 0,
    "errorPct" : 0.0,
    "meanResTime" : 1592.6666666666667,
    "medianResTime" : 1617.0,
    "minResTime" : 1292.0,
    "maxResTime" : 1869.0,
    "pct1ResTime" : 1869.0,
    "pct2ResTime" : 1869.0,
    "pct3ResTime" : 1869.0,
    "throughput" : 1.6,
    "receivedKBytesPerSec" : 6.889583333333333,
    "sentKBytesPerSec" : 0.821875
  },
  "https://opensource-demo.orangehrmlive.com/web/index.php/auth/validate-0" : {
    "transaction" : "https://opensource-demo.orangehrmlive.com/web/index.php/auth/validate-0",
    "sampleCount" : 3,
    "errorCount" : 0,
    "errorPct" : 0.0,
    "meanResTime" : 389.3333333333333,
    "medianResTime" : 368.0,
    "minResTime" : 315.0,
    "maxResTime" : 485.0,
    "pct1ResTime" : 485.0,
    "pct2ResTime" : 485.0,
    "pct3ResTime" : 485.0,
    "throughput" : 0.2025384823116392,
    "receivedKBytesPerSec" : 0.3281360763232514,
    "sentKBytesPerSec" : 0.16080447863219013
  },
  "https://opensource-demo.orangehrmlive.com/web/index.php/auth/login-3" : {
    "transaction" : "https://opensource-demo.orangehrmlive.com/web/index.php/auth/login-3",
    "sampleCount" : 3,
    "errorCount" : 0,
    "errorPct" : 0.0,
    "meanResTime" : 2317.0,
    "medianResTime" : 2357.0,
    "minResTime" : 2167.0,
    "maxResTime" : 2427.0,
    "pct1ResTime" : 2427.0,
    "pct2ResTime" : 2427.0,
    "pct3ResTime" : 2427.0,
    "throughput" : 1.2360939431396785,
    "receivedKBytesPerSec" : 804.6066227595797,
    "sentKBytesPerSec" : 0.7097883189122374
  },
  "https://opensource-demo.orangehrmlive.com/web/index.php/auth/validate-1" : {
    "transaction" : "https://opensource-demo.orangehrmlive.com/web/index.php/auth/validate-1",
    "sampleCount" : 3,
    "errorCount" : 0,
    "errorPct" : 0.0,
    "meanResTime" : 364.0,
    "medianResTime" : 353.0,
    "minResTime" : 329.0,
    "maxResTime" : 410.0,
    "pct1ResTime" : 410.0,
    "pct2ResTime" : 410.0,
    "pct3ResTime" : 410.0,
    "throughput" : 0.2020338069903697,
    "receivedKBytesPerSec" : 0.8762032586369453,
    "sentKBytesPerSec" : 0.12370624705367364
  },
  "https://opensource-demo.orangehrmlive.com/web/index.php/auth/login-2" : {
    "transaction" : "https://opensource-demo.orangehrmlive.com/web/index.php/auth/login-2",
    "sampleCount" : 3,
    "errorCount" : 0,
    "errorPct" : 0.0,
    "meanResTime" : 2192.6666666666665,
    "medianResTime" : 2199.0,
    "minResTime" : 2014.0,
    "maxResTime" : 2365.0,
    "pct1ResTime" : 2365.0,
    "pct2ResTime" : 2365.0,
    "pct3ResTime" : 2365.0,
    "throughput" : 1.2647554806070826,
    "receivedKBytesPerSec" : 695.149876818086,
    "sentKBytesPerSec" : 0.7385974388701518
  },
  "https://opensource-demo.orangehrmlive.com/web/index.php/auth/validate-2" : {
    "transaction" : "https://opensource-demo.orangehrmlive.com/web/index.php/auth/validate-2",
    "sampleCount" : 3,
    "errorCount" : 0,
    "errorPct" : 0.0,
    "meanResTime" : 244.33333333333334,
    "medianResTime" : 237.0,
    "minResTime" : 191.0,
    "maxResTime" : 305.0,
    "pct1ResTime" : 305.0,
    "pct2ResTime" : 305.0,
    "pct3ResTime" : 305.0,
    "throughput" : 0.2039151712887439,
    "receivedKBytesPerSec" : 0.19734368627650897,
    "sentKBytesPerSec" : 0.14397526254078305
  },
  "https://opensource-demo.orangehrmlive.com/web/index.php/api/v2/dashboard/employees/subunit" : {
    "transaction" : "https://opensource-demo.orangehrmlive.com/web/index.php/api/v2/dashboard/employees/subunit",
    "sampleCount" : 3,
    "errorCount" : 3,
    "errorPct" : 100.0,
    "meanResTime" : 383.3333333333333,
    "medianResTime" : 380.0,
    "minResTime" : 310.0,
    "maxResTime" : 460.0,
    "pct1ResTime" : 460.0,
    "pct2ResTime" : 460.0,
    "pct3ResTime" : 460.0,
    "throughput" : 0.20096463022508038,
    "receivedKBytesPerSec" : 0.06437148311897106,
    "sentKBytesPerSec" : 0.10440740554662378
  },
  "https://opensource-demo.orangehrmlive.com/web/index.php/auth/validate" : {
    "transaction" : "https://opensource-demo.orangehrmlive.com/web/index.php/auth/validate",
    "sampleCount" : 3,
    "errorCount" : 0,
    "errorPct" : 0.0,
    "meanResTime" : 1002.0,
    "medianResTime" : 1033.0,
    "minResTime" : 886.0,
    "maxResTime" : 1087.0,
    "pct1ResTime" : 1087.0,
    "pct2ResTime" : 1087.0,
    "pct3ResTime" : 1087.0,
    "throughput" : 0.1953125,
    "receivedKBytesPerSec" : 2.1104812622070312,
    "sentKBytesPerSec" : 0.9691238403320312
  },
  "https://opensource-demo.orangehrmlive.com/web/index.php/auth/validate-3" : {
    "transaction" : "https://opensource-demo.orangehrmlive.com/web/index.php/auth/validate-3",
    "sampleCount" : 3,
    "errorCount" : 0,
    "errorPct" : 0.0,
    "meanResTime" : 209.33333333333334,
    "medianResTime" : 200.0,
    "minResTime" : 191.0,
    "maxResTime" : 237.0,
    "pct1ResTime" : 237.0,
    "pct2ResTime" : 237.0,
    "pct3ResTime" : 237.0,
    "throughput" : 0.2039151712887439,
    "receivedKBytesPerSec" : 0.1977419580954323,
    "sentKBytesPerSec" : 0.146364893454323
  },
  "https://opensource-demo.orangehrmlive.com/web/index.php/auth/validate-4" : {
    "transaction" : "https://opensource-demo.orangehrmlive.com/web/index.php/auth/validate-4",
    "sampleCount" : 3,
    "errorCount" : 0,
    "errorPct" : 0.0,
    "meanResTime" : 242.33333333333334,
    "medianResTime" : 238.0,
    "minResTime" : 184.0,
    "maxResTime" : 305.0,
    "pct1ResTime" : 305.0,
    "pct2ResTime" : 305.0,
    "pct3ResTime" : 305.0,
    "throughput" : 0.20401224073444407,
    "receivedKBytesPerSec" : 0.1978360889153349,
    "sentKBytesPerSec" : 0.14444226028561713
  },
  "https://opensource-demo.orangehrmlive.com/web/index.php/auth/validate-5" : {
    "transaction" : "https://opensource-demo.orangehrmlive.com/web/index.php/auth/validate-5",
    "sampleCount" : 3,
    "errorCount" : 0,
    "errorPct" : 0.0,
    "meanResTime" : 205.0,
    "medianResTime" : 200.0,
    "minResTime" : 177.0,
    "maxResTime" : 238.0,
    "pct1ResTime" : 238.0,
    "pct2ResTime" : 238.0,
    "pct3ResTime" : 238.0,
    "throughput" : 0.20410940263981495,
    "receivedKBytesPerSec" : 0.1981296349843516,
    "sentKBytesPerSec" : 0.1463049819703361
  },
  "https://opensource-demo.orangehrmlive.com/web/index.php/auth/validate-6" : {
    "transaction" : "https://opensource-demo.orangehrmlive.com/web/index.php/auth/validate-6",
    "sampleCount" : 3,
    "errorCount" : 0,
    "errorPct" : 0.0,
    "meanResTime" : 200.66666666666666,
    "medianResTime" : 199.0,
    "minResTime" : 166.0,
    "maxResTime" : 237.0,
    "pct1ResTime" : 237.0,
    "pct2ResTime" : 237.0,
    "pct3ResTime" : 237.0,
    "throughput" : 0.20426227275822156,
    "receivedKBytesPerSec" : 0.19827802648600804,
    "sentKBytesPerSec" : 0.14441981003608634
  },
  "https://opensource-demo.orangehrmlive.com/web/index.php/api/v2/buzz/feed?limit=5&offset=0&sortOrder=DESC&sortField=share.createdAtUtc" : {
    "transaction" : "https://opensource-demo.orangehrmlive.com/web/index.php/api/v2/buzz/feed?limit=5&offset=0&sortOrder=DESC&sortField=share.createdAtUtc",
    "sampleCount" : 3,
    "errorCount" : 3,
    "errorPct" : 100.0,
    "meanResTime" : 440.3333333333333,
    "medianResTime" : 409.0,
    "minResTime" : 395.0,
    "maxResTime" : 517.0,
    "pct1ResTime" : 517.0,
    "pct2ResTime" : 517.0,
    "pct3ResTime" : 517.0,
    "throughput" : 0.19964064683569574,
    "receivedKBytesPerSec" : 0.0639473946895588,
    "sentKBytesPerSec" : 0.10001528498702336
  },
  "https://opensource-demo.orangehrmlive.com/web/index.php/core/i18n/messages" : {
    "transaction" : "https://opensource-demo.orangehrmlive.com/web/index.php/core/i18n/messages",
    "sampleCount" : 9,
    "errorCount" : 9,
    "errorPct" : 100.0,
    "meanResTime" : 329.6666666666667,
    "medianResTime" : 325.0,
    "minResTime" : 307.0,
    "maxResTime" : 398.0,
    "pct1ResTime" : 398.0,
    "pct2ResTime" : 398.0,
    "pct3ResTime" : 398.0,
    "throughput" : 0.22061527147934798,
    "receivedKBytesPerSec" : 0.22664772030886138,
    "sentKBytesPerSec" : 0.11440108315970093
  },
  "Test" : {
    "transaction" : "Test",
    "sampleCount" : 3,
    "errorCount" : 3,
    "errorPct" : 100.0,
    "meanResTime" : 12201.666666666666,
    "medianResTime" : 11698.0,
    "minResTime" : 11640.0,
    "maxResTime" : 13267.0,
    "pct1ResTime" : 13267.0,
    "pct2ResTime" : 13267.0,
    "pct3ResTime" : 13267.0,
    "throughput" : 0.22612497173437854,
    "receivedKBytesPerSec" : 960.520950125311,
    "sentKBytesPerSec" : 4.878248779867341
  },
  "https://opensource-demo.orangehrmlive.com/web/index.php/api/v2/dashboard/employees/locations" : {
    "transaction" : "https://opensource-demo.orangehrmlive.com/web/index.php/api/v2/dashboard/employees/locations",
    "sampleCount" : 3,
    "errorCount" : 3,
    "errorPct" : 100.0,
    "meanResTime" : 453.6666666666667,
    "medianResTime" : 320.0,
    "minResTime" : 307.0,
    "maxResTime" : 734.0,
    "pct1ResTime" : 734.0,
    "pct2ResTime" : 734.0,
    "pct3ResTime" : 734.0,
    "throughput" : 0.20178919755162442,
    "receivedKBytesPerSec" : 0.06463560234075469,
    "sentKBytesPerSec" : 0.10522991356696038
  },
  "https://opensource-demo.orangehrmlive.com/web/index.php/events/push" : {
    "transaction" : "https://opensource-demo.orangehrmlive.com/web/index.php/events/push",
    "sampleCount" : 3,
    "errorCount" : 0,
    "errorPct" : 0.0,
    "meanResTime" : 1133.3333333333333,
    "medianResTime" : 1168.0,
    "minResTime" : 901.0,
    "maxResTime" : 1331.0,
    "pct1ResTime" : 1331.0,
    "pct2ResTime" : 1331.0,
    "pct3ResTime" : 1331.0,
    "throughput" : 0.19401151134967343,
    "receivedKBytesPerSec" : 2.0713507647287073,
    "sentKBytesPerSec" : 0.6809349333893812
  },
  "https://opensource-demo.orangehrmlive.com/web/index.php/events/push-5" : {
    "transaction" : "https://opensource-demo.orangehrmlive.com/web/index.php/events/push-5",
    "sampleCount" : 3,
    "errorCount" : 0,
    "errorPct" : 0.0,
    "meanResTime" : 207.33333333333334,
    "medianResTime" : 201.0,
    "minResTime" : 183.0,
    "maxResTime" : 238.0,
    "pct1ResTime" : 238.0,
    "pct2ResTime" : 238.0,
    "pct3ResTime" : 238.0,
    "throughput" : 0.20569077819677753,
    "receivedKBytesPerSec" : 0.19966468117929378,
    "sentKBytesPerSec" : 0.10766626671237572
  },
  "https://opensource-demo.orangehrmlive.com/web/index.php/events/push-4" : {
    "transaction" : "https://opensource-demo.orangehrmlive.com/web/index.php/events/push-4",
    "sampleCount" : 3,
    "errorCount" : 0,
    "errorPct" : 0.0,
    "meanResTime" : 242.66666666666666,
    "medianResTime" : 237.0,
    "minResTime" : 201.0,
    "maxResTime" : 290.0,
    "pct1ResTime" : 290.0,
    "pct2ResTime" : 290.0,
    "pct3ResTime" : 290.0,
    "throughput" : 0.2057048820625343,
    "receivedKBytesPerSec" : 0.19947748817196928,
    "sentKBytesPerSec" : 0.10586569613960504
  },
  "https://opensource-demo.orangehrmlive.com/web/index.php/api/v2/dashboard/employees/action-summary" : {
    "transaction" : "https://opensource-demo.orangehrmlive.com/web/index.php/api/v2/dashboard/employees/action-summary",
    "sampleCount" : 3,
    "errorCount" : 3,
    "errorPct" : 100.0,
    "meanResTime" : 362.0,
    "medianResTime" : 331.0,
    "minResTime" : 312.0,
    "maxResTime" : 443.0,
    "pct1ResTime" : 443.0,
    "pct2ResTime" : 443.0,
    "pct3ResTime" : 443.0,
    "throughput" : 0.20221083850094365,
    "receivedKBytesPerSec" : 0.0647706592073335,
    "sentKBytesPerSec" : 0.10643715034375842
  },
  "https://opensource-demo.orangehrmlive.com/web/index.php/events/push-6" : {
    "transaction" : "https://opensource-demo.orangehrmlive.com/web/index.php/events/push-6",
    "sampleCount" : 3,
    "errorCount" : 0,
    "errorPct" : 0.0,
    "meanResTime" : 208.66666666666666,
    "medianResTime" : 201.0,
    "minResTime" : 187.0,
    "maxResTime" : 238.0,
    "pct1ResTime" : 238.0,
    "pct2ResTime" : 238.0,
    "pct3ResTime" : 238.0,
    "throughput" : 0.20569077819677753,
    "receivedKBytesPerSec" : 0.19966468117929378,
    "sentKBytesPerSec" : 0.10565756770654781
  },
  "https://opensource-demo.orangehrmlive.com/web/index.php/api/v2/dashboard/shortcuts" : {
    "transaction" : "https://opensource-demo.orangehrmlive.com/web/index.php/api/v2/dashboard/shortcuts",
    "sampleCount" : 3,
    "errorCount" : 3,
    "errorPct" : 100.0,
    "meanResTime" : 345.0,
    "medianResTime" : 318.0,
    "minResTime" : 305.0,
    "maxResTime" : 412.0,
    "pct1ResTime" : 412.0,
    "pct2ResTime" : 412.0,
    "pct3ResTime" : 412.0,
    "throughput" : 0.2008704385671242,
    "receivedKBytesPerSec" : 0.06434131235353197,
    "sentKBytesPerSec" : 0.10278916973552059
  },
  "https://opensource-demo.orangehrmlive.com/web/index.php/events/push-1" : {
    "transaction" : "https://opensource-demo.orangehrmlive.com/web/index.php/events/push-1",
    "sampleCount" : 3,
    "errorCount" : 0,
    "errorPct" : 0.0,
    "meanResTime" : 440.3333333333333,
    "medianResTime" : 465.0,
    "minResTime" : 344.0,
    "maxResTime" : 512.0,
    "pct1ResTime" : 512.0,
    "pct2ResTime" : 512.0,
    "pct3ResTime" : 512.0,
    "throughput" : 0.2025384823116392,
    "receivedKBytesPerSec" : 0.8522175854037267,
    "sentKBytesPerSec" : 0.08485254776532541
  },
  "https://opensource-demo.orangehrmlive.com/web/index.php/events/push-0" : {
    "transaction" : "https://opensource-demo.orangehrmlive.com/web/index.php/events/push-0",
    "sampleCount" : 3,
    "errorCount" : 0,
    "errorPct" : 0.0,
    "meanResTime" : 446.0,
    "medianResTime" : 409.0,
    "minResTime" : 315.0,
    "maxResTime" : 614.0,
    "pct1ResTime" : 614.0,
    "pct2ResTime" : 614.0,
    "pct3ResTime" : 614.0,
    "throughput" : 0.20165355918531963,
    "receivedKBytesPerSec" : 0.3267023971566848,
    "sentKBytesPerSec" : 0.10122063420044364
  },
  "https://opensource-demo.orangehrmlive.com/web/index.php/events/push-3" : {
    "transaction" : "https://opensource-demo.orangehrmlive.com/web/index.php/events/push-3",
    "sampleCount" : 3,
    "errorCount" : 0,
    "errorPct" : 0.0,
    "meanResTime" : 202.0,
    "medianResTime" : 202.0,
    "minResTime" : 166.0,
    "maxResTime" : 238.0,
    "pct1ResTime" : 238.0,
    "pct2ResTime" : 238.0,
    "pct3ResTime" : 238.0,
    "throughput" : 0.20569077819677753,
    "receivedKBytesPerSec" : 0.199463811278711,
    "sentKBytesPerSec" : 0.10786713661295852
  },
  "https://opensource-demo.orangehrmlive.com/web/index.php/events/push-2" : {
    "transaction" : "https://opensource-demo.orangehrmlive.com/web/index.php/events/push-2",
    "sampleCount" : 3,
    "errorCount" : 0,
    "errorPct" : 0.0,
    "meanResTime" : 208.66666666666666,
    "medianResTime" : 201.0,
    "minResTime" : 187.0,
    "maxResTime" : 238.0,
    "pct1ResTime" : 238.0,
    "pct2ResTime" : 238.0,
    "pct3ResTime" : 238.0,
    "throughput" : 0.20569077819677753,
    "receivedKBytesPerSec" : 0.1990620714775454,
    "sentKBytesPerSec" : 0.10545669780596503
  },
  "https://opensource-demo.orangehrmlive.com/web/index.php/auth/logout-1" : {
    "transaction" : "https://opensource-demo.orangehrmlive.com/web/index.php/auth/logout-1",
    "sampleCount" : 3,
    "errorCount" : 0,
    "errorPct" : 0.0,
    "meanResTime" : 395.6666666666667,
    "medianResTime" : 350.0,
    "minResTime" : 326.0,
    "maxResTime" : 511.0,
    "pct1ResTime" : 511.0,
    "pct2ResTime" : 511.0,
    "pct3ResTime" : 511.0,
    "throughput" : 0.11072562190890972,
    "receivedKBytesPerSec" : 0.4668714129512069,
    "sentKBytesPerSec" : 0.06249942330405255
  },
  "https://opensource-demo.orangehrmlive.com/web/index.php/auth/logout-2" : {
    "transaction" : "https://opensource-demo.orangehrmlive.com/web/index.php/auth/logout-2",
    "sampleCount" : 3,
    "errorCount" : 0,
    "errorPct" : 0.0,
    "meanResTime" : 201.33333333333334,
    "medianResTime" : 201.0,
    "minResTime" : 183.0,
    "maxResTime" : 220.0,
    "pct1ResTime" : 220.0,
    "pct2ResTime" : 220.0,
    "pct3ResTime" : 220.0,
    "throughput" : 0.11133377866844801,
    "receivedKBytesPerSec" : 0.1077458736918281,
    "sentKBytesPerSec" : 0.07328024103763081
  },
  "https://opensource-demo.orangehrmlive.com/web/index.php/auth/logout-0" : {
    "transaction" : "https://opensource-demo.orangehrmlive.com/web/index.php/auth/logout-0",
    "sampleCount" : 3,
    "errorCount" : 0,
    "errorPct" : 0.0,
    "meanResTime" : 339.6666666666667,
    "medianResTime" : 334.0,
    "minResTime" : 298.0,
    "maxResTime" : 387.0,
    "pct1ResTime" : 387.0,
    "pct2ResTime" : 387.0,
    "pct3ResTime" : 387.0,
    "throughput" : 0.11123882976751084,
    "receivedKBytesPerSec" : 0.18021994002373093,
    "sentKBytesPerSec" : 0.06289773675330936
  },
  "https://opensource-demo.orangehrmlive.com/web/index.php/auth/logout-5" : {
    "transaction" : "https://opensource-demo.orangehrmlive.com/web/index.php/auth/logout-5",
    "sampleCount" : 3,
    "errorCount" : 0,
    "errorPct" : 0.0,
    "meanResTime" : 202.66666666666666,
    "medianResTime" : 201.0,
    "minResTime" : 188.0,
    "maxResTime" : 219.0,
    "pct1ResTime" : 219.0,
    "pct2ResTime" : 219.0,
    "pct3ResTime" : 219.0,
    "throughput" : 0.11133377866844801,
    "receivedKBytesPerSec" : 0.10807204687152082,
    "sentKBytesPerSec" : 0.07447620936317079
  },
  "https://opensource-demo.orangehrmlive.com/web/index.php/auth/logout-6" : {
    "transaction" : "https://opensource-demo.orangehrmlive.com/web/index.php/auth/logout-6",
    "sampleCount" : 3,
    "errorCount" : 0,
    "errorPct" : 0.0,
    "meanResTime" : 196.0,
    "medianResTime" : 201.0,
    "minResTime" : 167.0,
    "maxResTime" : 220.0,
    "pct1ResTime" : 220.0,
    "pct2ResTime" : 220.0,
    "pct3ResTime" : 220.0,
    "throughput" : 0.11133791055854518,
    "receivedKBytesPerSec" : 0.1080760577101503,
    "sentKBytesPerSec" : 0.07339168908888477
  },
  "https://opensource-demo.orangehrmlive.com/web/index.php/auth/logout-3" : {
    "transaction" : "https://opensource-demo.orangehrmlive.com/web/index.php/auth/logout-3",
    "sampleCount" : 3,
    "errorCount" : 0,
    "errorPct" : 0.0,
    "meanResTime" : 202.66666666666666,
    "medianResTime" : 201.0,
    "minResTime" : 187.0,
    "maxResTime" : 220.0,
    "pct1ResTime" : 220.0,
    "pct2ResTime" : 220.0,
    "pct3ResTime" : 220.0,
    "throughput" : 0.11133791055854518,
    "receivedKBytesPerSec" : 0.10796732928187047,
    "sentKBytesPerSec" : 0.07458770179996288
  },
  "Total" : {
    "transaction" : "Total",
    "sampleCount" : 123,
    "errorCount" : 30,
    "errorPct" : 24.390244,
    "meanResTime" : 761.1951219512193,
    "medianResTime" : 318.0,
    "minResTime" : 166.0,
    "maxResTime" : 5791.0,
    "pct1ResTime" : 2293.8000000000015,
    "pct2ResTime" : 3670.3999999999996,
    "pct3ResTime" : 5699.800000000002,
    "throughput" : 2.647153771656085,
    "receivedKBytesPerSec" : 548.1650755272785,
    "sentKBytesPerSec" : 2.4464608778112558
  },
  "https://opensource-demo.orangehrmlive.com/web/index.php/auth/logout-4" : {
    "transaction" : "https://opensource-demo.orangehrmlive.com/web/index.php/auth/logout-4",
    "sampleCount" : 3,
    "errorCount" : 0,
    "errorPct" : 0.0,
    "meanResTime" : 203.33333333333334,
    "medianResTime" : 201.0,
    "minResTime" : 189.0,
    "maxResTime" : 220.0,
    "pct1ResTime" : 220.0,
    "pct2ResTime" : 220.0,
    "pct3ResTime" : 220.0,
    "throughput" : 0.11133377866844801,
    "receivedKBytesPerSec" : 0.10796332247828991,
    "sentKBytesPerSec" : 0.07349768982409263
  },
  "https://opensource-demo.orangehrmlive.com/web/index.php/api/v2/dashboard/employees/leaves?date=2023-01-23" : {
    "transaction" : "https://opensource-demo.orangehrmlive.com/web/index.php/api/v2/dashboard/employees/leaves?date=2023-01-23",
    "sampleCount" : 3,
    "errorCount" : 3,
    "errorPct" : 100.0,
    "meanResTime" : 356.3333333333333,
    "medianResTime" : 323.0,
    "minResTime" : 309.0,
    "maxResTime" : 437.0,
    "pct1ResTime" : 437.0,
    "pct2ResTime" : 437.0,
    "pct3ResTime" : 437.0,
    "throughput" : 0.20078977310755639,
    "receivedKBytesPerSec" : 0.06431547419851415,
    "sentKBytesPerSec" : 0.10725781825179037
  },
  "https://opensource-demo.orangehrmlive.com/web/index.php/api/v2/dashboard/employees/time-at-work?timezoneOffset=5.5&currentDate=2023-01-23&currentTime=16:01" : {
    "transaction" : "https://opensource-demo.orangehrmlive.com/web/index.php/api/v2/dashboard/employees/time-at-work?timezoneOffset=5.5&currentDate=2023-01-23&currentTime=16:01",
    "sampleCount" : 3,
    "errorCount" : 3,
    "errorPct" : 100.0,
    "meanResTime" : 326.3333333333333,
    "medianResTime" : 323.0,
    "minResTime" : 304.0,
    "maxResTime" : 352.0,
    "pct1ResTime" : 352.0,
    "pct2ResTime" : 352.0,
    "pct3ResTime" : 352.0,
    "throughput" : 0.20255215718047398,
    "receivedKBytesPerSec" : 0.06487998784687057,
    "sentKBytesPerSec" : 0.11848509975693741
  }
}