timeStamp,elapsed,label,responseCode,responseMessage,threadName,dataType,success,failureMessage,bytes,sentBytes,grpThreads,allThreads,URL,Latency,IdleTime,Connect
1674212028210,3800,https://demowebshop.tricentis.com/,200,OK,Thread Group 1-2,text,true,,1114495,18032,2,2,https://demowebshop.tricentis.com/,1398,0,874
1674212028210,1549,https://demowebshop.tricentis.com/-0,200,OK,Thread Group 1-2,text,true,,35600,494,2,2,https://demowebshop.tricentis.com/,1398,0,874
1674212029771,325,https://demowebshop.tricentis.com/-1,200,OK,Thread Group 1-2,text,true,,93789,755,2,2,https://demowebshop.tricentis.com/Themes/DefaultClean/Content/styles.css,163,0,0
1674212029771,847,https://demowebshop.tricentis.com/-2,200,OK,Thread Group 1-2,text,true,,25536,759,2,2,https://demowebshop.tricentis.com/Themes/DefaultClean/Content/responsive.css,690,0,497
1674212029771,835,https://demowebshop.tricentis.com/-3,200,OK,Thread Group 1-2,text,true,,27298,784,2,2,https://demowebshop.tricentis.com/Content/jquery-ui-themes/smoothness/jquery-ui-1.10.3.custom.min.css,683,0,485
1674212029774,673,https://demowebshop.tricentis.com/-4,200,OK,Thread Group 1-2,text,true,,2356,778,2,2,https://demowebshop.tricentis.com/Plugins/Widgets.NivoSlider/Content/nivoslider/nivo-slider.css,673,0,491
1674212029774,643,https://demowebshop.tricentis.com/-5,200,OK,Thread Group 1-2,text,true,,2390,789,2,2,https://demowebshop.tricentis.com/Plugins/Widgets.NivoSlider/Content/nivoslider/themes/default/default.css,643,0,482
1674212029774,995,https://demowebshop.tricentis.com/-6,200,OK,Thread Group 1-2,text,true,,94458,745,2,2,https://demowebshop.tricentis.com/Scripts/jquery-1.10.2.min.js,678,0,495
1674212030462,355,https://demowebshop.tricentis.com/-7,200,OK,Thread Group 1-2,text,true,,22173,747,2,2,https://demowebshop.tricentis.com/Scripts/jquery.validate.min.js,196,0,0
1674212030496,301,https://demowebshop.tricentis.com/-8,200,OK,Thread Group 1-2,text,true,,5994,759,2,2,https://demowebshop.tricentis.com/Scripts/jquery.validate.unobtrusive.min.js,301,0,0
1674212030497,338,https://demowebshop.tricentis.com/-9,200,OK,Thread Group 1-2,text,true,,228441,755,2,2,https://demowebshop.tricentis.com/Scripts/jquery-ui-1.10.3.custom.min.js,161,0,0
1674212030607,190,https://demowebshop.tricentis.com/-10,200,OK,Thread Group 1-2,text,true,,7495,752,2,2,https://demowebshop.tricentis.com/Scripts/jquery-migrate-1.2.1.min.js,190,0,0
1674212030647,158,https://demowebshop.tricentis.com/-11,200,OK,Thread Group 1-2,text,true,,3415,741,2,2,https://demowebshop.tricentis.com/Scripts/public.common.js,158,0,0
1674212030770,1083,https://demowebshop.tricentis.com/-12,200,OK,Thread Group 1-2,text,true,,3870,743,2,2,https://demowebshop.tricentis.com/Scripts/public.ajaxcart.js,1083,0,0
1674212030798,378,https://demowebshop.tricentis.com/-13,200,OK,Thread Group 1-2,text,true,,29825,773,2,2,https://demowebshop.tricentis.com/Plugins/Widgets.NivoSlider/Scripts/jquery.nivo.slider.js,194,0,0
1674212030798,248,https://demowebshop.tricentis.com/-14,200,OK,Thread Group 1-2,bin,true,,1432,728,2,2,https://demowebshop.tricentis.com/favicon.ico,248,0,0
1674212030806,1133,https://demowebshop.tricentis.com/-15,200,OK,Thread Group 1-2,bin,true,,7466,760,2,2,https://demowebshop.tricentis.com/Themes/DefaultClean/Content/images/logo.png,975,0,0
1674212030817,1121,https://demowebshop.tricentis.com/-16,200,OK,Thread Group 1-2,bin,true,,55751,750,2,2,https://demowebshop.tricentis.com/content/images/thumbs/0000215.png,178,0,0
1674212030835,1175,https://demowebshop.tricentis.com/-17,200,OK,Thread Group 1-2,bin,true,,440747,750,2,2,https://demowebshop.tricentis.com/content/images/thumbs/0000240.png,285,0,0
1674212031047,164,https://demowebshop.tricentis.com/-18,200,OK,Thread Group 1-2,bin,true,,3066,776,2,2,https://demowebshop.tricentis.com/content/images/thumbs/0000015_25-virtual-gift-card_125.jpeg,164,0,0
1674212031176,201,https://demowebshop.tricentis.com/-19,200,OK,Thread Group 1-2,bin,true,,7616,770,2,2,https://demowebshop.tricentis.com/content/images/thumbs/0000224_141-inch-laptop_125.png,200,0,0
1674212031212,217,https://demowebshop.tricentis.com/-20,200,OK,Thread Group 1-2,bin,true,,3941,785,2,2,https://demowebshop.tricentis.com/content/images/thumbs/0000172_build-your-own-cheap-computer_125.jpeg,217,0,0
1674212031377,249,https://demowebshop.tricentis.com/-21,200,OK,Thread Group 1-2,bin,true,,3955,779,2,2,https://demowebshop.tricentis.com/content/images/thumbs/0000031_build-your-own-computer_125.jpeg,249,0,0
1674212031430,196,https://demowebshop.tricentis.com/-22,200,OK,Thread Group 1-2,bin,true,,3940,789,2,2,https://demowebshop.tricentis.com/content/images/thumbs/0000201_build-your-own-expensive-computer_125.jpeg,196,0,0
1674212031626,255,https://demowebshop.tricentis.com/-23,200,OK,Thread Group 1-2,bin,true,,3941,771,2,2,https://demowebshop.tricentis.com/content/images/thumbs/0000204_simple-computer_125.jpeg,255,0,0
1674212027793,4424,https://demowebshop.tricentis.com/,200,OK,Thread Group 1-1,text,true,,1114495,18032,2,2,https://demowebshop.tricentis.com/,1702,0,1301
1674212027793,1865,https://demowebshop.tricentis.com/-0,200,OK,Thread Group 1-1,text,true,,35600,494,2,2,https://demowebshop.tricentis.com/,1702,0,1301
1674212029745,351,https://demowebshop.tricentis.com/-1,200,OK,Thread Group 1-1,text,true,,93789,755,2,2,https://demowebshop.tricentis.com/Themes/DefaultClean/Content/styles.css,171,0,0
1674212029747,881,https://demowebshop.tricentis.com/-2,200,OK,Thread Group 1-1,text,true,,25536,759,2,2,https://demowebshop.tricentis.com/Themes/DefaultClean/Content/responsive.css,720,0,487
1674212029745,770,https://demowebshop.tricentis.com/-3,200,OK,Thread Group 1-1,text,true,,27298,784,2,2,https://demowebshop.tricentis.com/Content/jquery-ui-themes/smoothness/jquery-ui-1.10.3.custom.min.css,621,0,469
1674212029745,753,https://demowebshop.tricentis.com/-4,200,OK,Thread Group 1-1,text,true,,2356,778,2,2,https://demowebshop.tricentis.com/Plugins/Widgets.NivoSlider/Content/nivoslider/nivo-slider.css,753,0,490
1674212029745,722,https://demowebshop.tricentis.com/-5,200,OK,Thread Group 1-1,text,true,,2390,789,2,2,https://demowebshop.tricentis.com/Plugins/Widgets.NivoSlider/Content/nivoslider/themes/default/default.css,722,0,485
1674212029745,1029,https://demowebshop.tricentis.com/-6,200,OK,Thread Group 1-1,text,true,,94458,745,2,2,https://demowebshop.tricentis.com/Scripts/jquery-1.10.2.min.js,716,0,490
1674212030468,390,https://demowebshop.tricentis.com/-7,200,OK,Thread Group 1-1,text,true,,22173,747,2,2,https://demowebshop.tricentis.com/Scripts/jquery.validate.min.js,220,0,0
1674212030498,171,https://demowebshop.tricentis.com/-8,200,OK,Thread Group 1-1,text,true,,5994,759,2,2,https://demowebshop.tricentis.com/Scripts/jquery.validate.unobtrusive.min.js,159,0,0
1674212030499,494,https://demowebshop.tricentis.com/-9,200,OK,Thread Group 1-1,text,true,,228441,755,2,2,https://demowebshop.tricentis.com/Scripts/jquery-ui-1.10.3.custom.min.js,298,0,0
1674212030548,249,https://demowebshop.tricentis.com/-10,200,OK,Thread Group 1-1,text,true,,7495,752,2,2,https://demowebshop.tricentis.com/Scripts/jquery-migrate-1.2.1.min.js,249,0,0
1674212030647,170,https://demowebshop.tricentis.com/-11,200,OK,Thread Group 1-1,text,true,,3415,741,2,2,https://demowebshop.tricentis.com/Scripts/public.common.js,170,0,0
1674212030669,216,https://demowebshop.tricentis.com/-12,200,OK,Thread Group 1-1,text,true,,3870,743,2,2,https://demowebshop.tricentis.com/Scripts/public.ajaxcart.js,216,0,0
1674212030774,343,https://demowebshop.tricentis.com/-13,200,OK,Thread Group 1-1,text,true,,29825,773,2,2,https://demowebshop.tricentis.com/Plugins/Widgets.NivoSlider/Scripts/jquery.nivo.slider.js,341,0,0
1674212030798,317,https://demowebshop.tricentis.com/-14,200,OK,Thread Group 1-1,bin,true,,1432,728,2,2,https://demowebshop.tricentis.com/favicon.ico,317,0,0
1674212030817,300,https://demowebshop.tricentis.com/-15,200,OK,Thread Group 1-1,bin,true,,7466,760,2,2,https://demowebshop.tricentis.com/Themes/DefaultClean/Content/images/logo.png,299,0,0
1674212030859,1358,https://demowebshop.tricentis.com/-16,200,OK,Thread Group 1-1,bin,true,,55751,750,2,2,https://demowebshop.tricentis.com/content/images/thumbs/0000215.png,257,0,0
1674212030885,1024,https://demowebshop.tricentis.com/-17,200,OK,Thread Group 1-1,bin,true,,440747,750,2,2,https://demowebshop.tricentis.com/content/images/thumbs/0000240.png,300,0,0
1674212030993,198,https://demowebshop.tricentis.com/-18,200,OK,Thread Group 1-1,bin,true,,3066,776,2,2,https://demowebshop.tricentis.com/content/images/thumbs/0000015_25-virtual-gift-card_125.jpeg,198,0,0
1674212031116,314,https://demowebshop.tricentis.com/-19,200,OK,Thread Group 1-1,bin,true,,7616,770,2,2,https://demowebshop.tricentis.com/content/images/thumbs/0000224_141-inch-laptop_125.png,313,0,0
1674212031117,312,https://demowebshop.tricentis.com/-20,200,OK,Thread Group 1-1,bin,true,,3941,785,2,2,https://demowebshop.tricentis.com/content/images/thumbs/0000172_build-your-own-cheap-computer_125.jpeg,312,0,0
1674212031117,312,https://demowebshop.tricentis.com/-21,200,OK,Thread Group 1-1,bin,true,,3955,779,2,2,https://demowebshop.tricentis.com/content/images/thumbs/0000031_build-your-own-computer_125.jpeg,312,0,0
1674212031191,194,https://demowebshop.tricentis.com/-22,200,OK,Thread Group 1-1,bin,true,,3940,789,2,2,https://demowebshop.tricentis.com/content/images/thumbs/0000201_build-your-own-expensive-computer_125.jpeg,194,0,0
1674212031386,240,https://demowebshop.tricentis.com/-23,200,OK,Thread Group 1-1,bin,true,,3941,771,2,2,https://demowebshop.tricentis.com/content/images/thumbs/0000204_simple-computer_125.jpeg,240,0,0
1674212045292,1137,https://demowebshop.tricentis.com/login,200,OK,Thread Group 1-2,text,true,,24296,10764,2,2,https://demowebshop.tricentis.com/login,275,0,0
1674212045292,277,https://demowebshop.tricentis.com/login-0,200,OK,Thread Group 1-2,text,true,,22814,722,2,2,https://demowebshop.tricentis.com/login,275,0,0
1674212045575,179,https://demowebshop.tricentis.com/login-1,304,Not Modified,Thread Group 1-2,,true,,124,840,2,2,https://demowebshop.tricentis.com/Themes/DefaultClean/Content/styles.css,0,0,0
1674212045575,173,https://demowebshop.tricentis.com/login-2,304,Not Modified,Thread Group 1-2,,true,,124,844,2,2,https://demowebshop.tricentis.com/Themes/DefaultClean/Content/responsive.css,0,0,0
1674212045575,173,https://demowebshop.tricentis.com/login-3,304,Not Modified,Thread Group 1-2,,true,,123,868,2,2,https://demowebshop.tricentis.com/Content/jquery-ui-themes/smoothness/jquery-ui-1.10.3.custom.min.css,0,0,0
1674212045576,176,https://demowebshop.tricentis.com/login-4,304,Not Modified,Thread Group 1-2,,true,,123,829,2,2,https://demowebshop.tricentis.com/Scripts/jquery-1.10.2.min.js,0,0,0
1674212045576,173,https://demowebshop.tricentis.com/login-5,304,Not Modified,Thread Group 1-2,,true,,124,832,2,2,https://demowebshop.tricentis.com/Scripts/jquery.validate.min.js,0,0,0
1674212045577,170,https://demowebshop.tricentis.com/login-6,304,Not Modified,Thread Group 1-2,,true,,123,843,2,2,https://demowebshop.tricentis.com/Scripts/jquery.validate.unobtrusive.min.js,0,0,0
1674212045748,158,https://demowebshop.tricentis.com/login-7,304,Not Modified,Thread Group 1-2,,true,,124,840,2,2,https://demowebshop.tricentis.com/Scripts/jquery-ui-1.10.3.custom.min.js,0,0,0
1674212045748,152,https://demowebshop.tricentis.com/login-8,304,Not Modified,Thread Group 1-2,,true,,124,837,2,2,https://demowebshop.tricentis.com/Scripts/jquery-migrate-1.2.1.min.js,0,0,0
1674212045749,151,https://demowebshop.tricentis.com/login-9,304,Not Modified,Thread Group 1-2,,true,,124,826,2,2,https://demowebshop.tricentis.com/Scripts/public.common.js,0,0,0
1674212045755,674,https://demowebshop.tricentis.com/login-10,304,Not Modified,Thread Group 1-2,,true,,124,828,2,2,https://demowebshop.tricentis.com/Scripts/public.ajaxcart.js,0,0,510
1674212045755,158,https://demowebshop.tricentis.com/login-11,304,Not Modified,Thread Group 1-2,,true,,123,812,2,2,https://demowebshop.tricentis.com/favicon.ico,0,0,0
1674212045755,162,https://demowebshop.tricentis.com/login-12,304,Not Modified,Thread Group 1-2,,true,,122,843,2,2,https://demowebshop.tricentis.com/Themes/DefaultClean/Content/images/logo.png,0,0,0
1674212047166,1941,https://demowebshop.tricentis.com/login,200,OK,Thread Group 1-2,text,true,,39126,31144,2,2,https://demowebshop.tricentis.com/,233,0,0
1674212047166,233,https://demowebshop.tricentis.com/login-0,302,Found,Thread Group 1-2,text,true,,902,858,2,2,https://demowebshop.tricentis.com/login,233,0,0
1674212047400,730,https://demowebshop.tricentis.com/login-1,200,OK,Thread Group 1-2,text,true,,35303,1137,2,2,https://demowebshop.tricentis.com/,413,0,0
1674212048141,163,https://demowebshop.tricentis.com/login-2,304,Not Modified,Thread Group 1-2,,true,,124,1260,2,2,https://demowebshop.tricentis.com/Themes/DefaultClean/Content/styles.css,0,0,0
1674212048142,162,https://demowebshop.tricentis.com/login-3,304,Not Modified,Thread Group 1-2,,true,,124,1264,2,2,https://demowebshop.tricentis.com/Themes/DefaultClean/Content/responsive.css,0,0,0
1674212048142,167,https://demowebshop.tricentis.com/login-4,304,Not Modified,Thread Group 1-2,,true,,123,1288,2,2,https://demowebshop.tricentis.com/Content/jquery-ui-themes/smoothness/jquery-ui-1.10.3.custom.min.css,0,0,0
1674212048143,154,https://demowebshop.tricentis.com/login-5,304,Not Modified,Thread Group 1-2,,true,,124,1283,2,2,https://demowebshop.tricentis.com/Plugins/Widgets.NivoSlider/Content/nivoslider/nivo-slider.css,0,0,0
1674212048146,156,https://demowebshop.tricentis.com/login-6,304,Not Modified,Thread Group 1-2,,true,,124,1294,2,2,https://demowebshop.tricentis.com/Plugins/Widgets.NivoSlider/Content/nivoslider/themes/default/default.css,0,0,0
1674212048143,154,https://demowebshop.tricentis.com/login-7,304,Not Modified,Thread Group 1-2,,true,,123,1249,2,2,https://demowebshop.tricentis.com/Scripts/jquery-1.10.2.min.js,0,0,0
1674212048297,151,https://demowebshop.tricentis.com/login-8,304,Not Modified,Thread Group 1-2,,true,,124,1252,2,2,https://demowebshop.tricentis.com/Scripts/jquery.validate.min.js,0,0,0
1674212048298,155,https://demowebshop.tricentis.com/login-9,304,Not Modified,Thread Group 1-2,,true,,123,1263,2,2,https://demowebshop.tricentis.com/Scripts/jquery.validate.unobtrusive.min.js,0,0,0
1674212048303,154,https://demowebshop.tricentis.com/login-10,304,Not Modified,Thread Group 1-2,,true,,124,1260,2,2,https://demowebshop.tricentis.com/Scripts/jquery-ui-1.10.3.custom.min.js,0,0,0
1674212048305,164,https://demowebshop.tricentis.com/login-11,304,Not Modified,Thread Group 1-2,,true,,124,1257,2,2,https://demowebshop.tricentis.com/Scripts/jquery-migrate-1.2.1.min.js,0,0,0
1674212048305,641,https://demowebshop.tricentis.com/login-12,304,Not Modified,Thread Group 1-2,,true,,124,1246,2,2,https://demowebshop.tricentis.com/Scripts/public.common.js,0,0,483
1674212048310,155,https://demowebshop.tricentis.com/login-13,304,Not Modified,Thread Group 1-2,,true,,124,1248,2,2,https://demowebshop.tricentis.com/Scripts/public.ajaxcart.js,0,0,0
1674212048449,150,https://demowebshop.tricentis.com/login-14,304,Not Modified,Thread Group 1-2,,true,,124,1278,2,2,https://demowebshop.tricentis.com/Plugins/Widgets.NivoSlider/Scripts/jquery.nivo.slider.js,0,0,0
1674212048454,151,https://demowebshop.tricentis.com/login-15,304,Not Modified,Thread Group 1-2,,true,,123,1232,2,2,https://demowebshop.tricentis.com/favicon.ico,0,0,0
1674212048457,151,https://demowebshop.tricentis.com/login-16,304,Not Modified,Thread Group 1-2,,true,,122,1263,2,2,https://demowebshop.tricentis.com/Themes/DefaultClean/Content/images/logo.png,0,0,0
1674212048470,636,https://demowebshop.tricentis.com/login-17,304,Not Modified,Thread Group 1-2,,true,,124,1255,2,2,https://demowebshop.tricentis.com/content/images/thumbs/0000215.png,0,0,469
1674212048469,164,https://demowebshop.tricentis.com/login-18,304,Not Modified,Thread Group 1-2,,true,,198,1256,2,2,https://demowebshop.tricentis.com/content/images/thumbs/0000240.png,0,0,0
1674212048602,153,https://demowebshop.tricentis.com/login-19,304,Not Modified,Thread Group 1-2,,true,,124,1281,2,2,https://demowebshop.tricentis.com/content/images/thumbs/0000015_25-virtual-gift-card_125.jpeg,0,0,0
1674212048606,150,https://demowebshop.tricentis.com/login-20,304,Not Modified,Thread Group 1-2,,true,,125,1276,2,2,https://demowebshop.tricentis.com/content/images/thumbs/0000224_141-inch-laptop_125.png,0,0,0
1674212048608,150,https://demowebshop.tricentis.com/login-21,304,Not Modified,Thread Group 1-2,,true,,123,1289,2,2,https://demowebshop.tricentis.com/content/images/thumbs/0000172_build-your-own-cheap-computer_125.jpeg,0,0,0
1674212048634,163,https://demowebshop.tricentis.com/login-22,304,Not Modified,Thread Group 1-2,,true,,124,1284,2,2,https://demowebshop.tricentis.com/content/images/thumbs/0000031_build-your-own-computer_125.jpeg,0,0,0
1674212048756,150,https://demowebshop.tricentis.com/login-23,304,Not Modified,Thread Group 1-2,,true,,124,1294,2,2,https://demowebshop.tricentis.com/content/images/thumbs/0000201_build-your-own-expensive-computer_125.jpeg,0,0,0
1674212048759,161,https://demowebshop.tricentis.com/login-24,304,Not Modified,Thread Group 1-2,,true,,125,1277,2,2,https://demowebshop.tricentis.com/content/images/thumbs/0000204_simple-computer_125.jpeg,0,0,0
1674212052970,1864,https://demowebshop.tricentis.com/login,200,OK,Thread Group 1-1,text,true,,24296,10764,2,2,https://demowebshop.tricentis.com/login,276,0,0
1674212052970,579,https://demowebshop.tricentis.com/login-0,200,OK,Thread Group 1-1,text,true,,22814,722,2,2,https://demowebshop.tricentis.com/login,276,0,0
1674212053553,157,https://demowebshop.tricentis.com/login-1,304,Not Modified,Thread Group 1-1,,true,,124,840,2,2,https://demowebshop.tricentis.com/Themes/DefaultClean/Content/styles.css,0,0,0
1674212053553,166,https://demowebshop.tricentis.com/login-2,304,Not Modified,Thread Group 1-1,,true,,124,844,2,2,https://demowebshop.tricentis.com/Themes/DefaultClean/Content/responsive.css,0,0,0
1674212053553,631,https://demowebshop.tricentis.com/login-3,304,Not Modified,Thread Group 1-1,,true,,123,868,2,2,https://demowebshop.tricentis.com/Content/jquery-ui-themes/smoothness/jquery-ui-1.10.3.custom.min.css,0,0,475
1674212053553,152,https://demowebshop.tricentis.com/login-4,304,Not Modified,Thread Group 1-1,,true,,123,829,2,2,https://demowebshop.tricentis.com/Scripts/jquery-1.10.2.min.js,0,0,0
1674212053554,645,https://demowebshop.tricentis.com/login-5,304,Not Modified,Thread Group 1-1,,true,,124,832,2,2,https://demowebshop.tricentis.com/Scripts/jquery.validate.min.js,0,0,487
1674212053554,669,https://demowebshop.tricentis.com/login-6,304,Not Modified,Thread Group 1-1,,true,,123,843,2,2,https://demowebshop.tricentis.com/Scripts/jquery.validate.unobtrusive.min.js,0,0,505
1674212053706,657,https://demowebshop.tricentis.com/login-7,304,Not Modified,Thread Group 1-1,,true,,124,840,2,2,https://demowebshop.tricentis.com/Scripts/jquery-ui-1.10.3.custom.min.js,0,0,489
1674212053710,641,https://demowebshop.tricentis.com/login-8,304,Not Modified,Thread Group 1-1,,true,,124,837,2,2,https://demowebshop.tricentis.com/Scripts/jquery-migrate-1.2.1.min.js,0,0,483
1674212053719,166,https://demowebshop.tricentis.com/login-9,304,Not Modified,Thread Group 1-1,,true,,124,826,2,2,https://demowebshop.tricentis.com/Scripts/public.common.js,0,0,0
1674212053885,161,https://demowebshop.tricentis.com/login-10,304,Not Modified,Thread Group 1-1,,true,,124,828,2,2,https://demowebshop.tricentis.com/Scripts/public.ajaxcart.js,0,0,0
1674212054047,161,https://demowebshop.tricentis.com/login-11,304,Not Modified,Thread Group 1-1,,true,,123,812,2,2,https://demowebshop.tricentis.com/favicon.ico,0,0,0
1674212054185,649,https://demowebshop.tricentis.com/login-12,304,Not Modified,Thread Group 1-1,,true,,122,843,2,2,https://demowebshop.tricentis.com/Themes/DefaultClean/Content/images/logo.png,0,0,487
1674212061759,1920,https://demowebshop.tricentis.com/logout,200,OK,Thread Group 1-2,text,true,,38898,22356,2,2,https://demowebshop.tricentis.com/,267,0,0
1674212061759,267,https://demowebshop.tricentis.com/logout-0,302,Found,Thread Group 1-2,text,true,,691,1094,2,2,https://demowebshop.tricentis.com/logout,267,0,0
1674212062027,344,https://demowebshop.tricentis.com/logout-1,200,OK,Thread Group 1-2,text,true,,35286,761,2,2,https://demowebshop.tricentis.com/,340,0,0
1674212062375,152,https://demowebshop.tricentis.com/logout-2,304,Not Modified,Thread Group 1-2,,true,,124,884,2,2,https://demowebshop.tricentis.com/Themes/DefaultClean/Content/styles.css,0,0,0
1674212062375,153,https://demowebshop.tricentis.com/logout-3,304,Not Modified,Thread Group 1-2,,true,,124,888,2,2,https://demowebshop.tricentis.com/Themes/DefaultClean/Content/responsive.css,0,0,0
1674212062377,611,https://demowebshop.tricentis.com/logout-4,304,Not Modified,Thread Group 1-2,,true,,123,912,2,2,https://demowebshop.tricentis.com/Content/jquery-ui-themes/smoothness/jquery-ui-1.10.3.custom.min.css,0,0,457
1674212062376,635,https://demowebshop.tricentis.com/logout-5,304,Not Modified,Thread Group 1-2,,true,,124,907,2,2,https://demowebshop.tricentis.com/Plugins/Widgets.NivoSlider/Content/nivoslider/nivo-slider.css,0,0,478
1674212062376,684,https://demowebshop.tricentis.com/logout-6,304,Not Modified,Thread Group 1-2,,true,,124,918,2,2,https://demowebshop.tricentis.com/Plugins/Widgets.NivoSlider/Content/nivoslider/themes/default/default.css,0,0,506
1674212062376,153,https://demowebshop.tricentis.com/logout-7,304,Not Modified,Thread Group 1-2,,true,,123,873,2,2,https://demowebshop.tricentis.com/Scripts/jquery-1.10.2.min.js,0,0,0
1674212062527,189,https://demowebshop.tricentis.com/logout-8,304,Not Modified,Thread Group 1-2,,true,,124,876,2,2,https://demowebshop.tricentis.com/Scripts/jquery.validate.min.js,0,0,0
1674212062528,188,https://demowebshop.tricentis.com/logout-9,304,Not Modified,Thread Group 1-2,,true,,123,887,2,2,https://demowebshop.tricentis.com/Scripts/jquery.validate.unobtrusive.min.js,0,0,0
1674212062529,623,https://demowebshop.tricentis.com/logout-10,304,Not Modified,Thread Group 1-2,,true,,124,884,2,2,https://demowebshop.tricentis.com/Scripts/jquery-ui-1.10.3.custom.min.js,0,0,470
1674212062717,154,https://demowebshop.tricentis.com/logout-11,304,Not Modified,Thread Group 1-2,,true,,124,881,2,2,https://demowebshop.tricentis.com/Scripts/jquery-migrate-1.2.1.min.js,0,0,0
1674212062717,148,https://demowebshop.tricentis.com/logout-12,304,Not Modified,Thread Group 1-2,,true,,124,870,2,2,https://demowebshop.tricentis.com/Scripts/public.common.js,0,0,0
1674212062866,181,https://demowebshop.tricentis.com/logout-13,304,Not Modified,Thread Group 1-2,,true,,124,872,2,2,https://demowebshop.tricentis.com/Scripts/public.ajaxcart.js,0,0,0
1674212062871,177,https://demowebshop.tricentis.com/logout-14,304,Not Modified,Thread Group 1-2,,true,,124,902,2,2,https://demowebshop.tricentis.com/Plugins/Widgets.NivoSlider/Scripts/jquery.nivo.slider.js,0,0,0
1674212062988,158,https://demowebshop.tricentis.com/logout-15,304,Not Modified,Thread Group 1-2,,true,,123,856,2,2,https://demowebshop.tricentis.com/favicon.ico,0,0,0
1674212063012,157,https://demowebshop.tricentis.com/logout-16,304,Not Modified,Thread Group 1-2,,true,,122,887,2,2,https://demowebshop.tricentis.com/Themes/DefaultClean/Content/images/logo.png,0,0,0
1674212063048,152,https://demowebshop.tricentis.com/logout-17,304,Not Modified,Thread Group 1-2,,true,,124,879,2,2,https://demowebshop.tricentis.com/content/images/thumbs/0000215.png,0,0,0
1674212063048,158,https://demowebshop.tricentis.com/logout-18,304,Not Modified,Thread Group 1-2,,true,,198,880,2,2,https://demowebshop.tricentis.com/content/images/thumbs/0000240.png,0,0,0
1674212063060,619,https://demowebshop.tricentis.com/logout-19,304,Not Modified,Thread Group 1-2,,true,,124,905,2,2,https://demowebshop.tricentis.com/content/images/thumbs/0000015_25-virtual-gift-card_125.jpeg,0,0,466
1674212063146,207,https://demowebshop.tricentis.com/logout-20,304,Not Modified,Thread Group 1-2,,true,,125,900,2,2,https://demowebshop.tricentis.com/content/images/thumbs/0000224_141-inch-laptop_125.png,0,0,0
1674212063152,196,https://demowebshop.tricentis.com/logout-21,304,Not Modified,Thread Group 1-2,,true,,123,913,2,2,https://demowebshop.tricentis.com/content/images/thumbs/0000172_build-your-own-cheap-computer_125.jpeg,0,0,0
1674212063169,184,https://demowebshop.tricentis.com/logout-22,304,Not Modified,Thread Group 1-2,,true,,124,908,2,2,https://demowebshop.tricentis.com/content/images/thumbs/0000031_build-your-own-computer_125.jpeg,0,0,0
1674212063200,156,https://demowebshop.tricentis.com/logout-23,304,Not Modified,Thread Group 1-2,,true,,124,918,2,2,https://demowebshop.tricentis.com/content/images/thumbs/0000201_build-your-own-expensive-computer_125.jpeg,0,0,0
1674212063206,155,https://demowebshop.tricentis.com/logout-24,304,Not Modified,Thread Group 1-2,,true,,125,901,2,2,https://demowebshop.tricentis.com/content/images/thumbs/0000204_simple-computer_125.jpeg,0,0,0
1674212028208,8798,Test,200,"Number of samples in transaction : 4, number of failing samples : 0",Thread Group 1-2,,true,,1216815,82296,2,2,null,2173,26673,874
1674212071288,2431,https://demowebshop.tricentis.com/login,200,OK,Thread Group 1-1,text,true,,39126,31144,1,1,https://demowebshop.tricentis.com/,528,0,0
1674212071288,528,https://demowebshop.tricentis.com/login-0,302,Found,Thread Group 1-1,text,true,,902,858,1,1,https://demowebshop.tricentis.com/login,528,0,0
1674212071817,502,https://demowebshop.tricentis.com/login-1,200,OK,Thread Group 1-1,text,true,,35303,1137,1,1,https://demowebshop.tricentis.com/,337,0,0
1674212072323,622,https://demowebshop.tricentis.com/login-2,304,Not Modified,Thread Group 1-1,,true,,124,1260,1,1,https://demowebshop.tricentis.com/Themes/DefaultClean/Content/styles.css,0,0,468
1674212072323,614,https://demowebshop.tricentis.com/login-3,304,Not Modified,Thread Group 1-1,,true,,124,1264,1,1,https://demowebshop.tricentis.com/Themes/DefaultClean/Content/responsive.css,0,0,465
1674212072323,164,https://demowebshop.tricentis.com/login-4,304,Not Modified,Thread Group 1-1,,true,,123,1288,1,1,https://demowebshop.tricentis.com/Content/jquery-ui-themes/smoothness/jquery-ui-1.10.3.custom.min.css,0,0,0
1674212072323,163,https://demowebshop.tricentis.com/login-5,304,Not Modified,Thread Group 1-1,,true,,124,1283,1,1,https://demowebshop.tricentis.com/Plugins/Widgets.NivoSlider/Content/nivoslider/nivo-slider.css,0,0,0
1674212072323,159,https://demowebshop.tricentis.com/login-6,304,Not Modified,Thread Group 1-1,,true,,124,1294,1,1,https://demowebshop.tricentis.com/Plugins/Widgets.NivoSlider/Content/nivoslider/themes/default/default.css,0,0,0
1674212072323,162,https://demowebshop.tricentis.com/login-7,304,Not Modified,Thread Group 1-1,,true,,123,1249,1,1,https://demowebshop.tricentis.com/Scripts/jquery-1.10.2.min.js,0,0,0
1674212072483,639,https://demowebshop.tricentis.com/login-8,304,Not Modified,Thread Group 1-1,,true,,124,1252,1,1,https://demowebshop.tricentis.com/Scripts/jquery.validate.min.js,0,0,483
1674212072485,173,https://demowebshop.tricentis.com/login-9,304,Not Modified,Thread Group 1-1,,true,,123,1263,1,1,https://demowebshop.tricentis.com/Scripts/jquery.validate.unobtrusive.min.js,0,0,0
1674212072487,633,https://demowebshop.tricentis.com/login-10,304,Not Modified,Thread Group 1-1,,true,,124,1260,1,1,https://demowebshop.tricentis.com/Scripts/jquery-ui-1.10.3.custom.min.js,0,0,479
1674212072488,632,https://demowebshop.tricentis.com/login-11,304,Not Modified,Thread Group 1-1,,true,,124,1257,1,1,https://demowebshop.tricentis.com/Scripts/jquery-migrate-1.2.1.min.js,0,0,478
1674212072658,158,https://demowebshop.tricentis.com/login-12,304,Not Modified,Thread Group 1-1,,true,,124,1246,1,1,https://demowebshop.tricentis.com/Scripts/public.common.js,0,0,0
1674212072817,160,https://demowebshop.tricentis.com/login-13,304,Not Modified,Thread Group 1-1,,true,,124,1248,1,1,https://demowebshop.tricentis.com/Scripts/public.ajaxcart.js,0,0,0
1674212072938,781,https://demowebshop.tricentis.com/login-14,304,Not Modified,Thread Group 1-1,,true,,124,1278,1,1,https://demowebshop.tricentis.com/Plugins/Widgets.NivoSlider/Scripts/jquery.nivo.slider.js,0,0,498
1674212072946,154,https://demowebshop.tricentis.com/login-15,304,Not Modified,Thread Group 1-1,,true,,123,1232,1,1,https://demowebshop.tricentis.com/favicon.ico,0,0,0
1674212072977,159,https://demowebshop.tricentis.com/login-16,304,Not Modified,Thread Group 1-1,,true,,122,1263,1,1,https://demowebshop.tricentis.com/Themes/DefaultClean/Content/images/logo.png,0,0,0
1674212073100,158,https://demowebshop.tricentis.com/login-17,304,Not Modified,Thread Group 1-1,,true,,124,1255,1,1,https://demowebshop.tricentis.com/content/images/thumbs/0000215.png,0,0,0
1674212073120,174,https://demowebshop.tricentis.com/login-18,304,Not Modified,Thread Group 1-1,,true,,198,1256,1,1,https://demowebshop.tricentis.com/content/images/thumbs/0000240.png,0,0,0
1674212073120,172,https://demowebshop.tricentis.com/login-19,304,Not Modified,Thread Group 1-1,,true,,124,1281,1,1,https://demowebshop.tricentis.com/content/images/thumbs/0000015_25-virtual-gift-card_125.jpeg,0,0,0
1674212073122,171,https://demowebshop.tricentis.com/login-20,304,Not Modified,Thread Group 1-1,,true,,125,1276,1,1,https://demowebshop.tricentis.com/content/images/thumbs/0000224_141-inch-laptop_125.png,0,0,0
1674212073136,160,https://demowebshop.tricentis.com/login-21,304,Not Modified,Thread Group 1-1,,true,,123,1289,1,1,https://demowebshop.tricentis.com/content/images/thumbs/0000172_build-your-own-cheap-computer_125.jpeg,0,0,0
1674212073259,179,https://demowebshop.tricentis.com/login-22,304,Not Modified,Thread Group 1-1,,true,,124,1284,1,1,https://demowebshop.tricentis.com/content/images/thumbs/0000031_build-your-own-computer_125.jpeg,0,0,0
1674212073293,160,https://demowebshop.tricentis.com/login-23,304,Not Modified,Thread Group 1-1,,true,,124,1294,1,1,https://demowebshop.tricentis.com/content/images/thumbs/0000201_build-your-own-expensive-computer_125.jpeg,0,0,0
1674212073293,160,https://demowebshop.tricentis.com/login-24,304,Not Modified,Thread Group 1-1,,true,,125,1277,1,1,https://demowebshop.tricentis.com/content/images/thumbs/0000204_simple-computer_125.jpeg,0,0,0
1674212081957,1391,https://demowebshop.tricentis.com/logout,200,OK,Thread Group 1-1,text,true,,38898,22356,1,1,https://demowebshop.tricentis.com/,195,0,0
1674212081957,195,https://demowebshop.tricentis.com/logout-0,302,Found,Thread Group 1-1,text,true,,691,1094,1,1,https://demowebshop.tricentis.com/logout,195,0,0
1674212082153,507,https://demowebshop.tricentis.com/logout-1,200,OK,Thread Group 1-1,text,true,,35286,761,1,1,https://demowebshop.tricentis.com/,352,0,0
1674212082669,172,https://demowebshop.tricentis.com/logout-2,304,Not Modified,Thread Group 1-1,,true,,124,884,1,1,https://demowebshop.tricentis.com/Themes/DefaultClean/Content/styles.css,0,0,0
1674212082669,156,https://demowebshop.tricentis.com/logout-3,304,Not Modified,Thread Group 1-1,,true,,124,888,1,1,https://demowebshop.tricentis.com/Themes/DefaultClean/Content/responsive.css,0,0,0
1674212082669,156,https://demowebshop.tricentis.com/logout-4,304,Not Modified,Thread Group 1-1,,true,,123,912,1,1,https://demowebshop.tricentis.com/Content/jquery-ui-themes/smoothness/jquery-ui-1.10.3.custom.min.css,0,0,0
1674212082669,164,https://demowebshop.tricentis.com/logout-5,304,Not Modified,Thread Group 1-1,,true,,124,907,1,1,https://demowebshop.tricentis.com/Plugins/Widgets.NivoSlider/Content/nivoslider/nivo-slider.css,0,0,0
1674212082669,166,https://demowebshop.tricentis.com/logout-6,304,Not Modified,Thread Group 1-1,,true,,124,918,1,1,https://demowebshop.tricentis.com/Plugins/Widgets.NivoSlider/Content/nivoslider/themes/default/default.css,0,0,0
1674212082669,163,https://demowebshop.tricentis.com/logout-7,304,Not Modified,Thread Group 1-1,,true,,123,873,1,1,https://demowebshop.tricentis.com/Scripts/jquery-1.10.2.min.js,0,0,0
1674212082825,150,https://demowebshop.tricentis.com/logout-8,304,Not Modified,Thread Group 1-1,,true,,124,876,1,1,https://demowebshop.tricentis.com/Scripts/jquery.validate.min.js,0,0,0
1674212082825,165,https://demowebshop.tricentis.com/logout-9,304,Not Modified,Thread Group 1-1,,true,,123,887,1,1,https://demowebshop.tricentis.com/Scripts/jquery.validate.unobtrusive.min.js,0,0,0
1674212082832,158,https://demowebshop.tricentis.com/logout-10,304,Not Modified,Thread Group 1-1,,true,,124,884,1,1,https://demowebshop.tricentis.com/Scripts/jquery-ui-1.10.3.custom.min.js,0,0,0
1674212082833,157,https://demowebshop.tricentis.com/logout-11,304,Not Modified,Thread Group 1-1,,true,,124,881,1,1,https://demowebshop.tricentis.com/Scripts/jquery-migrate-1.2.1.min.js,0,0,0
1674212082836,162,https://demowebshop.tricentis.com/logout-12,304,Not Modified,Thread Group 1-1,,true,,124,870,1,1,https://demowebshop.tricentis.com/Scripts/public.common.js,0,0,0
1674212082842,156,https://demowebshop.tricentis.com/logout-13,304,Not Modified,Thread Group 1-1,,true,,124,872,1,1,https://demowebshop.tricentis.com/Scripts/public.ajaxcart.js,0,0,0
1674212082975,152,https://demowebshop.tricentis.com/logout-14,304,Not Modified,Thread Group 1-1,,true,,124,902,1,1,https://demowebshop.tricentis.com/Plugins/Widgets.NivoSlider/Scripts/jquery.nivo.slider.js,0,0,0
1674212082990,167,https://demowebshop.tricentis.com/logout-15,304,Not Modified,Thread Group 1-1,,true,,123,856,1,1,https://demowebshop.tricentis.com/favicon.ico,0,0,0
1674212082990,164,https://demowebshop.tricentis.com/logout-16,304,Not Modified,Thread Group 1-1,,true,,122,887,1,1,https://demowebshop.tricentis.com/Themes/DefaultClean/Content/images/logo.png,0,0,0
1674212082990,155,https://demowebshop.tricentis.com/logout-17,304,Not Modified,Thread Group 1-1,,true,,124,879,1,1,https://demowebshop.tricentis.com/content/images/thumbs/0000215.png,0,0,0
1674212082998,156,https://demowebshop.tricentis.com/logout-18,304,Not Modified,Thread Group 1-1,,true,,198,880,1,1,https://demowebshop.tricentis.com/content/images/thumbs/0000240.png,0,0,0
1674212082998,163,https://demowebshop.tricentis.com/logout-19,304,Not Modified,Thread Group 1-1,,true,,124,905,1,1,https://demowebshop.tricentis.com/content/images/thumbs/0000015_25-virtual-gift-card_125.jpeg,0,0,0
1674212083127,149,https://demowebshop.tricentis.com/logout-20,304,Not Modified,Thread Group 1-1,,true,,125,900,1,1,https://demowebshop.tricentis.com/content/images/thumbs/0000224_141-inch-laptop_125.png,0,0,0
1674212083145,189,https://demowebshop.tricentis.com/logout-21,304,Not Modified,Thread Group 1-1,,true,,123,913,1,1,https://demowebshop.tricentis.com/content/images/thumbs/0000172_build-your-own-cheap-computer_125.jpeg,0,0,0
1674212083154,180,https://demowebshop.tricentis.com/logout-22,304,Not Modified,Thread Group 1-1,,true,,124,908,1,1,https://demowebshop.tricentis.com/content/images/thumbs/0000031_build-your-own-computer_125.jpeg,0,0,0
1674212083155,193,https://demowebshop.tricentis.com/logout-23,304,Not Modified,Thread Group 1-1,,true,,124,918,1,1,https://demowebshop.tricentis.com/content/images/thumbs/0000201_build-your-own-expensive-computer_125.jpeg,0,0,0
1674212083157,190,https://demowebshop.tricentis.com/logout-24,304,Not Modified,Thread Group 1-1,,true,,125,901,1,1,https://demowebshop.tricentis.com/content/images/thumbs/0000204_simple-computer_125.jpeg,0,0,0
1674212027718,10110,Test,200,"Number of samples in transaction : 4, number of failing samples : 0",Thread Group 1-1,,true,,1216815,82296,1,1,null,2701,45520,1301
