// Jest Snapshot v1, https://goo.gl/fbAQLP

exports[`it renders without crashing 1`] = `
.c0 {
  position: fixed;
  display: -webkit-box;
  display: -webkit-flex;
  display: -ms-flexbox;
  display: flex;
  -webkit-box-pack: center;
  -webkit-justify-content: center;
  -ms-flex-pack: center;
  justify-content: center;
  -webkit-align-items: center;
  -webkit-box-align: center;
  -ms-flex-align: center;
  align-items: center;
  width: 400px;
  bottom: 0px;
  left: 50%;
  padding: 10px 20px;
  -webkit-transform: translate(-50%,0);
  -ms-transform: translate(-50%,0);
  transform: translate(-50%,0);
  color: var(--white);
  background: var(--black);
  z-index: 1;
}

<div>
  <div
    class="c0"
  >
    <span
      class=""
    >
      Something went wrong...
    </span>
  </div>
</div>
`;
