// Jest Snapshot v1, https://goo.gl/fbAQLP

exports[`it renders without crashing 1`] = `
.c5 {
  display: -webkit-inline-box;
  display: -webkit-inline-flex;
  display: -ms-inline-flexbox;
  display: inline-flex;
  -webkit-flex: 0 1 auto;
  -ms-flex: 0 1 auto;
  flex: 0 1 auto;
  width: var(--button-size);
  height: var(--button-size);
  border: 0;
  padding: 0;
  -webkit-box-pack: center;
  -webkit-justify-content: center;
  -ms-flex-pack: center;
  justify-content: center;
  background: none;
  border: var(--border);
  -webkit-transition: background-color 150ms ease-in-out;
  transition: background-color 150ms ease-in-out;
  cursor: pointer;
  background-color: var(--white);
}

.c5 svg {
  width: calc(var(--button-size) / 2);
  fill: var(--black);
  -webkit-transition: fill 150ms ease-in-out;
  transition: fill 150ms ease-in-out;
  fill: var(--black);
}

.c5:hover {
  background-color: var(--black);
}

.c5:hover svg {
  fill: var(--white);
}

.c0 {
  height: 100%;
  display: -webkit-box;
  display: -webkit-flex;
  display: -ms-flexbox;
  display: flex;
  -webkit-align-items: center;
  -webkit-box-align: center;
  -ms-flex-align: center;
  align-items: center;
}

.c3 {
  position: absolute;
  opacity: 0;
  cursor: pointer;
  height: 0;
  width: 0;
}

.c1 {
  display: block;
  position: relative;
  cursor: pointer;
  -webkit-user-select: none;
  -moz-user-select: none;
  -ms-user-select: none;
  user-select: none;
}

.c1:not(:last-child) {
  margin-right: calc(var(--button-size) / 2);
}

.c1 .c2:checked ~ .c4 {
  background-color: var(--black);
}

.c1 .c2:checked ~ .c4 svg {
  fill: var(--white);
}

<div>
  <div
    class="c0"
  >
    <label
      class="c1"
      for="SINGLE_COLUMN"
    >
      <input
        checked=""
        class="c2 c3"
        id="SINGLE_COLUMN"
        title="SINGLE_COLUMN"
        type="checkbox"
      />
      <span
        class="c4 c5"
      >
        <svg>
          single-column-layout-icon.svg
        </svg>
      </span>
    </label>
    <label
      class="c1"
      for="THREE_COLUMN"
    >
      <input
        class="c2 c3"
        id="THREE_COLUMN"
        title="THREE_COLUMN"
        type="checkbox"
      />
      <span
        class="c4 c5"
      >
        <svg>
          three-column-layout-icon.svg
        </svg>
      </span>
    </label>
  </div>
</div>
`;
