<svg xmlns="http://www.w3.org/2000/svg" viewBox="0 0 100 100">
  <path d="M82.235 43.617a38.678 38.678 0 1 0-16.053 31.311L86.254 95 95 86.253 74.928 66.182a38.398 38.398 0 0 0 7.307-22.565zM43.618 69.865a26.248 26.248 0 1 1 26.247-26.248 26.278 26.278 0 0 1-26.247 26.248z"/>
</svg>
