<svg width="16" height="16" viewBox="0 0 16 16" fill="none" xmlns="http://www.w3.org/2000/svg">
<path fill-rule="evenodd" clip-rule="evenodd" d="M12.56 16V9.81334C12.56 8.64 12.24 7.38667 10.8267 7.38667C10.0267 7.38667 9.33334 7.94667 9.06667 8.69334C8.96001 8.98667 8.96001 9.28 8.96001 9.57334V16H5.54667C5.54667 12.2667 5.57334 8.56 5.46667 4.82667H8.42667L8.58667 6.4H8.64001C9.36001 5.22667 10.6933 4.58667 12.0533 4.58667C14.88 4.58667 16 6.85334 16 9.41334V16H12.56ZM0.0800171 16V4.82666H3.49335V16H0.0800171ZM1.81333 0C2.82667 0 3.6 0.693333 3.6 1.73333C3.6 2.8 2.8 3.46667 1.76 3.46667C0.746667 3.46667 0 2.74667 0 1.73333C0 0.693333 0.8 0 1.81333 0Z" fill="white" fill-opacity="0.6"/>
</svg>
