{
	"guid": "{00000000-0000-0000-ba54-000000000002}",
	"acrylicOpacity": 1.00,
	"closeOnExit": true,
	"colorScheme": "Campbell",
	"commandline": "\"%PROGRAMFILES%\\git\\usr\\bin\\bash.exe\" -i -l",
	"cursorColor": "#FFFFFF",
	"cursorShape": "bar",
	"fontFace": "Consolas",
	"fontSize": 12,
	"historySize": 9001,
	"icon": "ms-appx:///ProfileIcons/{0caa0dad-35be-5f56-a8ff-afceeeaa6101}.png",
	"name": "Bash",
	"padding": "0, 0, 0, 0",
	"snapOnInput": true,
	"startingDirectory": "%USERPROFILE%\\git",
	"useAcrylic": false
},
{
	"guid": "{9e2bc218-99ec-5d94-aa2d-d9b80c591c66}",
	"hidden": false,
	"name": "ubuntu-20.04",
	"commandline": "bash -i",
	"colorScheme": "Campbell",
	"startingDirectory": "//wsl$/ubuntu-20.04/home/svobol13/git"
}
