[
[
        {
            "command": {
                "action": "splitPane",
                "split": "vertical",
                "splitMode": "duplicate"
            },
            "keys": [ "ctrl+|" ]
        },
        {
            "command": "find",
            "keys": [ "ctrl+f" ]
        },
        {
            "command": "scrollDownPage",
            "keys": [
                "pagedown"
            ]
        },
        {
            "command": "scrollUpPage",
            "keys": [
                "pageup"
            ]
        },
        {
            "command": "scrollUp",
            "keys": [
                "ctrl+up"
            ]
        },
        {
            "command": "scrollDown",
            "keys": [
                "ctrl+down"
            ]
        },
        {
            "command": "closeTab",
            "keys": [
                "ctrl+f4"
            ]
        },
        {
            "command": {
                "action": "switchToTab",
                "index": 0
            },
            "keys": [
                "ctrl+1"
            ]
        },
        {
            "command": {
                "action": "switchToTab",
                "index": 1
            },
            "keys": [
                "ctrl+2"
            ]
        },
        {
            "command": {
                "action": "switchToTab",
                "index": 2
            },
            "keys": [
                "ctrl+3"
            ]
        },
        {
            "command": {
                "action": "switchToTab",
                "index": 3
            },
            "keys": [
                "ctrl+4"
            ]
        },
        {
            "command": {
                "action": "switchToTab",
                "index": 4
            },
            "keys": [
                "ctrl+5"
            ]
        },
        {
            "command": {
                "action": "switchToTab",
                "index": 5
            },
            "keys": [
                "ctrl+6"
            ]
        },
        {
            "command": {
                "action": "switchToTab",
                "index": 6
            },
            "keys": [
                "ctrl+7"
            ]
        },
        {
            "command": {
                "action": "switchToTab",
                "index": 7
            },
            "keys": [
                "ctrl+8"
            ]
        },
        {
            "command": {
                "action": "switchToTab",
                "index": 8
            },
            "keys": [
                "ctrl+9"
            ]
        }
    ]
]
