93.497
93.490
93.483
93.476
93.468
93.460
93.453
93.445
93.438
93.433
93.426
93.417
93.412
93.405
93.397
93.390
93.383
93.375
93.370
93.362
93.353
93.346
93.340
93.330
93.321
93.314
93.304
93.295
93.287
93.277
93.267
93.258
93.246
93.239
93.224
93.215
93.201
93.190
93.173
93.164
93.147
93.134
93.121
93.108
93.090
93.080
93.064
93.047
93.032
93.018
93.000
92.984
92.968
92.953
92.939
92.923
92.908
92.892
92.878
92.862
92.849
92.834
92.822
92.811
92.798
92.791
92.784
92.775
92.767
92.759
92.751
92.739
92.728
92.719
92.707
92.697
92.688
92.680
92.668
92.662
92.657
92.647
92.635
92.628
92.622
92.615
92.605
92.595
92.585
92.580
92.570
92.561
92.553
92.543
92.533
92.525
92.517
92.508
92.502
92.493
92.486
92.480
92.472
92.468
92.460
92.455
92.453
92.450
92.444
92.440
92.437
92.434
92.432
92.426
92.423
92.419
92.419
92.415
92.410
92.408
92.403
92.400
92.395
92.390
92.385
92.381
92.371
92.365
92.358
92.348
92.344
92.333
92.325
92.316
92.307
92.299
92.292
92.285
92.277
92.268
92.260
92.255
92.248
92.239
92.233
92.226
92.223
92.214
92.211
92.207
92.203
92.199
92.194
92.191
92.190
92.184
92.181
92.176
92.173
92.171
92.164
92.159
92.158
92.154
92.147
92.145
92.139
92.132
92.125
92.118
92.112
92.100
92.090
92.082
92.070
92.061
92.050
92.037
92.027
92.018
92.008
91.998
91.986
91.977
91.970
91.960
91.951
91.942
91.935
91.923
91.917
91.906
91.897
91.888
91.879
91.868
91.859
91.848
91.839
91.830
91.820
91.811
91.802
91.793
91.783
91.771
91.759
91.749
91.739
91.726
91.715
91.705
91.692
91.683
91.669
91.658
91.648
91.639
91.632
91.622
91.615
91.604
91.595
91.584
91.575
91.566
91.556
91.544
91.536
91.528
91.520
91.512
91.503
91.497
91.486
91.480
91.474
91.463
91.457
91.448
91.443
91.435
91.428
91.419
91.414
91.407
91.403
91.397
91.391
91.383
91.376
91.370
91.361
91.355
91.346
91.338
91.329
91.322
91.314
91.307
91.297
91.293
91.284
91.279
91.271
91.266
91.259
91.251
91.246
91.241
91.234
91.229
91.220
91.216
91.210
91.207
91.202
91.195
91.188
91.184
91.178
91.172
91.166
91.160
91.155
91.149
91.144
91.134
91.132
91.123
91.117
91.111
91.104
91.098
91.089
91.081
91.073
91.066
91.054
91.049
91.040
91.032
91.022
91.011
91.002
90.992
90.983
90.971
90.961
90.950
90.938
90.926
90.917
90.901
90.892
90.878
90.863
90.852
90.838
90.828
90.809
90.800
90.789
90.776
90.763
90.751
90.737
90.726
90.713
90.706
90.692
90.681
90.671
90.661
90.650
90.640
90.629
90.623
90.612
90.601
90.594
90.586
90.578
90.568
90.562
90.556
90.547
90.539
90.534
90.526
90.518
90.510
90.505
90.496
90.489
90.481
90.473
90.466
90.460
90.451
90.441
90.435
90.427
90.418
90.411
90.402
90.395
90.388
90.379
90.372
90.365
90.357
90.345
90.336
90.326
90.315
90.306
90.298
90.290
90.283
90.274
90.266
90.261
90.257
90.250
90.246
90.238
90.236
90.230
90.223
90.221
90.217
90.209
90.205
90.195
90.189
90.182
90.173
90.163
90.156
90.144
90.132
90.123
90.112
90.099
90.092
90.083
90.076
90.068
90.060
90.054
90.050
90.041
90.041
90.034
90.030
90.024
90.022
90.017
90.012
90.006
90.002
89.994
89.989
89.985
89.980
89.972
89.968
89.962
89.956
89.945
89.941
89.933
89.926
89.914
89.907
89.899
89.891
89.884
89.877
89.868
89.862
89.855
89.847
89.840
89.833
89.825
89.819
89.812
89.801
89.799
89.792
89.788
89.782
89.777
89.771
89.770
89.760
89.753
89.744
89.738
89.730
89.724
89.713
89.705
89.696
