%TF.GenerationSoftware,KiCad,Pcbnew,(5.0.1)-3*%
%TF.CreationDate,2019-04-25T22:01:41+02:00*%
%TF.ProjectId,tempsensor,74656D7073656E736F722E6B69636164,rev?*%
%TF.SameCoordinates,Original*%
%TF.FileFunction,Soldermask,Bot*%
%TF.FilePolarity,Negative*%
%FSLAX46Y46*%
G04 Gerber Fmt 4.6, Leading zero omitted, Abs format (unit mm)*
G04 Created by KiCad (PCBNEW (5.0.1)-3) date 25/04/2019 22:01:41*
%MOMM*%
%LPD*%
G01*
G04 APERTURE LIST*
%ADD10C,0.100000*%
G04 APERTURE END LIST*
D10*
G36*
X133507134Y-87760778D02*
X133607865Y-87791335D01*
X133658232Y-87806613D01*
X133704648Y-87831423D01*
X133797482Y-87881044D01*
X133919538Y-87981212D01*
X134019706Y-88103267D01*
X134069327Y-88196101D01*
X134094137Y-88242517D01*
X134109415Y-88292884D01*
X134139972Y-88393615D01*
X134151570Y-88511375D01*
X134151570Y-89288625D01*
X134139972Y-89406385D01*
X134109415Y-89507116D01*
X134094137Y-89557483D01*
X134069327Y-89603899D01*
X134019706Y-89696733D01*
X133919538Y-89818788D01*
X133797483Y-89918956D01*
X133704649Y-89968577D01*
X133658233Y-89993387D01*
X133607866Y-90008665D01*
X133507135Y-90039222D01*
X133350000Y-90054698D01*
X133192866Y-90039222D01*
X133092135Y-90008665D01*
X133041768Y-89993387D01*
X132995352Y-89968577D01*
X132902518Y-89918956D01*
X132780463Y-89818788D01*
X132680295Y-89696733D01*
X132605864Y-89557482D01*
X132560028Y-89406385D01*
X132548430Y-89288625D01*
X132548430Y-88511376D01*
X132560028Y-88393616D01*
X132605863Y-88242519D01*
X132605863Y-88242518D01*
X132630673Y-88196102D01*
X132680294Y-88103268D01*
X132780462Y-87981212D01*
X132902517Y-87881044D01*
X132995351Y-87831423D01*
X133041767Y-87806613D01*
X133092134Y-87791335D01*
X133192865Y-87760778D01*
X133350000Y-87745302D01*
X133507134Y-87760778D01*
X133507134Y-87760778D01*
G37*
G36*
X115727134Y-87760778D02*
X115827865Y-87791335D01*
X115878232Y-87806613D01*
X115924648Y-87831423D01*
X116017482Y-87881044D01*
X116139538Y-87981212D01*
X116239706Y-88103267D01*
X116289327Y-88196101D01*
X116314137Y-88242517D01*
X116329415Y-88292884D01*
X116359972Y-88393615D01*
X116371570Y-88511375D01*
X116371570Y-89288625D01*
X116359972Y-89406385D01*
X116329415Y-89507116D01*
X116314137Y-89557483D01*
X116289327Y-89603899D01*
X116239706Y-89696733D01*
X116139538Y-89818788D01*
X116017483Y-89918956D01*
X115924649Y-89968577D01*
X115878233Y-89993387D01*
X115827866Y-90008665D01*
X115727135Y-90039222D01*
X115570000Y-90054698D01*
X115412866Y-90039222D01*
X115312135Y-90008665D01*
X115261768Y-89993387D01*
X115215352Y-89968577D01*
X115122518Y-89918956D01*
X115000463Y-89818788D01*
X114900295Y-89696733D01*
X114825864Y-89557482D01*
X114780028Y-89406385D01*
X114768430Y-89288625D01*
X114768430Y-88511376D01*
X114780028Y-88393616D01*
X114825863Y-88242519D01*
X114825863Y-88242518D01*
X114850673Y-88196102D01*
X114900294Y-88103268D01*
X115000462Y-87981212D01*
X115122517Y-87881044D01*
X115215351Y-87831423D01*
X115261767Y-87806613D01*
X115312134Y-87791335D01*
X115412865Y-87760778D01*
X115570000Y-87745302D01*
X115727134Y-87760778D01*
X115727134Y-87760778D01*
G37*
G36*
X141127134Y-87760778D02*
X141227865Y-87791335D01*
X141278232Y-87806613D01*
X141324648Y-87831423D01*
X141417482Y-87881044D01*
X141539538Y-87981212D01*
X141639706Y-88103267D01*
X141689327Y-88196101D01*
X141714137Y-88242517D01*
X141729415Y-88292884D01*
X141759972Y-88393615D01*
X141771570Y-88511375D01*
X141771570Y-89288625D01*
X141759972Y-89406385D01*
X141729415Y-89507116D01*
X141714137Y-89557483D01*
X141689327Y-89603899D01*
X141639706Y-89696733D01*
X141539538Y-89818788D01*
X141417483Y-89918956D01*
X141324649Y-89968577D01*
X141278233Y-89993387D01*
X141227866Y-90008665D01*
X141127135Y-90039222D01*
X140970000Y-90054698D01*
X140812866Y-90039222D01*
X140712135Y-90008665D01*
X140661768Y-89993387D01*
X140615352Y-89968577D01*
X140522518Y-89918956D01*
X140400463Y-89818788D01*
X140300295Y-89696733D01*
X140225864Y-89557482D01*
X140180028Y-89406385D01*
X140168430Y-89288625D01*
X140168430Y-88511376D01*
X140180028Y-88393616D01*
X140225863Y-88242519D01*
X140225863Y-88242518D01*
X140250673Y-88196102D01*
X140300294Y-88103268D01*
X140400462Y-87981212D01*
X140522517Y-87881044D01*
X140615351Y-87831423D01*
X140661767Y-87806613D01*
X140712134Y-87791335D01*
X140812865Y-87760778D01*
X140970000Y-87745302D01*
X141127134Y-87760778D01*
X141127134Y-87760778D01*
G37*
G36*
X138587134Y-87760778D02*
X138687865Y-87791335D01*
X138738232Y-87806613D01*
X138784648Y-87831423D01*
X138877482Y-87881044D01*
X138999538Y-87981212D01*
X139099706Y-88103267D01*
X139149327Y-88196101D01*
X139174137Y-88242517D01*
X139189415Y-88292884D01*
X139219972Y-88393615D01*
X139231570Y-88511375D01*
X139231570Y-89288625D01*
X139219972Y-89406385D01*
X139189415Y-89507116D01*
X139174137Y-89557483D01*
X139149327Y-89603899D01*
X139099706Y-89696733D01*
X138999538Y-89818788D01*
X138877483Y-89918956D01*
X138784649Y-89968577D01*
X138738233Y-89993387D01*
X138687866Y-90008665D01*
X138587135Y-90039222D01*
X138430000Y-90054698D01*
X138272866Y-90039222D01*
X138172135Y-90008665D01*
X138121768Y-89993387D01*
X138075352Y-89968577D01*
X137982518Y-89918956D01*
X137860463Y-89818788D01*
X137760295Y-89696733D01*
X137685864Y-89557482D01*
X137640028Y-89406385D01*
X137628430Y-89288625D01*
X137628430Y-88511376D01*
X137640028Y-88393616D01*
X137685863Y-88242519D01*
X137685863Y-88242518D01*
X137710673Y-88196102D01*
X137760294Y-88103268D01*
X137860462Y-87981212D01*
X137982517Y-87881044D01*
X138075351Y-87831423D01*
X138121767Y-87806613D01*
X138172134Y-87791335D01*
X138272865Y-87760778D01*
X138430000Y-87745302D01*
X138587134Y-87760778D01*
X138587134Y-87760778D01*
G37*
G36*
X136047134Y-87760778D02*
X136147865Y-87791335D01*
X136198232Y-87806613D01*
X136244648Y-87831423D01*
X136337482Y-87881044D01*
X136459538Y-87981212D01*
X136559706Y-88103267D01*
X136609327Y-88196101D01*
X136634137Y-88242517D01*
X136649415Y-88292884D01*
X136679972Y-88393615D01*
X136691570Y-88511375D01*
X136691570Y-89288625D01*
X136679972Y-89406385D01*
X136649415Y-89507116D01*
X136634137Y-89557483D01*
X136609327Y-89603899D01*
X136559706Y-89696733D01*
X136459538Y-89818788D01*
X136337483Y-89918956D01*
X136244649Y-89968577D01*
X136198233Y-89993387D01*
X136147866Y-90008665D01*
X136047135Y-90039222D01*
X135890000Y-90054698D01*
X135732866Y-90039222D01*
X135632135Y-90008665D01*
X135581768Y-89993387D01*
X135535352Y-89968577D01*
X135442518Y-89918956D01*
X135320463Y-89818788D01*
X135220295Y-89696733D01*
X135145864Y-89557482D01*
X135100028Y-89406385D01*
X135088430Y-89288625D01*
X135088430Y-88511376D01*
X135100028Y-88393616D01*
X135145863Y-88242519D01*
X135145863Y-88242518D01*
X135170673Y-88196102D01*
X135220294Y-88103268D01*
X135320462Y-87981212D01*
X135442517Y-87881044D01*
X135535351Y-87831423D01*
X135581767Y-87806613D01*
X135632134Y-87791335D01*
X135732865Y-87760778D01*
X135890000Y-87745302D01*
X136047134Y-87760778D01*
X136047134Y-87760778D01*
G37*
G36*
X130967134Y-87760778D02*
X131067865Y-87791335D01*
X131118232Y-87806613D01*
X131164648Y-87831423D01*
X131257482Y-87881044D01*
X131379538Y-87981212D01*
X131479706Y-88103267D01*
X131529327Y-88196101D01*
X131554137Y-88242517D01*
X131569415Y-88292884D01*
X131599972Y-88393615D01*
X131611570Y-88511375D01*
X131611570Y-89288625D01*
X131599972Y-89406385D01*
X131569415Y-89507116D01*
X131554137Y-89557483D01*
X131529327Y-89603899D01*
X131479706Y-89696733D01*
X131379538Y-89818788D01*
X131257483Y-89918956D01*
X131164649Y-89968577D01*
X131118233Y-89993387D01*
X131067866Y-90008665D01*
X130967135Y-90039222D01*
X130810000Y-90054698D01*
X130652866Y-90039222D01*
X130552135Y-90008665D01*
X130501768Y-89993387D01*
X130455352Y-89968577D01*
X130362518Y-89918956D01*
X130240463Y-89818788D01*
X130140295Y-89696733D01*
X130065864Y-89557482D01*
X130020028Y-89406385D01*
X130008430Y-89288625D01*
X130008430Y-88511376D01*
X130020028Y-88393616D01*
X130065863Y-88242519D01*
X130065863Y-88242518D01*
X130090673Y-88196102D01*
X130140294Y-88103268D01*
X130240462Y-87981212D01*
X130362517Y-87881044D01*
X130455351Y-87831423D01*
X130501767Y-87806613D01*
X130552134Y-87791335D01*
X130652865Y-87760778D01*
X130810000Y-87745302D01*
X130967134Y-87760778D01*
X130967134Y-87760778D01*
G37*
G36*
X128427134Y-87760778D02*
X128527865Y-87791335D01*
X128578232Y-87806613D01*
X128624648Y-87831423D01*
X128717482Y-87881044D01*
X128839538Y-87981212D01*
X128939706Y-88103267D01*
X128989327Y-88196101D01*
X129014137Y-88242517D01*
X129029415Y-88292884D01*
X129059972Y-88393615D01*
X129071570Y-88511375D01*
X129071570Y-89288625D01*
X129059972Y-89406385D01*
X129029415Y-89507116D01*
X129014137Y-89557483D01*
X128989327Y-89603899D01*
X128939706Y-89696733D01*
X128839538Y-89818788D01*
X128717483Y-89918956D01*
X128624649Y-89968577D01*
X128578233Y-89993387D01*
X128527866Y-90008665D01*
X128427135Y-90039222D01*
X128270000Y-90054698D01*
X128112866Y-90039222D01*
X128012135Y-90008665D01*
X127961768Y-89993387D01*
X127915352Y-89968577D01*
X127822518Y-89918956D01*
X127700463Y-89818788D01*
X127600295Y-89696733D01*
X127525864Y-89557482D01*
X127480028Y-89406385D01*
X127468430Y-89288625D01*
X127468430Y-88511376D01*
X127480028Y-88393616D01*
X127525863Y-88242519D01*
X127525863Y-88242518D01*
X127550673Y-88196102D01*
X127600294Y-88103268D01*
X127700462Y-87981212D01*
X127822517Y-87881044D01*
X127915351Y-87831423D01*
X127961767Y-87806613D01*
X128012134Y-87791335D01*
X128112865Y-87760778D01*
X128270000Y-87745302D01*
X128427134Y-87760778D01*
X128427134Y-87760778D01*
G37*
G36*
X125887134Y-87760778D02*
X125987865Y-87791335D01*
X126038232Y-87806613D01*
X126084648Y-87831423D01*
X126177482Y-87881044D01*
X126299538Y-87981212D01*
X126399706Y-88103267D01*
X126449327Y-88196101D01*
X126474137Y-88242517D01*
X126489415Y-88292884D01*
X126519972Y-88393615D01*
X126531570Y-88511375D01*
X126531570Y-89288625D01*
X126519972Y-89406385D01*
X126489415Y-89507116D01*
X126474137Y-89557483D01*
X126449327Y-89603899D01*
X126399706Y-89696733D01*
X126299538Y-89818788D01*
X126177483Y-89918956D01*
X126084649Y-89968577D01*
X126038233Y-89993387D01*
X125987866Y-90008665D01*
X125887135Y-90039222D01*
X125730000Y-90054698D01*
X125572866Y-90039222D01*
X125472135Y-90008665D01*
X125421768Y-89993387D01*
X125375352Y-89968577D01*
X125282518Y-89918956D01*
X125160463Y-89818788D01*
X125060295Y-89696733D01*
X124985864Y-89557482D01*
X124940028Y-89406385D01*
X124928430Y-89288625D01*
X124928430Y-88511376D01*
X124940028Y-88393616D01*
X124985863Y-88242519D01*
X124985863Y-88242518D01*
X125010673Y-88196102D01*
X125060294Y-88103268D01*
X125160462Y-87981212D01*
X125282517Y-87881044D01*
X125375351Y-87831423D01*
X125421767Y-87806613D01*
X125472134Y-87791335D01*
X125572865Y-87760778D01*
X125730000Y-87745302D01*
X125887134Y-87760778D01*
X125887134Y-87760778D01*
G37*
G36*
X123347134Y-87760778D02*
X123447865Y-87791335D01*
X123498232Y-87806613D01*
X123544648Y-87831423D01*
X123637482Y-87881044D01*
X123759538Y-87981212D01*
X123859706Y-88103267D01*
X123909327Y-88196101D01*
X123934137Y-88242517D01*
X123949415Y-88292884D01*
X123979972Y-88393615D01*
X123991570Y-88511375D01*
X123991570Y-89288625D01*
X123979972Y-89406385D01*
X123949415Y-89507116D01*
X123934137Y-89557483D01*
X123909327Y-89603899D01*
X123859706Y-89696733D01*
X123759538Y-89818788D01*
X123637483Y-89918956D01*
X123544649Y-89968577D01*
X123498233Y-89993387D01*
X123447866Y-90008665D01*
X123347135Y-90039222D01*
X123190000Y-90054698D01*
X123032866Y-90039222D01*
X122932135Y-90008665D01*
X122881768Y-89993387D01*
X122835352Y-89968577D01*
X122742518Y-89918956D01*
X122620463Y-89818788D01*
X122520295Y-89696733D01*
X122445864Y-89557482D01*
X122400028Y-89406385D01*
X122388430Y-89288625D01*
X122388430Y-88511376D01*
X122400028Y-88393616D01*
X122445863Y-88242519D01*
X122445863Y-88242518D01*
X122470673Y-88196102D01*
X122520294Y-88103268D01*
X122620462Y-87981212D01*
X122742517Y-87881044D01*
X122835351Y-87831423D01*
X122881767Y-87806613D01*
X122932134Y-87791335D01*
X123032865Y-87760778D01*
X123190000Y-87745302D01*
X123347134Y-87760778D01*
X123347134Y-87760778D01*
G37*
G36*
X120807134Y-87760778D02*
X120907865Y-87791335D01*
X120958232Y-87806613D01*
X121004648Y-87831423D01*
X121097482Y-87881044D01*
X121219538Y-87981212D01*
X121319706Y-88103267D01*
X121369327Y-88196101D01*
X121394137Y-88242517D01*
X121409415Y-88292884D01*
X121439972Y-88393615D01*
X121451570Y-88511375D01*
X121451570Y-89288625D01*
X121439972Y-89406385D01*
X121409415Y-89507116D01*
X121394137Y-89557483D01*
X121369327Y-89603899D01*
X121319706Y-89696733D01*
X121219538Y-89818788D01*
X121097483Y-89918956D01*
X121004649Y-89968577D01*
X120958233Y-89993387D01*
X120907866Y-90008665D01*
X120807135Y-90039222D01*
X120650000Y-90054698D01*
X120492866Y-90039222D01*
X120392135Y-90008665D01*
X120341768Y-89993387D01*
X120295352Y-89968577D01*
X120202518Y-89918956D01*
X120080463Y-89818788D01*
X119980295Y-89696733D01*
X119905864Y-89557482D01*
X119860028Y-89406385D01*
X119848430Y-89288625D01*
X119848430Y-88511376D01*
X119860028Y-88393616D01*
X119905863Y-88242519D01*
X119905863Y-88242518D01*
X119930673Y-88196102D01*
X119980294Y-88103268D01*
X120080462Y-87981212D01*
X120202517Y-87881044D01*
X120295351Y-87831423D01*
X120341767Y-87806613D01*
X120392134Y-87791335D01*
X120492865Y-87760778D01*
X120650000Y-87745302D01*
X120807134Y-87760778D01*
X120807134Y-87760778D01*
G37*
G36*
X118267134Y-87760778D02*
X118367865Y-87791335D01*
X118418232Y-87806613D01*
X118464648Y-87831423D01*
X118557482Y-87881044D01*
X118679538Y-87981212D01*
X118779706Y-88103267D01*
X118829327Y-88196101D01*
X118854137Y-88242517D01*
X118869415Y-88292884D01*
X118899972Y-88393615D01*
X118911570Y-88511375D01*
X118911570Y-89288625D01*
X118899972Y-89406385D01*
X118869415Y-89507116D01*
X118854137Y-89557483D01*
X118829327Y-89603899D01*
X118779706Y-89696733D01*
X118679538Y-89818788D01*
X118557483Y-89918956D01*
X118464649Y-89968577D01*
X118418233Y-89993387D01*
X118367866Y-90008665D01*
X118267135Y-90039222D01*
X118110000Y-90054698D01*
X117952866Y-90039222D01*
X117852135Y-90008665D01*
X117801768Y-89993387D01*
X117755352Y-89968577D01*
X117662518Y-89918956D01*
X117540463Y-89818788D01*
X117440295Y-89696733D01*
X117365864Y-89557482D01*
X117320028Y-89406385D01*
X117308430Y-89288625D01*
X117308430Y-88511376D01*
X117320028Y-88393616D01*
X117365863Y-88242519D01*
X117365863Y-88242518D01*
X117390673Y-88196102D01*
X117440294Y-88103268D01*
X117540462Y-87981212D01*
X117662517Y-87881044D01*
X117755351Y-87831423D01*
X117801767Y-87806613D01*
X117852134Y-87791335D01*
X117952865Y-87760778D01*
X118110000Y-87745302D01*
X118267134Y-87760778D01*
X118267134Y-87760778D01*
G37*
G36*
X113187134Y-87760778D02*
X113287865Y-87791335D01*
X113338232Y-87806613D01*
X113384648Y-87831423D01*
X113477482Y-87881044D01*
X113599538Y-87981212D01*
X113699706Y-88103267D01*
X113749327Y-88196101D01*
X113774137Y-88242517D01*
X113789415Y-88292884D01*
X113819972Y-88393615D01*
X113831570Y-88511375D01*
X113831570Y-89288625D01*
X113819972Y-89406385D01*
X113789415Y-89507116D01*
X113774137Y-89557483D01*
X113749327Y-89603899D01*
X113699706Y-89696733D01*
X113599538Y-89818788D01*
X113477483Y-89918956D01*
X113384649Y-89968577D01*
X113338233Y-89993387D01*
X113287866Y-90008665D01*
X113187135Y-90039222D01*
X113030000Y-90054698D01*
X112872866Y-90039222D01*
X112772135Y-90008665D01*
X112721768Y-89993387D01*
X112675352Y-89968577D01*
X112582518Y-89918956D01*
X112460463Y-89818788D01*
X112360295Y-89696733D01*
X112285864Y-89557482D01*
X112240028Y-89406385D01*
X112228430Y-89288625D01*
X112228430Y-88511376D01*
X112240028Y-88393616D01*
X112285863Y-88242519D01*
X112285863Y-88242518D01*
X112310673Y-88196102D01*
X112360294Y-88103268D01*
X112460462Y-87981212D01*
X112582517Y-87881044D01*
X112675351Y-87831423D01*
X112721767Y-87806613D01*
X112772134Y-87791335D01*
X112872865Y-87760778D01*
X113030000Y-87745302D01*
X113187134Y-87760778D01*
X113187134Y-87760778D01*
G37*
G36*
X146229294Y-83172633D02*
X146401694Y-83224931D01*
X146401696Y-83224932D01*
X146560583Y-83309859D01*
X146560585Y-83309860D01*
X146560584Y-83309860D01*
X146699849Y-83424151D01*
X146814140Y-83563416D01*
X146899069Y-83722306D01*
X146951367Y-83894706D01*
X146969025Y-84074000D01*
X146951367Y-84253294D01*
X146899069Y-84425694D01*
X146899068Y-84425696D01*
X146814141Y-84584583D01*
X146699849Y-84723849D01*
X146560583Y-84838141D01*
X146401696Y-84923068D01*
X146401694Y-84923069D01*
X146229294Y-84975367D01*
X146094931Y-84988600D01*
X146005069Y-84988600D01*
X145870706Y-84975367D01*
X145698306Y-84923069D01*
X145698304Y-84923068D01*
X145539417Y-84838141D01*
X145400151Y-84723849D01*
X145285859Y-84584583D01*
X145200932Y-84425696D01*
X145200931Y-84425694D01*
X145148633Y-84253294D01*
X145130975Y-84074000D01*
X145148633Y-83894706D01*
X145200931Y-83722306D01*
X145285860Y-83563416D01*
X145400151Y-83424151D01*
X145539416Y-83309860D01*
X145539415Y-83309860D01*
X145539417Y-83309859D01*
X145698304Y-83224932D01*
X145698306Y-83224931D01*
X145870706Y-83172633D01*
X146005069Y-83159400D01*
X146094931Y-83159400D01*
X146229294Y-83172633D01*
X146229294Y-83172633D01*
G37*
G36*
X148769294Y-83172633D02*
X148941694Y-83224931D01*
X148941696Y-83224932D01*
X149100583Y-83309859D01*
X149100585Y-83309860D01*
X149100584Y-83309860D01*
X149239849Y-83424151D01*
X149354140Y-83563416D01*
X149439069Y-83722306D01*
X149491367Y-83894706D01*
X149509025Y-84074000D01*
X149491367Y-84253294D01*
X149439069Y-84425694D01*
X149439068Y-84425696D01*
X149354141Y-84584583D01*
X149239849Y-84723849D01*
X149100583Y-84838141D01*
X148941696Y-84923068D01*
X148941694Y-84923069D01*
X148769294Y-84975367D01*
X148634931Y-84988600D01*
X148545069Y-84988600D01*
X148410706Y-84975367D01*
X148238306Y-84923069D01*
X148238304Y-84923068D01*
X148079417Y-84838141D01*
X147940151Y-84723849D01*
X147825859Y-84584583D01*
X147740932Y-84425696D01*
X147740931Y-84425694D01*
X147688633Y-84253294D01*
X147670975Y-84074000D01*
X147688633Y-83894706D01*
X147740931Y-83722306D01*
X147825860Y-83563416D01*
X147940151Y-83424151D01*
X148079416Y-83309860D01*
X148079415Y-83309860D01*
X148079417Y-83309859D01*
X148238304Y-83224932D01*
X148238306Y-83224931D01*
X148410706Y-83172633D01*
X148545069Y-83159400D01*
X148634931Y-83159400D01*
X148769294Y-83172633D01*
X148769294Y-83172633D01*
G37*
G36*
X148769294Y-80632633D02*
X148941694Y-80684931D01*
X148941696Y-80684932D01*
X149100583Y-80769859D01*
X149100585Y-80769860D01*
X149100584Y-80769860D01*
X149239849Y-80884151D01*
X149354140Y-81023416D01*
X149439069Y-81182306D01*
X149491367Y-81354706D01*
X149509025Y-81534000D01*
X149491367Y-81713294D01*
X149439069Y-81885694D01*
X149439068Y-81885696D01*
X149354141Y-82044583D01*
X149239849Y-82183849D01*
X149100583Y-82298141D01*
X148941696Y-82383068D01*
X148941694Y-82383069D01*
X148769294Y-82435367D01*
X148634931Y-82448600D01*
X148545069Y-82448600D01*
X148410706Y-82435367D01*
X148238306Y-82383069D01*
X148238304Y-82383068D01*
X148079417Y-82298141D01*
X147940151Y-82183849D01*
X147825859Y-82044583D01*
X147740932Y-81885696D01*
X147740931Y-81885694D01*
X147688633Y-81713294D01*
X147670975Y-81534000D01*
X147688633Y-81354706D01*
X147740931Y-81182306D01*
X147825860Y-81023416D01*
X147940151Y-80884151D01*
X148079416Y-80769860D01*
X148079415Y-80769860D01*
X148079417Y-80769859D01*
X148238304Y-80684932D01*
X148238306Y-80684931D01*
X148410706Y-80632633D01*
X148545069Y-80619400D01*
X148634931Y-80619400D01*
X148769294Y-80632633D01*
X148769294Y-80632633D01*
G37*
G36*
X146229294Y-80632633D02*
X146401694Y-80684931D01*
X146401696Y-80684932D01*
X146560583Y-80769859D01*
X146560585Y-80769860D01*
X146560584Y-80769860D01*
X146699849Y-80884151D01*
X146814140Y-81023416D01*
X146899069Y-81182306D01*
X146951367Y-81354706D01*
X146969025Y-81534000D01*
X146951367Y-81713294D01*
X146899069Y-81885694D01*
X146899068Y-81885696D01*
X146814141Y-82044583D01*
X146699849Y-82183849D01*
X146560583Y-82298141D01*
X146401696Y-82383068D01*
X146401694Y-82383069D01*
X146229294Y-82435367D01*
X146094931Y-82448600D01*
X146005069Y-82448600D01*
X145870706Y-82435367D01*
X145698306Y-82383069D01*
X145698304Y-82383068D01*
X145539417Y-82298141D01*
X145400151Y-82183849D01*
X145285859Y-82044583D01*
X145200932Y-81885696D01*
X145200931Y-81885694D01*
X145148633Y-81713294D01*
X145130975Y-81534000D01*
X145148633Y-81354706D01*
X145200931Y-81182306D01*
X145285860Y-81023416D01*
X145400151Y-80884151D01*
X145539416Y-80769860D01*
X145539415Y-80769860D01*
X145539417Y-80769859D01*
X145698304Y-80684932D01*
X145698306Y-80684931D01*
X145870706Y-80632633D01*
X146005069Y-80619400D01*
X146094931Y-80619400D01*
X146229294Y-80632633D01*
X146229294Y-80632633D01*
G37*
G36*
X141397878Y-80482296D02*
X141476385Y-80490028D01*
X141577116Y-80520585D01*
X141627483Y-80535863D01*
X141673899Y-80560673D01*
X141766733Y-80610294D01*
X141888788Y-80710462D01*
X141988956Y-80832517D01*
X142038577Y-80925351D01*
X142063387Y-80971767D01*
X142063387Y-80971768D01*
X142109222Y-81122865D01*
X142124698Y-81280000D01*
X142109222Y-81437135D01*
X142079838Y-81534000D01*
X142063387Y-81588233D01*
X142038577Y-81634649D01*
X141988956Y-81727483D01*
X141888788Y-81849538D01*
X141766733Y-81949706D01*
X141673899Y-81999327D01*
X141627483Y-82024137D01*
X141577116Y-82039415D01*
X141476385Y-82069972D01*
X141397878Y-82077704D01*
X141358626Y-82081570D01*
X140581374Y-82081570D01*
X140542122Y-82077704D01*
X140463615Y-82069972D01*
X140362884Y-82039415D01*
X140312517Y-82024137D01*
X140266101Y-81999327D01*
X140173267Y-81949706D01*
X140051212Y-81849538D01*
X139951044Y-81727483D01*
X139901423Y-81634649D01*
X139876613Y-81588233D01*
X139860162Y-81534000D01*
X139830778Y-81437135D01*
X139815302Y-81280000D01*
X139830778Y-81122865D01*
X139876613Y-80971768D01*
X139876613Y-80971767D01*
X139901423Y-80925351D01*
X139951044Y-80832517D01*
X140051212Y-80710462D01*
X140173267Y-80610294D01*
X140266101Y-80560673D01*
X140312517Y-80535863D01*
X140362884Y-80520585D01*
X140463615Y-80490028D01*
X140542122Y-80482296D01*
X140581374Y-80478430D01*
X141358626Y-80478430D01*
X141397878Y-80482296D01*
X141397878Y-80482296D01*
G37*
G36*
X146229294Y-78092633D02*
X146401694Y-78144931D01*
X146401696Y-78144932D01*
X146560583Y-78229859D01*
X146560585Y-78229860D01*
X146560584Y-78229860D01*
X146699849Y-78344151D01*
X146814140Y-78483416D01*
X146899069Y-78642306D01*
X146951367Y-78814706D01*
X146969025Y-78994000D01*
X146951367Y-79173294D01*
X146899069Y-79345694D01*
X146899068Y-79345696D01*
X146814141Y-79504583D01*
X146699849Y-79643849D01*
X146560583Y-79758141D01*
X146401696Y-79843068D01*
X146401694Y-79843069D01*
X146229294Y-79895367D01*
X146094931Y-79908600D01*
X146005069Y-79908600D01*
X145870706Y-79895367D01*
X145698306Y-79843069D01*
X145698304Y-79843068D01*
X145539417Y-79758141D01*
X145400151Y-79643849D01*
X145285859Y-79504583D01*
X145200932Y-79345696D01*
X145200931Y-79345694D01*
X145148633Y-79173294D01*
X145130975Y-78994000D01*
X145148633Y-78814706D01*
X145200931Y-78642306D01*
X145285860Y-78483416D01*
X145400151Y-78344151D01*
X145539416Y-78229860D01*
X145539415Y-78229860D01*
X145539417Y-78229859D01*
X145698304Y-78144932D01*
X145698306Y-78144931D01*
X145870706Y-78092633D01*
X146005069Y-78079400D01*
X146094931Y-78079400D01*
X146229294Y-78092633D01*
X146229294Y-78092633D01*
G37*
G36*
X148769294Y-78092633D02*
X148941694Y-78144931D01*
X148941696Y-78144932D01*
X149100583Y-78229859D01*
X149100585Y-78229860D01*
X149100584Y-78229860D01*
X149239849Y-78344151D01*
X149354140Y-78483416D01*
X149439069Y-78642306D01*
X149491367Y-78814706D01*
X149509025Y-78994000D01*
X149491367Y-79173294D01*
X149439069Y-79345694D01*
X149439068Y-79345696D01*
X149354141Y-79504583D01*
X149239849Y-79643849D01*
X149100583Y-79758141D01*
X148941696Y-79843068D01*
X148941694Y-79843069D01*
X148769294Y-79895367D01*
X148634931Y-79908600D01*
X148545069Y-79908600D01*
X148410706Y-79895367D01*
X148238306Y-79843069D01*
X148238304Y-79843068D01*
X148079417Y-79758141D01*
X147940151Y-79643849D01*
X147825859Y-79504583D01*
X147740932Y-79345696D01*
X147740931Y-79345694D01*
X147688633Y-79173294D01*
X147670975Y-78994000D01*
X147688633Y-78814706D01*
X147740931Y-78642306D01*
X147825860Y-78483416D01*
X147940151Y-78344151D01*
X148079416Y-78229860D01*
X148079415Y-78229860D01*
X148079417Y-78229859D01*
X148238304Y-78144932D01*
X148238306Y-78144931D01*
X148410706Y-78092633D01*
X148545069Y-78079400D01*
X148634931Y-78079400D01*
X148769294Y-78092633D01*
X148769294Y-78092633D01*
G37*
G36*
X141397878Y-77942296D02*
X141476385Y-77950028D01*
X141577116Y-77980585D01*
X141627483Y-77995863D01*
X141673899Y-78020673D01*
X141766733Y-78070294D01*
X141888788Y-78170462D01*
X141988956Y-78292517D01*
X142038577Y-78385351D01*
X142063387Y-78431767D01*
X142063387Y-78431768D01*
X142109222Y-78582865D01*
X142124698Y-78740000D01*
X142109222Y-78897135D01*
X142079838Y-78994000D01*
X142063387Y-79048233D01*
X142038577Y-79094649D01*
X141988956Y-79187483D01*
X141888788Y-79309538D01*
X141766733Y-79409706D01*
X141673899Y-79459327D01*
X141627483Y-79484137D01*
X141577116Y-79499415D01*
X141476385Y-79529972D01*
X141397878Y-79537704D01*
X141358626Y-79541570D01*
X140581374Y-79541570D01*
X140542122Y-79537704D01*
X140463615Y-79529972D01*
X140362884Y-79499415D01*
X140312517Y-79484137D01*
X140266101Y-79459327D01*
X140173267Y-79409706D01*
X140051212Y-79309538D01*
X139951044Y-79187483D01*
X139901423Y-79094649D01*
X139876613Y-79048233D01*
X139860162Y-78994000D01*
X139830778Y-78897135D01*
X139815302Y-78740000D01*
X139830778Y-78582865D01*
X139876613Y-78431768D01*
X139876613Y-78431767D01*
X139901423Y-78385351D01*
X139951044Y-78292517D01*
X140051212Y-78170462D01*
X140173267Y-78070294D01*
X140266101Y-78020673D01*
X140312517Y-77995863D01*
X140362884Y-77980585D01*
X140463615Y-77950028D01*
X140542122Y-77942296D01*
X140581374Y-77938430D01*
X141358626Y-77938430D01*
X141397878Y-77942296D01*
X141397878Y-77942296D01*
G37*
G36*
X146964600Y-77368600D02*
X145135400Y-77368600D01*
X145135400Y-75539400D01*
X146964600Y-75539400D01*
X146964600Y-77368600D01*
X146964600Y-77368600D01*
G37*
G36*
X148769294Y-75552633D02*
X148941694Y-75604931D01*
X148941696Y-75604932D01*
X149100583Y-75689859D01*
X149100585Y-75689860D01*
X149100584Y-75689860D01*
X149239849Y-75804151D01*
X149354140Y-75943416D01*
X149439069Y-76102306D01*
X149491367Y-76274706D01*
X149509025Y-76454000D01*
X149491367Y-76633294D01*
X149439069Y-76805694D01*
X149439068Y-76805696D01*
X149354141Y-76964583D01*
X149239849Y-77103849D01*
X149100583Y-77218141D01*
X148959808Y-77293387D01*
X148941694Y-77303069D01*
X148769294Y-77355367D01*
X148634931Y-77368600D01*
X148545069Y-77368600D01*
X148410706Y-77355367D01*
X148238306Y-77303069D01*
X148220192Y-77293387D01*
X148079417Y-77218141D01*
X147940151Y-77103849D01*
X147825859Y-76964583D01*
X147740932Y-76805696D01*
X147740931Y-76805694D01*
X147688633Y-76633294D01*
X147670975Y-76454000D01*
X147688633Y-76274706D01*
X147740931Y-76102306D01*
X147825860Y-75943416D01*
X147940151Y-75804151D01*
X148079416Y-75689860D01*
X148079415Y-75689860D01*
X148079417Y-75689859D01*
X148238304Y-75604932D01*
X148238306Y-75604931D01*
X148410706Y-75552633D01*
X148545069Y-75539400D01*
X148634931Y-75539400D01*
X148769294Y-75552633D01*
X148769294Y-75552633D01*
G37*
G36*
X132237134Y-75060778D02*
X132337865Y-75091335D01*
X132388232Y-75106613D01*
X132434648Y-75131423D01*
X132527482Y-75181044D01*
X132649538Y-75281212D01*
X132749706Y-75403267D01*
X132777819Y-75455863D01*
X132824137Y-75542517D01*
X132827206Y-75552634D01*
X132869972Y-75693615D01*
X132881570Y-75811375D01*
X132881570Y-76588625D01*
X132869972Y-76706385D01*
X132839847Y-76805694D01*
X132824137Y-76857483D01*
X132799327Y-76903899D01*
X132749706Y-76996733D01*
X132649538Y-77118788D01*
X132527483Y-77218956D01*
X132434649Y-77268577D01*
X132388233Y-77293387D01*
X132356315Y-77303069D01*
X132237135Y-77339222D01*
X132080000Y-77354698D01*
X131922866Y-77339222D01*
X131803686Y-77303069D01*
X131771768Y-77293387D01*
X131725352Y-77268577D01*
X131632518Y-77218956D01*
X131510463Y-77118788D01*
X131410295Y-76996733D01*
X131335864Y-76857482D01*
X131320154Y-76805694D01*
X131290028Y-76706386D01*
X131278430Y-76588626D01*
X131278430Y-75811375D01*
X131290028Y-75693618D01*
X131290028Y-75693616D01*
X131320585Y-75592885D01*
X131335863Y-75542518D01*
X131360673Y-75496102D01*
X131410294Y-75403268D01*
X131510462Y-75281212D01*
X131632517Y-75181044D01*
X131725351Y-75131423D01*
X131771767Y-75106613D01*
X131822134Y-75091335D01*
X131922865Y-75060778D01*
X132080000Y-75045302D01*
X132237134Y-75060778D01*
X132237134Y-75060778D01*
G37*
G36*
X134777134Y-75060778D02*
X134877865Y-75091335D01*
X134928232Y-75106613D01*
X134974648Y-75131423D01*
X135067482Y-75181044D01*
X135189538Y-75281212D01*
X135289706Y-75403267D01*
X135317819Y-75455863D01*
X135364137Y-75542517D01*
X135367206Y-75552634D01*
X135409972Y-75693615D01*
X135421570Y-75811375D01*
X135421570Y-76588625D01*
X135409972Y-76706385D01*
X135379847Y-76805694D01*
X135364137Y-76857483D01*
X135339327Y-76903899D01*
X135289706Y-76996733D01*
X135189538Y-77118788D01*
X135067483Y-77218956D01*
X134974649Y-77268577D01*
X134928233Y-77293387D01*
X134896315Y-77303069D01*
X134777135Y-77339222D01*
X134620000Y-77354698D01*
X134462866Y-77339222D01*
X134343686Y-77303069D01*
X134311768Y-77293387D01*
X134265352Y-77268577D01*
X134172518Y-77218956D01*
X134050463Y-77118788D01*
X133950295Y-76996733D01*
X133875864Y-76857482D01*
X133860154Y-76805694D01*
X133830028Y-76706386D01*
X133818430Y-76588626D01*
X133818430Y-75811375D01*
X133830028Y-75693618D01*
X133830028Y-75693616D01*
X133860585Y-75592885D01*
X133875863Y-75542518D01*
X133900673Y-75496102D01*
X133950294Y-75403268D01*
X134050462Y-75281212D01*
X134172517Y-75181044D01*
X134265351Y-75131423D01*
X134311767Y-75106613D01*
X134362134Y-75091335D01*
X134462865Y-75060778D01*
X134620000Y-75045302D01*
X134777134Y-75060778D01*
X134777134Y-75060778D01*
G37*
G36*
X122077134Y-75060778D02*
X122177865Y-75091335D01*
X122228232Y-75106613D01*
X122274648Y-75131423D01*
X122367482Y-75181044D01*
X122489538Y-75281212D01*
X122589706Y-75403267D01*
X122617819Y-75455863D01*
X122664137Y-75542517D01*
X122667206Y-75552634D01*
X122709972Y-75693615D01*
X122721570Y-75811375D01*
X122721570Y-76588625D01*
X122709972Y-76706385D01*
X122679847Y-76805694D01*
X122664137Y-76857483D01*
X122639327Y-76903899D01*
X122589706Y-76996733D01*
X122489538Y-77118788D01*
X122367483Y-77218956D01*
X122274649Y-77268577D01*
X122228233Y-77293387D01*
X122196315Y-77303069D01*
X122077135Y-77339222D01*
X121920000Y-77354698D01*
X121762866Y-77339222D01*
X121643686Y-77303069D01*
X121611768Y-77293387D01*
X121565352Y-77268577D01*
X121472518Y-77218956D01*
X121350463Y-77118788D01*
X121250295Y-76996733D01*
X121175864Y-76857482D01*
X121160154Y-76805694D01*
X121130028Y-76706386D01*
X121118430Y-76588626D01*
X121118430Y-75811375D01*
X121130028Y-75693618D01*
X121130028Y-75693616D01*
X121160585Y-75592885D01*
X121175863Y-75542518D01*
X121200673Y-75496102D01*
X121250294Y-75403268D01*
X121350462Y-75281212D01*
X121472517Y-75181044D01*
X121565351Y-75131423D01*
X121611767Y-75106613D01*
X121662134Y-75091335D01*
X121762865Y-75060778D01*
X121920000Y-75045302D01*
X122077134Y-75060778D01*
X122077134Y-75060778D01*
G37*
G36*
X124617134Y-75060778D02*
X124717865Y-75091335D01*
X124768232Y-75106613D01*
X124814648Y-75131423D01*
X124907482Y-75181044D01*
X125029538Y-75281212D01*
X125129706Y-75403267D01*
X125157819Y-75455863D01*
X125204137Y-75542517D01*
X125207206Y-75552634D01*
X125249972Y-75693615D01*
X125261570Y-75811375D01*
X125261570Y-76588625D01*
X125249972Y-76706385D01*
X125219847Y-76805694D01*
X125204137Y-76857483D01*
X125179327Y-76903899D01*
X125129706Y-76996733D01*
X125029538Y-77118788D01*
X124907483Y-77218956D01*
X124814649Y-77268577D01*
X124768233Y-77293387D01*
X124736315Y-77303069D01*
X124617135Y-77339222D01*
X124460000Y-77354698D01*
X124302866Y-77339222D01*
X124183686Y-77303069D01*
X124151768Y-77293387D01*
X124105352Y-77268577D01*
X124012518Y-77218956D01*
X123890463Y-77118788D01*
X123790295Y-76996733D01*
X123715864Y-76857482D01*
X123700154Y-76805694D01*
X123670028Y-76706386D01*
X123658430Y-76588626D01*
X123658430Y-75811375D01*
X123670028Y-75693618D01*
X123670028Y-75693616D01*
X123700585Y-75592885D01*
X123715863Y-75542518D01*
X123740673Y-75496102D01*
X123790294Y-75403268D01*
X123890462Y-75281212D01*
X124012517Y-75181044D01*
X124105351Y-75131423D01*
X124151767Y-75106613D01*
X124202134Y-75091335D01*
X124302865Y-75060778D01*
X124460000Y-75045302D01*
X124617134Y-75060778D01*
X124617134Y-75060778D01*
G37*
G36*
X141397878Y-75402296D02*
X141476385Y-75410028D01*
X141577116Y-75440585D01*
X141627483Y-75455863D01*
X141673899Y-75480673D01*
X141766733Y-75530294D01*
X141888788Y-75630462D01*
X141988956Y-75752517D01*
X142038577Y-75845351D01*
X142063387Y-75891767D01*
X142063387Y-75891768D01*
X142109222Y-76042865D01*
X142124698Y-76200000D01*
X142109222Y-76357135D01*
X142079838Y-76454000D01*
X142063387Y-76508233D01*
X142038577Y-76554649D01*
X141988956Y-76647483D01*
X141888788Y-76769538D01*
X141766733Y-76869706D01*
X141673899Y-76919327D01*
X141627483Y-76944137D01*
X141577116Y-76959415D01*
X141476385Y-76989972D01*
X141407737Y-76996733D01*
X141358626Y-77001570D01*
X140581374Y-77001570D01*
X140532263Y-76996733D01*
X140463615Y-76989972D01*
X140362884Y-76959415D01*
X140312517Y-76944137D01*
X140266101Y-76919327D01*
X140173267Y-76869706D01*
X140051212Y-76769538D01*
X139951044Y-76647483D01*
X139901423Y-76554649D01*
X139876613Y-76508233D01*
X139860162Y-76454000D01*
X139830778Y-76357135D01*
X139815302Y-76200000D01*
X139830778Y-76042865D01*
X139876613Y-75891768D01*
X139876613Y-75891767D01*
X139901423Y-75845351D01*
X139951044Y-75752517D01*
X140051212Y-75630462D01*
X140173267Y-75530294D01*
X140266101Y-75480673D01*
X140312517Y-75455863D01*
X140362884Y-75440585D01*
X140463615Y-75410028D01*
X140542122Y-75402296D01*
X140581374Y-75398430D01*
X141358626Y-75398430D01*
X141397878Y-75402296D01*
X141397878Y-75402296D01*
G37*
G36*
X141127134Y-72520778D02*
X141227865Y-72551335D01*
X141278232Y-72566613D01*
X141324648Y-72591423D01*
X141417482Y-72641044D01*
X141539538Y-72741212D01*
X141639706Y-72863267D01*
X141689327Y-72956101D01*
X141714137Y-73002517D01*
X141729415Y-73052884D01*
X141759972Y-73153615D01*
X141771570Y-73271375D01*
X141771570Y-74048625D01*
X141759972Y-74166385D01*
X141729415Y-74267116D01*
X141714137Y-74317483D01*
X141689327Y-74363899D01*
X141639706Y-74456733D01*
X141539538Y-74578788D01*
X141417483Y-74678956D01*
X141324649Y-74728577D01*
X141278233Y-74753387D01*
X141227866Y-74768665D01*
X141127135Y-74799222D01*
X140970000Y-74814698D01*
X140812866Y-74799222D01*
X140712135Y-74768665D01*
X140661768Y-74753387D01*
X140615352Y-74728577D01*
X140522518Y-74678956D01*
X140400463Y-74578788D01*
X140300295Y-74456733D01*
X140225864Y-74317482D01*
X140180028Y-74166385D01*
X140168430Y-74048625D01*
X140168430Y-73271376D01*
X140180028Y-73153616D01*
X140225863Y-73002519D01*
X140225863Y-73002518D01*
X140250673Y-72956102D01*
X140300294Y-72863268D01*
X140400462Y-72741212D01*
X140522517Y-72641044D01*
X140615351Y-72591423D01*
X140661767Y-72566613D01*
X140712134Y-72551335D01*
X140812865Y-72520778D01*
X140970000Y-72505302D01*
X141127134Y-72520778D01*
X141127134Y-72520778D01*
G37*
G36*
X138587134Y-72520778D02*
X138687865Y-72551335D01*
X138738232Y-72566613D01*
X138784648Y-72591423D01*
X138877482Y-72641044D01*
X138999538Y-72741212D01*
X139099706Y-72863267D01*
X139149327Y-72956101D01*
X139174137Y-73002517D01*
X139189415Y-73052884D01*
X139219972Y-73153615D01*
X139231570Y-73271375D01*
X139231570Y-74048625D01*
X139219972Y-74166385D01*
X139189415Y-74267116D01*
X139174137Y-74317483D01*
X139149327Y-74363899D01*
X139099706Y-74456733D01*
X138999538Y-74578788D01*
X138877483Y-74678956D01*
X138784649Y-74728577D01*
X138738233Y-74753387D01*
X138687866Y-74768665D01*
X138587135Y-74799222D01*
X138430000Y-74814698D01*
X138272866Y-74799222D01*
X138172135Y-74768665D01*
X138121768Y-74753387D01*
X138075352Y-74728577D01*
X137982518Y-74678956D01*
X137860463Y-74578788D01*
X137760295Y-74456733D01*
X137685864Y-74317482D01*
X137640028Y-74166385D01*
X137628430Y-74048625D01*
X137628430Y-73271376D01*
X137640028Y-73153616D01*
X137685863Y-73002519D01*
X137685863Y-73002518D01*
X137710673Y-72956102D01*
X137760294Y-72863268D01*
X137860462Y-72741212D01*
X137982517Y-72641044D01*
X138075351Y-72591423D01*
X138121767Y-72566613D01*
X138172134Y-72551335D01*
X138272865Y-72520778D01*
X138430000Y-72505302D01*
X138587134Y-72520778D01*
X138587134Y-72520778D01*
G37*
G36*
X120807134Y-72520778D02*
X120907865Y-72551335D01*
X120958232Y-72566613D01*
X121004648Y-72591423D01*
X121097482Y-72641044D01*
X121219538Y-72741212D01*
X121319706Y-72863267D01*
X121369327Y-72956101D01*
X121394137Y-73002517D01*
X121409415Y-73052884D01*
X121439972Y-73153615D01*
X121451570Y-73271375D01*
X121451570Y-74048625D01*
X121439972Y-74166385D01*
X121409415Y-74267116D01*
X121394137Y-74317483D01*
X121369327Y-74363899D01*
X121319706Y-74456733D01*
X121219538Y-74578788D01*
X121097483Y-74678956D01*
X121004649Y-74728577D01*
X120958233Y-74753387D01*
X120907866Y-74768665D01*
X120807135Y-74799222D01*
X120650000Y-74814698D01*
X120492866Y-74799222D01*
X120392135Y-74768665D01*
X120341768Y-74753387D01*
X120295352Y-74728577D01*
X120202518Y-74678956D01*
X120080463Y-74578788D01*
X119980295Y-74456733D01*
X119905864Y-74317482D01*
X119860028Y-74166385D01*
X119848430Y-74048625D01*
X119848430Y-73271376D01*
X119860028Y-73153616D01*
X119905863Y-73002519D01*
X119905863Y-73002518D01*
X119930673Y-72956102D01*
X119980294Y-72863268D01*
X120080462Y-72741212D01*
X120202517Y-72641044D01*
X120295351Y-72591423D01*
X120341767Y-72566613D01*
X120392134Y-72551335D01*
X120492865Y-72520778D01*
X120650000Y-72505302D01*
X120807134Y-72520778D01*
X120807134Y-72520778D01*
G37*
G36*
X136047134Y-72520778D02*
X136147865Y-72551335D01*
X136198232Y-72566613D01*
X136244648Y-72591423D01*
X136337482Y-72641044D01*
X136459538Y-72741212D01*
X136559706Y-72863267D01*
X136609327Y-72956101D01*
X136634137Y-73002517D01*
X136649415Y-73052884D01*
X136679972Y-73153615D01*
X136691570Y-73271375D01*
X136691570Y-74048625D01*
X136679972Y-74166385D01*
X136649415Y-74267116D01*
X136634137Y-74317483D01*
X136609327Y-74363899D01*
X136559706Y-74456733D01*
X136459538Y-74578788D01*
X136337483Y-74678956D01*
X136244649Y-74728577D01*
X136198233Y-74753387D01*
X136147866Y-74768665D01*
X136047135Y-74799222D01*
X135890000Y-74814698D01*
X135732866Y-74799222D01*
X135632135Y-74768665D01*
X135581768Y-74753387D01*
X135535352Y-74728577D01*
X135442518Y-74678956D01*
X135320463Y-74578788D01*
X135220295Y-74456733D01*
X135145864Y-74317482D01*
X135100028Y-74166385D01*
X135088430Y-74048625D01*
X135088430Y-73271376D01*
X135100028Y-73153616D01*
X135145863Y-73002519D01*
X135145863Y-73002518D01*
X135170673Y-72956102D01*
X135220294Y-72863268D01*
X135320462Y-72741212D01*
X135442517Y-72641044D01*
X135535351Y-72591423D01*
X135581767Y-72566613D01*
X135632134Y-72551335D01*
X135732865Y-72520778D01*
X135890000Y-72505302D01*
X136047134Y-72520778D01*
X136047134Y-72520778D01*
G37*
G36*
X133507134Y-72520778D02*
X133607865Y-72551335D01*
X133658232Y-72566613D01*
X133704648Y-72591423D01*
X133797482Y-72641044D01*
X133919538Y-72741212D01*
X134019706Y-72863267D01*
X134069327Y-72956101D01*
X134094137Y-73002517D01*
X134109415Y-73052884D01*
X134139972Y-73153615D01*
X134151570Y-73271375D01*
X134151570Y-74048625D01*
X134139972Y-74166385D01*
X134109415Y-74267116D01*
X134094137Y-74317483D01*
X134069327Y-74363899D01*
X134019706Y-74456733D01*
X133919538Y-74578788D01*
X133797483Y-74678956D01*
X133704649Y-74728577D01*
X133658233Y-74753387D01*
X133607866Y-74768665D01*
X133507135Y-74799222D01*
X133350000Y-74814698D01*
X133192866Y-74799222D01*
X133092135Y-74768665D01*
X133041768Y-74753387D01*
X132995352Y-74728577D01*
X132902518Y-74678956D01*
X132780463Y-74578788D01*
X132680295Y-74456733D01*
X132605864Y-74317482D01*
X132560028Y-74166385D01*
X132548430Y-74048625D01*
X132548430Y-73271376D01*
X132560028Y-73153616D01*
X132605863Y-73002519D01*
X132605863Y-73002518D01*
X132630673Y-72956102D01*
X132680294Y-72863268D01*
X132780462Y-72741212D01*
X132902517Y-72641044D01*
X132995351Y-72591423D01*
X133041767Y-72566613D01*
X133092134Y-72551335D01*
X133192865Y-72520778D01*
X133350000Y-72505302D01*
X133507134Y-72520778D01*
X133507134Y-72520778D01*
G37*
G36*
X130967134Y-72520778D02*
X131067865Y-72551335D01*
X131118232Y-72566613D01*
X131164648Y-72591423D01*
X131257482Y-72641044D01*
X131379538Y-72741212D01*
X131479706Y-72863267D01*
X131529327Y-72956101D01*
X131554137Y-73002517D01*
X131569415Y-73052884D01*
X131599972Y-73153615D01*
X131611570Y-73271375D01*
X131611570Y-74048625D01*
X131599972Y-74166385D01*
X131569415Y-74267116D01*
X131554137Y-74317483D01*
X131529327Y-74363899D01*
X131479706Y-74456733D01*
X131379538Y-74578788D01*
X131257483Y-74678956D01*
X131164649Y-74728577D01*
X131118233Y-74753387D01*
X131067866Y-74768665D01*
X130967135Y-74799222D01*
X130810000Y-74814698D01*
X130652866Y-74799222D01*
X130552135Y-74768665D01*
X130501768Y-74753387D01*
X130455352Y-74728577D01*
X130362518Y-74678956D01*
X130240463Y-74578788D01*
X130140295Y-74456733D01*
X130065864Y-74317482D01*
X130020028Y-74166385D01*
X130008430Y-74048625D01*
X130008430Y-73271376D01*
X130020028Y-73153616D01*
X130065863Y-73002519D01*
X130065863Y-73002518D01*
X130090673Y-72956102D01*
X130140294Y-72863268D01*
X130240462Y-72741212D01*
X130362517Y-72641044D01*
X130455351Y-72591423D01*
X130501767Y-72566613D01*
X130552134Y-72551335D01*
X130652865Y-72520778D01*
X130810000Y-72505302D01*
X130967134Y-72520778D01*
X130967134Y-72520778D01*
G37*
G36*
X113187134Y-72520778D02*
X113287865Y-72551335D01*
X113338232Y-72566613D01*
X113384648Y-72591423D01*
X113477482Y-72641044D01*
X113599538Y-72741212D01*
X113699706Y-72863267D01*
X113749327Y-72956101D01*
X113774137Y-73002517D01*
X113789415Y-73052884D01*
X113819972Y-73153615D01*
X113831570Y-73271375D01*
X113831570Y-74048625D01*
X113819972Y-74166385D01*
X113789415Y-74267116D01*
X113774137Y-74317483D01*
X113749327Y-74363899D01*
X113699706Y-74456733D01*
X113599538Y-74578788D01*
X113477483Y-74678956D01*
X113384649Y-74728577D01*
X113338233Y-74753387D01*
X113287866Y-74768665D01*
X113187135Y-74799222D01*
X113030000Y-74814698D01*
X112872866Y-74799222D01*
X112772135Y-74768665D01*
X112721768Y-74753387D01*
X112675352Y-74728577D01*
X112582518Y-74678956D01*
X112460463Y-74578788D01*
X112360295Y-74456733D01*
X112285864Y-74317482D01*
X112240028Y-74166385D01*
X112228430Y-74048625D01*
X112228430Y-73271376D01*
X112240028Y-73153616D01*
X112285863Y-73002519D01*
X112285863Y-73002518D01*
X112310673Y-72956102D01*
X112360294Y-72863268D01*
X112460462Y-72741212D01*
X112582517Y-72641044D01*
X112675351Y-72591423D01*
X112721767Y-72566613D01*
X112772134Y-72551335D01*
X112872865Y-72520778D01*
X113030000Y-72505302D01*
X113187134Y-72520778D01*
X113187134Y-72520778D01*
G37*
G36*
X115727134Y-72520778D02*
X115827865Y-72551335D01*
X115878232Y-72566613D01*
X115924648Y-72591423D01*
X116017482Y-72641044D01*
X116139538Y-72741212D01*
X116239706Y-72863267D01*
X116289327Y-72956101D01*
X116314137Y-73002517D01*
X116329415Y-73052884D01*
X116359972Y-73153615D01*
X116371570Y-73271375D01*
X116371570Y-74048625D01*
X116359972Y-74166385D01*
X116329415Y-74267116D01*
X116314137Y-74317483D01*
X116289327Y-74363899D01*
X116239706Y-74456733D01*
X116139538Y-74578788D01*
X116017483Y-74678956D01*
X115924649Y-74728577D01*
X115878233Y-74753387D01*
X115827866Y-74768665D01*
X115727135Y-74799222D01*
X115570000Y-74814698D01*
X115412866Y-74799222D01*
X115312135Y-74768665D01*
X115261768Y-74753387D01*
X115215352Y-74728577D01*
X115122518Y-74678956D01*
X115000463Y-74578788D01*
X114900295Y-74456733D01*
X114825864Y-74317482D01*
X114780028Y-74166385D01*
X114768430Y-74048625D01*
X114768430Y-73271376D01*
X114780028Y-73153616D01*
X114825863Y-73002519D01*
X114825863Y-73002518D01*
X114850673Y-72956102D01*
X114900294Y-72863268D01*
X115000462Y-72741212D01*
X115122517Y-72641044D01*
X115215351Y-72591423D01*
X115261767Y-72566613D01*
X115312134Y-72551335D01*
X115412865Y-72520778D01*
X115570000Y-72505302D01*
X115727134Y-72520778D01*
X115727134Y-72520778D01*
G37*
G36*
X118267134Y-72520778D02*
X118367865Y-72551335D01*
X118418232Y-72566613D01*
X118464648Y-72591423D01*
X118557482Y-72641044D01*
X118679538Y-72741212D01*
X118779706Y-72863267D01*
X118829327Y-72956101D01*
X118854137Y-73002517D01*
X118869415Y-73052884D01*
X118899972Y-73153615D01*
X118911570Y-73271375D01*
X118911570Y-74048625D01*
X118899972Y-74166385D01*
X118869415Y-74267116D01*
X118854137Y-74317483D01*
X118829327Y-74363899D01*
X118779706Y-74456733D01*
X118679538Y-74578788D01*
X118557483Y-74678956D01*
X118464649Y-74728577D01*
X118418233Y-74753387D01*
X118367866Y-74768665D01*
X118267135Y-74799222D01*
X118110000Y-74814698D01*
X117952866Y-74799222D01*
X117852135Y-74768665D01*
X117801768Y-74753387D01*
X117755352Y-74728577D01*
X117662518Y-74678956D01*
X117540463Y-74578788D01*
X117440295Y-74456733D01*
X117365864Y-74317482D01*
X117320028Y-74166385D01*
X117308430Y-74048625D01*
X117308430Y-73271376D01*
X117320028Y-73153616D01*
X117365863Y-73002519D01*
X117365863Y-73002518D01*
X117390673Y-72956102D01*
X117440294Y-72863268D01*
X117540462Y-72741212D01*
X117662517Y-72641044D01*
X117755351Y-72591423D01*
X117801767Y-72566613D01*
X117852134Y-72551335D01*
X117952865Y-72520778D01*
X118110000Y-72505302D01*
X118267134Y-72520778D01*
X118267134Y-72520778D01*
G37*
G36*
X123347134Y-72520778D02*
X123447865Y-72551335D01*
X123498232Y-72566613D01*
X123544648Y-72591423D01*
X123637482Y-72641044D01*
X123759538Y-72741212D01*
X123859706Y-72863267D01*
X123909327Y-72956101D01*
X123934137Y-73002517D01*
X123949415Y-73052884D01*
X123979972Y-73153615D01*
X123991570Y-73271375D01*
X123991570Y-74048625D01*
X123979972Y-74166385D01*
X123949415Y-74267116D01*
X123934137Y-74317483D01*
X123909327Y-74363899D01*
X123859706Y-74456733D01*
X123759538Y-74578788D01*
X123637483Y-74678956D01*
X123544649Y-74728577D01*
X123498233Y-74753387D01*
X123447866Y-74768665D01*
X123347135Y-74799222D01*
X123190000Y-74814698D01*
X123032866Y-74799222D01*
X122932135Y-74768665D01*
X122881768Y-74753387D01*
X122835352Y-74728577D01*
X122742518Y-74678956D01*
X122620463Y-74578788D01*
X122520295Y-74456733D01*
X122445864Y-74317482D01*
X122400028Y-74166385D01*
X122388430Y-74048625D01*
X122388430Y-73271376D01*
X122400028Y-73153616D01*
X122445863Y-73002519D01*
X122445863Y-73002518D01*
X122470673Y-72956102D01*
X122520294Y-72863268D01*
X122620462Y-72741212D01*
X122742517Y-72641044D01*
X122835351Y-72591423D01*
X122881767Y-72566613D01*
X122932134Y-72551335D01*
X123032865Y-72520778D01*
X123190000Y-72505302D01*
X123347134Y-72520778D01*
X123347134Y-72520778D01*
G37*
G36*
X125887134Y-72520778D02*
X125987865Y-72551335D01*
X126038232Y-72566613D01*
X126084648Y-72591423D01*
X126177482Y-72641044D01*
X126299538Y-72741212D01*
X126399706Y-72863267D01*
X126449327Y-72956101D01*
X126474137Y-73002517D01*
X126489415Y-73052884D01*
X126519972Y-73153615D01*
X126531570Y-73271375D01*
X126531570Y-74048625D01*
X126519972Y-74166385D01*
X126489415Y-74267116D01*
X126474137Y-74317483D01*
X126449327Y-74363899D01*
X126399706Y-74456733D01*
X126299538Y-74578788D01*
X126177483Y-74678956D01*
X126084649Y-74728577D01*
X126038233Y-74753387D01*
X125987866Y-74768665D01*
X125887135Y-74799222D01*
X125730000Y-74814698D01*
X125572866Y-74799222D01*
X125472135Y-74768665D01*
X125421768Y-74753387D01*
X125375352Y-74728577D01*
X125282518Y-74678956D01*
X125160463Y-74578788D01*
X125060295Y-74456733D01*
X124985864Y-74317482D01*
X124940028Y-74166385D01*
X124928430Y-74048625D01*
X124928430Y-73271376D01*
X124940028Y-73153616D01*
X124985863Y-73002519D01*
X124985863Y-73002518D01*
X125010673Y-72956102D01*
X125060294Y-72863268D01*
X125160462Y-72741212D01*
X125282517Y-72641044D01*
X125375351Y-72591423D01*
X125421767Y-72566613D01*
X125472134Y-72551335D01*
X125572865Y-72520778D01*
X125730000Y-72505302D01*
X125887134Y-72520778D01*
X125887134Y-72520778D01*
G37*
G36*
X128427134Y-72520778D02*
X128527865Y-72551335D01*
X128578232Y-72566613D01*
X128624648Y-72591423D01*
X128717482Y-72641044D01*
X128839538Y-72741212D01*
X128939706Y-72863267D01*
X128989327Y-72956101D01*
X129014137Y-73002517D01*
X129029415Y-73052884D01*
X129059972Y-73153615D01*
X129071570Y-73271375D01*
X129071570Y-74048625D01*
X129059972Y-74166385D01*
X129029415Y-74267116D01*
X129014137Y-74317483D01*
X128989327Y-74363899D01*
X128939706Y-74456733D01*
X128839538Y-74578788D01*
X128717483Y-74678956D01*
X128624649Y-74728577D01*
X128578233Y-74753387D01*
X128527866Y-74768665D01*
X128427135Y-74799222D01*
X128270000Y-74814698D01*
X128112866Y-74799222D01*
X128012135Y-74768665D01*
X127961768Y-74753387D01*
X127915352Y-74728577D01*
X127822518Y-74678956D01*
X127700463Y-74578788D01*
X127600295Y-74456733D01*
X127525864Y-74317482D01*
X127480028Y-74166385D01*
X127468430Y-74048625D01*
X127468430Y-73271376D01*
X127480028Y-73153616D01*
X127525863Y-73002519D01*
X127525863Y-73002518D01*
X127550673Y-72956102D01*
X127600294Y-72863268D01*
X127700462Y-72741212D01*
X127822517Y-72641044D01*
X127915351Y-72591423D01*
X127961767Y-72566613D01*
X128012134Y-72551335D01*
X128112865Y-72520778D01*
X128270000Y-72505302D01*
X128427134Y-72520778D01*
X128427134Y-72520778D01*
G37*
G36*
X147430443Y-68955519D02*
X147496627Y-68962037D01*
X147609853Y-68996384D01*
X147666467Y-69013557D01*
X147805087Y-69087652D01*
X147822991Y-69097222D01*
X147858729Y-69126552D01*
X147960186Y-69209814D01*
X148043448Y-69311271D01*
X148072778Y-69347009D01*
X148072779Y-69347011D01*
X148156443Y-69503533D01*
X148156443Y-69503534D01*
X148207963Y-69673373D01*
X148225359Y-69850000D01*
X148207963Y-70026627D01*
X148173616Y-70139853D01*
X148156443Y-70196467D01*
X148082348Y-70335087D01*
X148072778Y-70352991D01*
X148043448Y-70388729D01*
X147960186Y-70490186D01*
X147858729Y-70573448D01*
X147822991Y-70602778D01*
X147822989Y-70602779D01*
X147666467Y-70686443D01*
X147609853Y-70703616D01*
X147496627Y-70737963D01*
X147430443Y-70744481D01*
X147364260Y-70751000D01*
X147275740Y-70751000D01*
X147209557Y-70744481D01*
X147143373Y-70737963D01*
X147030147Y-70703616D01*
X146973533Y-70686443D01*
X146817011Y-70602779D01*
X146817009Y-70602778D01*
X146781271Y-70573448D01*
X146679814Y-70490186D01*
X146596552Y-70388729D01*
X146567222Y-70352991D01*
X146557652Y-70335087D01*
X146483557Y-70196467D01*
X146466384Y-70139853D01*
X146432037Y-70026627D01*
X146414641Y-69850000D01*
X146432037Y-69673373D01*
X146483557Y-69503534D01*
X146483557Y-69503533D01*
X146567221Y-69347011D01*
X146567222Y-69347009D01*
X146596552Y-69311271D01*
X146679814Y-69209814D01*
X146781271Y-69126552D01*
X146817009Y-69097222D01*
X146834913Y-69087652D01*
X146973533Y-69013557D01*
X147030147Y-68996384D01*
X147143373Y-68962037D01*
X147209557Y-68955519D01*
X147275740Y-68949000D01*
X147364260Y-68949000D01*
X147430443Y-68955519D01*
X147430443Y-68955519D01*
G37*
G36*
X147430443Y-66415519D02*
X147496627Y-66422037D01*
X147609853Y-66456384D01*
X147666467Y-66473557D01*
X147805087Y-66547652D01*
X147822991Y-66557222D01*
X147858729Y-66586552D01*
X147960186Y-66669814D01*
X148043448Y-66771271D01*
X148072778Y-66807009D01*
X148072779Y-66807011D01*
X148156443Y-66963533D01*
X148156443Y-66963534D01*
X148207963Y-67133373D01*
X148225359Y-67310000D01*
X148207963Y-67486627D01*
X148173616Y-67599853D01*
X148156443Y-67656467D01*
X148082348Y-67795087D01*
X148072778Y-67812991D01*
X148043448Y-67848729D01*
X147960186Y-67950186D01*
X147858729Y-68033448D01*
X147822991Y-68062778D01*
X147822989Y-68062779D01*
X147666467Y-68146443D01*
X147609853Y-68163616D01*
X147496627Y-68197963D01*
X147430443Y-68204481D01*
X147364260Y-68211000D01*
X147275740Y-68211000D01*
X147209557Y-68204481D01*
X147143373Y-68197963D01*
X147030147Y-68163616D01*
X146973533Y-68146443D01*
X146817011Y-68062779D01*
X146817009Y-68062778D01*
X146781271Y-68033448D01*
X146679814Y-67950186D01*
X146596552Y-67848729D01*
X146567222Y-67812991D01*
X146557652Y-67795087D01*
X146483557Y-67656467D01*
X146466384Y-67599853D01*
X146432037Y-67486627D01*
X146414641Y-67310000D01*
X146432037Y-67133373D01*
X146483557Y-66963534D01*
X146483557Y-66963533D01*
X146567221Y-66807011D01*
X146567222Y-66807009D01*
X146596552Y-66771271D01*
X146679814Y-66669814D01*
X146781271Y-66586552D01*
X146817009Y-66557222D01*
X146834913Y-66547652D01*
X146973533Y-66473557D01*
X147030147Y-66456384D01*
X147143373Y-66422037D01*
X147209557Y-66415519D01*
X147275740Y-66409000D01*
X147364260Y-66409000D01*
X147430443Y-66415519D01*
X147430443Y-66415519D01*
G37*
G36*
X140601000Y-68211000D02*
X138799000Y-68211000D01*
X138799000Y-66409000D01*
X140601000Y-66409000D01*
X140601000Y-68211000D01*
X140601000Y-68211000D01*
G37*
G36*
X113931000Y-68211000D02*
X112129000Y-68211000D01*
X112129000Y-66409000D01*
X113931000Y-66409000D01*
X113931000Y-68211000D01*
X113931000Y-68211000D01*
G37*
G36*
X129171000Y-68211000D02*
X127369000Y-68211000D01*
X127369000Y-66409000D01*
X129171000Y-66409000D01*
X129171000Y-68211000D01*
X129171000Y-68211000D01*
G37*
G36*
X136791000Y-68211000D02*
X134989000Y-68211000D01*
X134989000Y-66409000D01*
X136791000Y-66409000D01*
X136791000Y-68211000D01*
X136791000Y-68211000D01*
G37*
G36*
X132981000Y-68211000D02*
X131179000Y-68211000D01*
X131179000Y-66409000D01*
X132981000Y-66409000D01*
X132981000Y-68211000D01*
X132981000Y-68211000D01*
G37*
G36*
X113140442Y-63875518D02*
X113206627Y-63882037D01*
X113319853Y-63916384D01*
X113376467Y-63933557D01*
X113515087Y-64007652D01*
X113532991Y-64017222D01*
X113568729Y-64046552D01*
X113670186Y-64129814D01*
X113753448Y-64231271D01*
X113782778Y-64267009D01*
X113782779Y-64267011D01*
X113866443Y-64423533D01*
X113866443Y-64423534D01*
X113917963Y-64593373D01*
X113935359Y-64770000D01*
X113917963Y-64946627D01*
X113883616Y-65059853D01*
X113866443Y-65116467D01*
X113792348Y-65255087D01*
X113782778Y-65272991D01*
X113753448Y-65308729D01*
X113670186Y-65410186D01*
X113568729Y-65493448D01*
X113532991Y-65522778D01*
X113532989Y-65522779D01*
X113376467Y-65606443D01*
X113319853Y-65623616D01*
X113206627Y-65657963D01*
X113140442Y-65664482D01*
X113074260Y-65671000D01*
X112985740Y-65671000D01*
X112919558Y-65664482D01*
X112853373Y-65657963D01*
X112740147Y-65623616D01*
X112683533Y-65606443D01*
X112527011Y-65522779D01*
X112527009Y-65522778D01*
X112491271Y-65493448D01*
X112389814Y-65410186D01*
X112306552Y-65308729D01*
X112277222Y-65272991D01*
X112267652Y-65255087D01*
X112193557Y-65116467D01*
X112176384Y-65059853D01*
X112142037Y-64946627D01*
X112124641Y-64770000D01*
X112142037Y-64593373D01*
X112193557Y-64423534D01*
X112193557Y-64423533D01*
X112277221Y-64267011D01*
X112277222Y-64267009D01*
X112306552Y-64231271D01*
X112389814Y-64129814D01*
X112491271Y-64046552D01*
X112527009Y-64017222D01*
X112544913Y-64007652D01*
X112683533Y-63933557D01*
X112740147Y-63916384D01*
X112853373Y-63882037D01*
X112919558Y-63875518D01*
X112985740Y-63869000D01*
X113074260Y-63869000D01*
X113140442Y-63875518D01*
X113140442Y-63875518D01*
G37*
G36*
X132190442Y-63875518D02*
X132256627Y-63882037D01*
X132369853Y-63916384D01*
X132426467Y-63933557D01*
X132565087Y-64007652D01*
X132582991Y-64017222D01*
X132618729Y-64046552D01*
X132720186Y-64129814D01*
X132803448Y-64231271D01*
X132832778Y-64267009D01*
X132832779Y-64267011D01*
X132916443Y-64423533D01*
X132916443Y-64423534D01*
X132967963Y-64593373D01*
X132985359Y-64770000D01*
X132967963Y-64946627D01*
X132933616Y-65059853D01*
X132916443Y-65116467D01*
X132842348Y-65255087D01*
X132832778Y-65272991D01*
X132803448Y-65308729D01*
X132720186Y-65410186D01*
X132618729Y-65493448D01*
X132582991Y-65522778D01*
X132582989Y-65522779D01*
X132426467Y-65606443D01*
X132369853Y-65623616D01*
X132256627Y-65657963D01*
X132190442Y-65664482D01*
X132124260Y-65671000D01*
X132035740Y-65671000D01*
X131969558Y-65664482D01*
X131903373Y-65657963D01*
X131790147Y-65623616D01*
X131733533Y-65606443D01*
X131577011Y-65522779D01*
X131577009Y-65522778D01*
X131541271Y-65493448D01*
X131439814Y-65410186D01*
X131356552Y-65308729D01*
X131327222Y-65272991D01*
X131317652Y-65255087D01*
X131243557Y-65116467D01*
X131226384Y-65059853D01*
X131192037Y-64946627D01*
X131174641Y-64770000D01*
X131192037Y-64593373D01*
X131243557Y-64423534D01*
X131243557Y-64423533D01*
X131327221Y-64267011D01*
X131327222Y-64267009D01*
X131356552Y-64231271D01*
X131439814Y-64129814D01*
X131541271Y-64046552D01*
X131577009Y-64017222D01*
X131594913Y-64007652D01*
X131733533Y-63933557D01*
X131790147Y-63916384D01*
X131903373Y-63882037D01*
X131969558Y-63875518D01*
X132035740Y-63869000D01*
X132124260Y-63869000D01*
X132190442Y-63875518D01*
X132190442Y-63875518D01*
G37*
G36*
X147430442Y-63875518D02*
X147496627Y-63882037D01*
X147609853Y-63916384D01*
X147666467Y-63933557D01*
X147805087Y-64007652D01*
X147822991Y-64017222D01*
X147858729Y-64046552D01*
X147960186Y-64129814D01*
X148043448Y-64231271D01*
X148072778Y-64267009D01*
X148072779Y-64267011D01*
X148156443Y-64423533D01*
X148156443Y-64423534D01*
X148207963Y-64593373D01*
X148225359Y-64770000D01*
X148207963Y-64946627D01*
X148173616Y-65059853D01*
X148156443Y-65116467D01*
X148082348Y-65255087D01*
X148072778Y-65272991D01*
X148043448Y-65308729D01*
X147960186Y-65410186D01*
X147858729Y-65493448D01*
X147822991Y-65522778D01*
X147822989Y-65522779D01*
X147666467Y-65606443D01*
X147609853Y-65623616D01*
X147496627Y-65657963D01*
X147430442Y-65664482D01*
X147364260Y-65671000D01*
X147275740Y-65671000D01*
X147209558Y-65664482D01*
X147143373Y-65657963D01*
X147030147Y-65623616D01*
X146973533Y-65606443D01*
X146817011Y-65522779D01*
X146817009Y-65522778D01*
X146781271Y-65493448D01*
X146679814Y-65410186D01*
X146596552Y-65308729D01*
X146567222Y-65272991D01*
X146557652Y-65255087D01*
X146483557Y-65116467D01*
X146466384Y-65059853D01*
X146432037Y-64946627D01*
X146414641Y-64770000D01*
X146432037Y-64593373D01*
X146483557Y-64423534D01*
X146483557Y-64423533D01*
X146567221Y-64267011D01*
X146567222Y-64267009D01*
X146596552Y-64231271D01*
X146679814Y-64129814D01*
X146781271Y-64046552D01*
X146817009Y-64017222D01*
X146834913Y-64007652D01*
X146973533Y-63933557D01*
X147030147Y-63916384D01*
X147143373Y-63882037D01*
X147209558Y-63875518D01*
X147275740Y-63869000D01*
X147364260Y-63869000D01*
X147430442Y-63875518D01*
X147430442Y-63875518D01*
G37*
G36*
X128380442Y-63875518D02*
X128446627Y-63882037D01*
X128559853Y-63916384D01*
X128616467Y-63933557D01*
X128755087Y-64007652D01*
X128772991Y-64017222D01*
X128808729Y-64046552D01*
X128910186Y-64129814D01*
X128993448Y-64231271D01*
X129022778Y-64267009D01*
X129022779Y-64267011D01*
X129106443Y-64423533D01*
X129106443Y-64423534D01*
X129157963Y-64593373D01*
X129175359Y-64770000D01*
X129157963Y-64946627D01*
X129123616Y-65059853D01*
X129106443Y-65116467D01*
X129032348Y-65255087D01*
X129022778Y-65272991D01*
X128993448Y-65308729D01*
X128910186Y-65410186D01*
X128808729Y-65493448D01*
X128772991Y-65522778D01*
X128772989Y-65522779D01*
X128616467Y-65606443D01*
X128559853Y-65623616D01*
X128446627Y-65657963D01*
X128380442Y-65664482D01*
X128314260Y-65671000D01*
X128225740Y-65671000D01*
X128159558Y-65664482D01*
X128093373Y-65657963D01*
X127980147Y-65623616D01*
X127923533Y-65606443D01*
X127767011Y-65522779D01*
X127767009Y-65522778D01*
X127731271Y-65493448D01*
X127629814Y-65410186D01*
X127546552Y-65308729D01*
X127517222Y-65272991D01*
X127507652Y-65255087D01*
X127433557Y-65116467D01*
X127416384Y-65059853D01*
X127382037Y-64946627D01*
X127364641Y-64770000D01*
X127382037Y-64593373D01*
X127433557Y-64423534D01*
X127433557Y-64423533D01*
X127517221Y-64267011D01*
X127517222Y-64267009D01*
X127546552Y-64231271D01*
X127629814Y-64129814D01*
X127731271Y-64046552D01*
X127767009Y-64017222D01*
X127784913Y-64007652D01*
X127923533Y-63933557D01*
X127980147Y-63916384D01*
X128093373Y-63882037D01*
X128159558Y-63875518D01*
X128225740Y-63869000D01*
X128314260Y-63869000D01*
X128380442Y-63875518D01*
X128380442Y-63875518D01*
G37*
G36*
X136000442Y-63875518D02*
X136066627Y-63882037D01*
X136179853Y-63916384D01*
X136236467Y-63933557D01*
X136375087Y-64007652D01*
X136392991Y-64017222D01*
X136428729Y-64046552D01*
X136530186Y-64129814D01*
X136613448Y-64231271D01*
X136642778Y-64267009D01*
X136642779Y-64267011D01*
X136726443Y-64423533D01*
X136726443Y-64423534D01*
X136777963Y-64593373D01*
X136795359Y-64770000D01*
X136777963Y-64946627D01*
X136743616Y-65059853D01*
X136726443Y-65116467D01*
X136652348Y-65255087D01*
X136642778Y-65272991D01*
X136613448Y-65308729D01*
X136530186Y-65410186D01*
X136428729Y-65493448D01*
X136392991Y-65522778D01*
X136392989Y-65522779D01*
X136236467Y-65606443D01*
X136179853Y-65623616D01*
X136066627Y-65657963D01*
X136000442Y-65664482D01*
X135934260Y-65671000D01*
X135845740Y-65671000D01*
X135779558Y-65664482D01*
X135713373Y-65657963D01*
X135600147Y-65623616D01*
X135543533Y-65606443D01*
X135387011Y-65522779D01*
X135387009Y-65522778D01*
X135351271Y-65493448D01*
X135249814Y-65410186D01*
X135166552Y-65308729D01*
X135137222Y-65272991D01*
X135127652Y-65255087D01*
X135053557Y-65116467D01*
X135036384Y-65059853D01*
X135002037Y-64946627D01*
X134984641Y-64770000D01*
X135002037Y-64593373D01*
X135053557Y-64423534D01*
X135053557Y-64423533D01*
X135137221Y-64267011D01*
X135137222Y-64267009D01*
X135166552Y-64231271D01*
X135249814Y-64129814D01*
X135351271Y-64046552D01*
X135387009Y-64017222D01*
X135404913Y-64007652D01*
X135543533Y-63933557D01*
X135600147Y-63916384D01*
X135713373Y-63882037D01*
X135779558Y-63875518D01*
X135845740Y-63869000D01*
X135934260Y-63869000D01*
X136000442Y-63875518D01*
X136000442Y-63875518D01*
G37*
G36*
X139810442Y-63875518D02*
X139876627Y-63882037D01*
X139989853Y-63916384D01*
X140046467Y-63933557D01*
X140185087Y-64007652D01*
X140202991Y-64017222D01*
X140238729Y-64046552D01*
X140340186Y-64129814D01*
X140423448Y-64231271D01*
X140452778Y-64267009D01*
X140452779Y-64267011D01*
X140536443Y-64423533D01*
X140536443Y-64423534D01*
X140587963Y-64593373D01*
X140605359Y-64770000D01*
X140587963Y-64946627D01*
X140553616Y-65059853D01*
X140536443Y-65116467D01*
X140462348Y-65255087D01*
X140452778Y-65272991D01*
X140423448Y-65308729D01*
X140340186Y-65410186D01*
X140238729Y-65493448D01*
X140202991Y-65522778D01*
X140202989Y-65522779D01*
X140046467Y-65606443D01*
X139989853Y-65623616D01*
X139876627Y-65657963D01*
X139810442Y-65664482D01*
X139744260Y-65671000D01*
X139655740Y-65671000D01*
X139589558Y-65664482D01*
X139523373Y-65657963D01*
X139410147Y-65623616D01*
X139353533Y-65606443D01*
X139197011Y-65522779D01*
X139197009Y-65522778D01*
X139161271Y-65493448D01*
X139059814Y-65410186D01*
X138976552Y-65308729D01*
X138947222Y-65272991D01*
X138937652Y-65255087D01*
X138863557Y-65116467D01*
X138846384Y-65059853D01*
X138812037Y-64946627D01*
X138794641Y-64770000D01*
X138812037Y-64593373D01*
X138863557Y-64423534D01*
X138863557Y-64423533D01*
X138947221Y-64267011D01*
X138947222Y-64267009D01*
X138976552Y-64231271D01*
X139059814Y-64129814D01*
X139161271Y-64046552D01*
X139197009Y-64017222D01*
X139214913Y-64007652D01*
X139353533Y-63933557D01*
X139410147Y-63916384D01*
X139523373Y-63882037D01*
X139589558Y-63875518D01*
X139655740Y-63869000D01*
X139744260Y-63869000D01*
X139810442Y-63875518D01*
X139810442Y-63875518D01*
G37*
G36*
X148221000Y-63131000D02*
X146419000Y-63131000D01*
X146419000Y-61329000D01*
X148221000Y-61329000D01*
X148221000Y-63131000D01*
X148221000Y-63131000D01*
G37*
G36*
X139810443Y-61335519D02*
X139876627Y-61342037D01*
X139989853Y-61376384D01*
X140046467Y-61393557D01*
X140185087Y-61467652D01*
X140202991Y-61477222D01*
X140238729Y-61506552D01*
X140340186Y-61589814D01*
X140423448Y-61691271D01*
X140452778Y-61727009D01*
X140452779Y-61727011D01*
X140536443Y-61883533D01*
X140536443Y-61883534D01*
X140587963Y-62053373D01*
X140605359Y-62230000D01*
X140587963Y-62406627D01*
X140553616Y-62519853D01*
X140536443Y-62576467D01*
X140462348Y-62715087D01*
X140452778Y-62732991D01*
X140423448Y-62768729D01*
X140340186Y-62870186D01*
X140238729Y-62953448D01*
X140202991Y-62982778D01*
X140202989Y-62982779D01*
X140046467Y-63066443D01*
X139989853Y-63083616D01*
X139876627Y-63117963D01*
X139810443Y-63124481D01*
X139744260Y-63131000D01*
X139655740Y-63131000D01*
X139589557Y-63124481D01*
X139523373Y-63117963D01*
X139410147Y-63083616D01*
X139353533Y-63066443D01*
X139197011Y-62982779D01*
X139197009Y-62982778D01*
X139161271Y-62953448D01*
X139059814Y-62870186D01*
X138976552Y-62768729D01*
X138947222Y-62732991D01*
X138937652Y-62715087D01*
X138863557Y-62576467D01*
X138846384Y-62519853D01*
X138812037Y-62406627D01*
X138794641Y-62230000D01*
X138812037Y-62053373D01*
X138863557Y-61883534D01*
X138863557Y-61883533D01*
X138947221Y-61727011D01*
X138947222Y-61727009D01*
X138976552Y-61691271D01*
X139059814Y-61589814D01*
X139161271Y-61506552D01*
X139197009Y-61477222D01*
X139214913Y-61467652D01*
X139353533Y-61393557D01*
X139410147Y-61376384D01*
X139523373Y-61342037D01*
X139589557Y-61335519D01*
X139655740Y-61329000D01*
X139744260Y-61329000D01*
X139810443Y-61335519D01*
X139810443Y-61335519D01*
G37*
G36*
X136000443Y-61335519D02*
X136066627Y-61342037D01*
X136179853Y-61376384D01*
X136236467Y-61393557D01*
X136375087Y-61467652D01*
X136392991Y-61477222D01*
X136428729Y-61506552D01*
X136530186Y-61589814D01*
X136613448Y-61691271D01*
X136642778Y-61727009D01*
X136642779Y-61727011D01*
X136726443Y-61883533D01*
X136726443Y-61883534D01*
X136777963Y-62053373D01*
X136795359Y-62230000D01*
X136777963Y-62406627D01*
X136743616Y-62519853D01*
X136726443Y-62576467D01*
X136652348Y-62715087D01*
X136642778Y-62732991D01*
X136613448Y-62768729D01*
X136530186Y-62870186D01*
X136428729Y-62953448D01*
X136392991Y-62982778D01*
X136392989Y-62982779D01*
X136236467Y-63066443D01*
X136179853Y-63083616D01*
X136066627Y-63117963D01*
X136000443Y-63124481D01*
X135934260Y-63131000D01*
X135845740Y-63131000D01*
X135779557Y-63124481D01*
X135713373Y-63117963D01*
X135600147Y-63083616D01*
X135543533Y-63066443D01*
X135387011Y-62982779D01*
X135387009Y-62982778D01*
X135351271Y-62953448D01*
X135249814Y-62870186D01*
X135166552Y-62768729D01*
X135137222Y-62732991D01*
X135127652Y-62715087D01*
X135053557Y-62576467D01*
X135036384Y-62519853D01*
X135002037Y-62406627D01*
X134984641Y-62230000D01*
X135002037Y-62053373D01*
X135053557Y-61883534D01*
X135053557Y-61883533D01*
X135137221Y-61727011D01*
X135137222Y-61727009D01*
X135166552Y-61691271D01*
X135249814Y-61589814D01*
X135351271Y-61506552D01*
X135387009Y-61477222D01*
X135404913Y-61467652D01*
X135543533Y-61393557D01*
X135600147Y-61376384D01*
X135713373Y-61342037D01*
X135779557Y-61335519D01*
X135845740Y-61329000D01*
X135934260Y-61329000D01*
X136000443Y-61335519D01*
X136000443Y-61335519D01*
G37*
G36*
X113140443Y-61335519D02*
X113206627Y-61342037D01*
X113319853Y-61376384D01*
X113376467Y-61393557D01*
X113515087Y-61467652D01*
X113532991Y-61477222D01*
X113568729Y-61506552D01*
X113670186Y-61589814D01*
X113753448Y-61691271D01*
X113782778Y-61727009D01*
X113782779Y-61727011D01*
X113866443Y-61883533D01*
X113866443Y-61883534D01*
X113917963Y-62053373D01*
X113935359Y-62230000D01*
X113917963Y-62406627D01*
X113883616Y-62519853D01*
X113866443Y-62576467D01*
X113792348Y-62715087D01*
X113782778Y-62732991D01*
X113753448Y-62768729D01*
X113670186Y-62870186D01*
X113568729Y-62953448D01*
X113532991Y-62982778D01*
X113532989Y-62982779D01*
X113376467Y-63066443D01*
X113319853Y-63083616D01*
X113206627Y-63117963D01*
X113140443Y-63124481D01*
X113074260Y-63131000D01*
X112985740Y-63131000D01*
X112919557Y-63124481D01*
X112853373Y-63117963D01*
X112740147Y-63083616D01*
X112683533Y-63066443D01*
X112527011Y-62982779D01*
X112527009Y-62982778D01*
X112491271Y-62953448D01*
X112389814Y-62870186D01*
X112306552Y-62768729D01*
X112277222Y-62732991D01*
X112267652Y-62715087D01*
X112193557Y-62576467D01*
X112176384Y-62519853D01*
X112142037Y-62406627D01*
X112124641Y-62230000D01*
X112142037Y-62053373D01*
X112193557Y-61883534D01*
X112193557Y-61883533D01*
X112277221Y-61727011D01*
X112277222Y-61727009D01*
X112306552Y-61691271D01*
X112389814Y-61589814D01*
X112491271Y-61506552D01*
X112527009Y-61477222D01*
X112544913Y-61467652D01*
X112683533Y-61393557D01*
X112740147Y-61376384D01*
X112853373Y-61342037D01*
X112919557Y-61335519D01*
X112985740Y-61329000D01*
X113074260Y-61329000D01*
X113140443Y-61335519D01*
X113140443Y-61335519D01*
G37*
G36*
X132190443Y-61335519D02*
X132256627Y-61342037D01*
X132369853Y-61376384D01*
X132426467Y-61393557D01*
X132565087Y-61467652D01*
X132582991Y-61477222D01*
X132618729Y-61506552D01*
X132720186Y-61589814D01*
X132803448Y-61691271D01*
X132832778Y-61727009D01*
X132832779Y-61727011D01*
X132916443Y-61883533D01*
X132916443Y-61883534D01*
X132967963Y-62053373D01*
X132985359Y-62230000D01*
X132967963Y-62406627D01*
X132933616Y-62519853D01*
X132916443Y-62576467D01*
X132842348Y-62715087D01*
X132832778Y-62732991D01*
X132803448Y-62768729D01*
X132720186Y-62870186D01*
X132618729Y-62953448D01*
X132582991Y-62982778D01*
X132582989Y-62982779D01*
X132426467Y-63066443D01*
X132369853Y-63083616D01*
X132256627Y-63117963D01*
X132190443Y-63124481D01*
X132124260Y-63131000D01*
X132035740Y-63131000D01*
X131969557Y-63124481D01*
X131903373Y-63117963D01*
X131790147Y-63083616D01*
X131733533Y-63066443D01*
X131577011Y-62982779D01*
X131577009Y-62982778D01*
X131541271Y-62953448D01*
X131439814Y-62870186D01*
X131356552Y-62768729D01*
X131327222Y-62732991D01*
X131317652Y-62715087D01*
X131243557Y-62576467D01*
X131226384Y-62519853D01*
X131192037Y-62406627D01*
X131174641Y-62230000D01*
X131192037Y-62053373D01*
X131243557Y-61883534D01*
X131243557Y-61883533D01*
X131327221Y-61727011D01*
X131327222Y-61727009D01*
X131356552Y-61691271D01*
X131439814Y-61589814D01*
X131541271Y-61506552D01*
X131577009Y-61477222D01*
X131594913Y-61467652D01*
X131733533Y-61393557D01*
X131790147Y-61376384D01*
X131903373Y-61342037D01*
X131969557Y-61335519D01*
X132035740Y-61329000D01*
X132124260Y-61329000D01*
X132190443Y-61335519D01*
X132190443Y-61335519D01*
G37*
G36*
X128380443Y-61335519D02*
X128446627Y-61342037D01*
X128559853Y-61376384D01*
X128616467Y-61393557D01*
X128755087Y-61467652D01*
X128772991Y-61477222D01*
X128808729Y-61506552D01*
X128910186Y-61589814D01*
X128993448Y-61691271D01*
X129022778Y-61727009D01*
X129022779Y-61727011D01*
X129106443Y-61883533D01*
X129106443Y-61883534D01*
X129157963Y-62053373D01*
X129175359Y-62230000D01*
X129157963Y-62406627D01*
X129123616Y-62519853D01*
X129106443Y-62576467D01*
X129032348Y-62715087D01*
X129022778Y-62732991D01*
X128993448Y-62768729D01*
X128910186Y-62870186D01*
X128808729Y-62953448D01*
X128772991Y-62982778D01*
X128772989Y-62982779D01*
X128616467Y-63066443D01*
X128559853Y-63083616D01*
X128446627Y-63117963D01*
X128380443Y-63124481D01*
X128314260Y-63131000D01*
X128225740Y-63131000D01*
X128159557Y-63124481D01*
X128093373Y-63117963D01*
X127980147Y-63083616D01*
X127923533Y-63066443D01*
X127767011Y-62982779D01*
X127767009Y-62982778D01*
X127731271Y-62953448D01*
X127629814Y-62870186D01*
X127546552Y-62768729D01*
X127517222Y-62732991D01*
X127507652Y-62715087D01*
X127433557Y-62576467D01*
X127416384Y-62519853D01*
X127382037Y-62406627D01*
X127364641Y-62230000D01*
X127382037Y-62053373D01*
X127433557Y-61883534D01*
X127433557Y-61883533D01*
X127517221Y-61727011D01*
X127517222Y-61727009D01*
X127546552Y-61691271D01*
X127629814Y-61589814D01*
X127731271Y-61506552D01*
X127767009Y-61477222D01*
X127784913Y-61467652D01*
X127923533Y-61393557D01*
X127980147Y-61376384D01*
X128093373Y-61342037D01*
X128159557Y-61335519D01*
X128225740Y-61329000D01*
X128314260Y-61329000D01*
X128380443Y-61335519D01*
X128380443Y-61335519D01*
G37*
M02*
