M48
;DRILL file {KiCad (5.0.1)-3} date 25/04/2019 22:02:15
;FORMAT={-:-/ absolute / inch / decimal}
FMAT,2
INCH,TZ
T1C0.0315
T2C0.0394
T3C0.0400
%
G90
G05
M72
T1
X4.45Y-2.9
X4.45Y-3.5
X4.55Y-2.9
X4.55Y-3.5
X4.65Y-2.9
X4.65Y-3.5
X4.75Y-2.9
X4.75Y-3.5
X4.8Y-3.
X4.85Y-2.9
X4.85Y-3.5
X4.9Y-3.
X4.95Y-2.9
X4.95Y-3.5
X5.05Y-2.9
X5.05Y-3.5
X5.15Y-2.9
X5.15Y-3.5
X5.2Y-3.
X5.25Y-2.9
X5.25Y-3.5
X5.3Y-3.
X5.35Y-2.9
X5.35Y-3.5
X5.45Y-2.9
X5.45Y-3.5
X5.55Y-2.9
X5.55Y-3.
X5.55Y-3.1
X5.55Y-3.2
X5.55Y-3.5
T2
X5.35Y-2.45
X5.35Y-2.55
X5.35Y-2.65
X5.5Y-2.45
X5.5Y-2.55
X5.5Y-2.65
X4.45Y-2.45
X4.45Y-2.55
X4.45Y-2.65
X5.2Y-2.45
X5.2Y-2.55
X5.2Y-2.65
X5.05Y-2.45
X5.05Y-2.55
X5.05Y-2.65
X5.8Y-2.45
X5.8Y-2.55
X5.8Y-2.65
X5.8Y-2.75
T3
X5.75Y-3.01
X5.75Y-3.11
X5.75Y-3.21
X5.75Y-3.31
X5.85Y-3.01
X5.85Y-3.11
X5.85Y-3.21
X5.85Y-3.31
T0
M30
