EESchema Schematic File Version 4
LIBS:tempsensor-cache
EELAYER 26 0
EELAYER END
$Descr A4 11693 8268
encoding utf-8
Sheet 1 1
Title ""
Date ""
Rev ""
Comp ""
Comment1 ""
Comment2 ""
Comment3 ""
Comment4 ""
$EndDescr
$Comp
L mysensors_arduino:ArduinoProMini IC1
U 1 1 5CBF617A
P 3000 3400
F 0 "IC1" H 3050 4850 40  0000 C CNN
F 1 "ArduinoProMini" H 3050 4774 40  0000 C CNN
F 2 "MySensors Arduino:pro_mini" H 3000 3400 30  0001 C CIN
F 3 "http://www.arduino.cc/en/uploads/Main/Arduino-Pro-Mini-schematic.pdf" H 3050 4683 60  0000 C CNN
	1    3000 3400
	1    0    0    -1  
$EndComp
$Comp
L mysensors_radios:NRF24L01 U1
U 1 1 5CBF61FB
P 7050 1850
F 0 "U1" H 7200 2250 60  0000 C CNN
F 1 "NRF24L01" H 7400 2150 60  0000 C CNN
F 2 "MySensors Radio:NRF24L01" H 7050 1700 60  0001 C CNN
F 3 "" H 7050 1700 60  0000 C CNN
	1    7050 1850
	1    0    0    -1  
$EndComp
$Comp
L Device:R R1
U 1 1 5CBF6630
P 4150 6000
F 0 "R1" H 4220 6046 50  0000 L CNN
F 1 "4.7k" H 4220 5955 50  0000 L CNN
F 2 "Resistors_SMD:R_0603_HandSoldering" V 4080 6000 50  0001 C CNN
F 3 "~" H 4150 6000 50  0001 C CNN
	1    4150 6000
	1    0    0    -1  
$EndComp
$Comp
L Device:C C1
U 1 1 5CBF687A
P 6300 1200
F 0 "C1" H 6415 1246 50  0000 L CNN
F 1 "4.7u" H 6415 1155 50  0000 L CNN
F 2 "Capacitors_SMD:C_0603_HandSoldering" H 6338 1050 50  0001 C CNN
F 3 "~" H 6300 1200 50  0001 C CNN
	1    6300 1200
	1    0    0    -1  
$EndComp
$Comp
L power:GND #PWR0101
U 1 1 5CBF68F5
P 7050 2250
F 0 "#PWR0101" H 7050 2000 50  0001 C CNN
F 1 "GND" H 7055 2077 50  0000 C CNN
F 2 "" H 7050 2250 50  0001 C CNN
F 3 "" H 7050 2250 50  0001 C CNN
	1    7050 2250
	1    0    0    -1  
$EndComp
$Comp
L power:+3.3V #PWR0102
U 1 1 5CBF6A4E
P 7050 950
F 0 "#PWR0102" H 7050 800 50  0001 C CNN
F 1 "+3.3V" H 7065 1123 50  0000 C CNN
F 2 "" H 7050 950 50  0001 C CNN
F 3 "" H 7050 950 50  0001 C CNN
	1    7050 950 
	1    0    0    -1  
$EndComp
Wire Wire Line
	7050 950  7050 1050
Wire Wire Line
	7050 1050 6300 1050
Wire Wire Line
	7050 1500 7050 1050
Connection ~ 7050 1050
$Comp
L power:GND #PWR0103
U 1 1 5CBF6AE2
P 6300 1400
F 0 "#PWR0103" H 6300 1150 50  0001 C CNN
F 1 "GND" H 6305 1227 50  0000 C CNN
F 2 "" H 6300 1400 50  0001 C CNN
F 3 "" H 6300 1400 50  0001 C CNN
	1    6300 1400
	1    0    0    -1  
$EndComp
Wire Wire Line
	6300 1400 6300 1350
$Comp
L power:GND #PWR0104
U 1 1 5CBF6CAB
P 4950 1450
F 0 "#PWR0104" H 4950 1200 50  0001 C CNN
F 1 "GND" H 4955 1277 50  0000 C CNN
F 2 "" H 4950 1450 50  0001 C CNN
F 3 "" H 4950 1450 50  0001 C CNN
	1    4950 1450
	1    0    0    -1  
$EndComp
$Comp
L power:+3.3V #PWR0105
U 1 1 5CBF6D5E
P 5150 900
F 0 "#PWR0105" H 5150 750 50  0001 C CNN
F 1 "+3.3V" H 5165 1073 50  0000 C CNN
F 2 "" H 5150 900 50  0001 C CNN
F 3 "" H 5150 900 50  0001 C CNN
	1    5150 900 
	1    0    0    -1  
$EndComp
Wire Wire Line
	4950 1300 4950 1450
Wire Wire Line
	7050 2250 7050 2200
Wire Wire Line
	7700 3200 7700 1950
Wire Wire Line
	7700 1950 7450 1950
Wire Wire Line
	4000 3300 7800 3300
Wire Wire Line
	7800 3300 7800 1750
Wire Wire Line
	7800 1750 7450 1750
Wire Wire Line
	4000 3200 7700 3200
Wire Wire Line
	4000 3700 6500 3700
Wire Wire Line
	6500 3700 6500 1950
Wire Wire Line
	6500 1950 6650 1950
Wire Wire Line
	4000 3500 6400 3500
Wire Wire Line
	6400 3500 6400 1850
Wire Wire Line
	6400 1850 6650 1850
Wire Wire Line
	4000 3600 6300 3600
Wire Wire Line
	6300 3600 6300 1750
Wire Wire Line
	6300 1750 6650 1750
Wire Wire Line
	7600 2500 7600 1850
Wire Wire Line
	7600 1850 7450 1850
Wire Wire Line
	4000 2500 7600 2500
$Comp
L power:+3.3V #PWR0106
U 1 1 5CBF91D7
P 7350 3900
F 0 "#PWR0106" H 7350 3750 50  0001 C CNN
F 1 "+3.3V" H 7365 4073 50  0000 C CNN
F 2 "" H 7350 3900 50  0001 C CNN
F 3 "" H 7350 3900 50  0001 C CNN
	1    7350 3900
	1    0    0    -1  
$EndComp
$Comp
L power:GND #PWR0107
U 1 1 5CBF91F0
P 7250 4800
F 0 "#PWR0107" H 7250 4550 50  0001 C CNN
F 1 "GND" H 7255 4627 50  0000 C CNN
F 2 "" H 7250 4800 50  0001 C CNN
F 3 "" H 7250 4800 50  0001 C CNN
	1    7250 4800
	1    0    0    -1  
$EndComp
$Comp
L Connector:Conn_01x03_Male J1
U 1 1 5CBFD68E
P 3250 6550
F 0 "J1" H 3356 6828 50  0000 C CNN
F 1 "Conn_01x03_Male" H 3356 6737 50  0000 C CNN
F 2 "Pin_Headers:Pin_Header_Straight_1x03_Pitch2.54mm" H 3250 6550 50  0001 C CNN
F 3 "~" H 3250 6550 50  0001 C CNN
	1    3250 6550
	1    0    0    -1  
$EndComp
$Comp
L Connector:Conn_01x03_Male J2
U 1 1 5CBFD6BA
P 4050 6550
F 0 "J2" H 4156 6828 50  0000 C CNN
F 1 "Conn_01x03_Male" H 4156 6737 50  0000 C CNN
F 2 "Pin_Headers:Pin_Header_Straight_1x03_Pitch2.54mm" H 4050 6550 50  0001 C CNN
F 3 "~" H 4050 6550 50  0001 C CNN
	1    4050 6550
	1    0    0    -1  
$EndComp
$Comp
L Connector:Conn_01x03_Male J4
U 1 1 5CBFD6F6
P 4900 6550
F 0 "J4" H 5006 6828 50  0000 C CNN
F 1 "Conn_01x03_Male" H 5006 6737 50  0000 C CNN
F 2 "Pin_Headers:Pin_Header_Straight_1x03_Pitch2.54mm" H 4900 6550 50  0001 C CNN
F 3 "~" H 4900 6550 50  0001 C CNN
	1    4900 6550
	1    0    0    -1  
$EndComp
$Comp
L Connector:Conn_01x03_Male J5
U 1 1 5CBFD72E
P 5850 6550
F 0 "J5" H 5956 6828 50  0000 C CNN
F 1 "Conn_01x03_Male" H 5956 6737 50  0000 C CNN
F 2 "Pin_Headers:Pin_Header_Straight_1x03_Pitch2.54mm" H 5850 6550 50  0001 C CNN
F 3 "~" H 5850 6550 50  0001 C CNN
	1    5850 6550
	1    0    0    -1  
$EndComp
$Comp
L power:+3.3V #PWR0108
U 1 1 5CBFDC80
P 3750 6100
F 0 "#PWR0108" H 3750 5950 50  0001 C CNN
F 1 "+3.3V" H 3765 6273 50  0000 C CNN
F 2 "" H 3750 6100 50  0001 C CNN
F 3 "" H 3750 6100 50  0001 C CNN
	1    3750 6100
	1    0    0    -1  
$EndComp
$Comp
L power:GND #PWR0109
U 1 1 5CBFDC9F
P 3800 6900
F 0 "#PWR0109" H 3800 6650 50  0001 C CNN
F 1 "GND" H 3805 6727 50  0000 C CNN
F 2 "" H 3800 6900 50  0001 C CNN
F 3 "" H 3800 6900 50  0001 C CNN
	1    3800 6900
	1    0    0    -1  
$EndComp
Wire Wire Line
	3450 6650 3800 6650
Wire Wire Line
	3800 6650 3800 6750
Wire Wire Line
	4250 6650 4550 6650
Wire Wire Line
	4550 6650 4550 6750
Wire Wire Line
	4550 6750 3800 6750
Connection ~ 3800 6750
Wire Wire Line
	3800 6750 3800 6900
Wire Wire Line
	5100 6650 5450 6650
Wire Wire Line
	5450 6650 5450 6750
Wire Wire Line
	5450 6750 4550 6750
Connection ~ 4550 6750
Wire Wire Line
	6050 6650 6350 6650
Wire Wire Line
	6350 6650 6350 6750
Wire Wire Line
	6350 6750 5450 6750
Connection ~ 5450 6750
Wire Wire Line
	3450 6450 3750 6450
Wire Wire Line
	3750 6450 3750 6200
Wire Wire Line
	4250 6450 4550 6450
Wire Wire Line
	4550 6450 4550 6200
Wire Wire Line
	4550 6200 4150 6200
Connection ~ 3750 6200
Wire Wire Line
	3750 6200 3750 6100
Wire Wire Line
	5100 6450 5450 6450
Wire Wire Line
	5450 6450 5450 6200
Wire Wire Line
	5450 6200 4550 6200
Connection ~ 4550 6200
Wire Wire Line
	6050 6450 6350 6450
Wire Wire Line
	6350 6450 6350 6200
Wire Wire Line
	6350 6200 5450 6200
Connection ~ 5450 6200
Wire Wire Line
	3450 6550 4250 6550
Wire Wire Line
	4250 6550 5100 6550
Connection ~ 4250 6550
Wire Wire Line
	5100 6550 6050 6550
Connection ~ 5100 6550
Wire Wire Line
	6050 6550 6450 6550
Wire Wire Line
	6450 6550 6450 5800
Wire Wire Line
	6450 5800 4150 5800
Connection ~ 6050 6550
Wire Wire Line
	4150 6150 4150 6200
Connection ~ 4150 6200
Wire Wire Line
	4150 6200 3750 6200
Wire Wire Line
	4150 5850 4150 5800
Connection ~ 4150 5800
Wire Wire Line
	4150 5800 4100 5800
Wire Wire Line
	4000 2600 4100 2600
Wire Wire Line
	4100 2600 4100 5800
$Comp
L power:GND #PWR0110
U 1 1 5CC1629A
P 1850 4850
F 0 "#PWR0110" H 1850 4600 50  0001 C CNN
F 1 "GND" H 1855 4677 50  0000 C CNN
F 2 "" H 1850 4850 50  0001 C CNN
F 3 "" H 1850 4850 50  0001 C CNN
	1    1850 4850
	1    0    0    -1  
$EndComp
Wire Wire Line
	2100 4400 1850 4400
Wire Wire Line
	1850 4400 1850 4500
Wire Wire Line
	2100 4500 1850 4500
Connection ~ 1850 4500
Wire Wire Line
	1850 4500 1850 4600
Wire Wire Line
	2100 4600 1850 4600
Connection ~ 1850 4600
Wire Wire Line
	1850 4600 1850 4850
$Comp
L power:+3.3V #PWR0111
U 1 1 5CC1B0D3
P 1750 1900
F 0 "#PWR0111" H 1750 1750 50  0001 C CNN
F 1 "+3.3V" H 1765 2073 50  0000 C CNN
F 2 "" H 1750 1900 50  0001 C CNN
F 3 "" H 1750 1900 50  0001 C CNN
	1    1750 1900
	1    0    0    -1  
$EndComp
Wire Wire Line
	2100 2300 1750 2300
Wire Wire Line
	1750 2300 1750 1900
$Comp
L Connector:Conn_01x03_Male J3
U 1 1 5CC1CF14
P 4650 1200
F 0 "J3" H 4756 1478 50  0000 C CNN
F 1 "Conn_01x03_Male" H 4756 1387 50  0000 C CNN
F 2 "Pin_Headers:Pin_Header_Straight_1x03_Pitch2.54mm" H 4650 1200 50  0001 C CNN
F 3 "~" H 4650 1200 50  0001 C CNN
	1    4650 1200
	1    0    0    -1  
$EndComp
Wire Wire Line
	5150 900  5150 1200
Wire Wire Line
	5150 1200 4850 1200
Wire Wire Line
	4850 1300 4950 1300
$Comp
L power:+12V #PWR0112
U 1 1 5CC2F573
P 4900 900
F 0 "#PWR0112" H 4900 750 50  0001 C CNN
F 1 "+12V" H 4915 1073 50  0000 C CNN
F 2 "" H 4900 900 50  0001 C CNN
F 3 "" H 4900 900 50  0001 C CNN
	1    4900 900 
	1    0    0    -1  
$EndComp
Wire Wire Line
	4900 900  4900 1100
Wire Wire Line
	4900 1100 4850 1100
$Comp
L power:+12V #PWR0113
U 1 1 5CC314A5
P 1450 1900
F 0 "#PWR0113" H 1450 1750 50  0001 C CNN
F 1 "+12V" H 1465 2073 50  0000 C CNN
F 2 "" H 1450 1900 50  0001 C CNN
F 3 "" H 1450 1900 50  0001 C CNN
	1    1450 1900
	1    0    0    -1  
$EndComp
Wire Wire Line
	1450 1900 1450 2600
Wire Wire Line
	1450 2600 2100 2600
$Comp
L Connector:Conn_01x04_Male J6
U 1 1 5CBFD8FF
P 7550 4300
F 0 "J6" H 7523 4273 50  0000 R CNN
F 1 "Conn_01x04_Male" H 7523 4182 50  0000 R CNN
F 2 "Pin_Headers:Pin_Header_Straight_1x04_Pitch2.54mm" H 7550 4300 50  0001 C CNN
F 3 "~" H 7550 4300 50  0001 C CNN
	1    7550 4300
	-1   0    0    -1  
$EndComp
Wire Wire Line
	7350 3900 7350 4200
Wire Wire Line
	4000 4400 6800 4400
Wire Wire Line
	6800 4400 6800 4500
Wire Wire Line
	7350 4300 7250 4300
Wire Wire Line
	7250 4300 7250 4800
Wire Wire Line
	6900 4300 6900 4400
Wire Wire Line
	6900 4400 7350 4400
Wire Wire Line
	4000 4300 6900 4300
Wire Wire Line
	6800 4500 7350 4500
$EndSCHEMATC
