(export (version D)
  (design
    (source "C:\\Users\\sverre\\Documents\\home automation\\pcb\\tempsensor-board\\tempsensor\\tempsensor.sch")
    (date "23/04/2019 22:23:54")
    (tool "Eeschema (5.0.1)-3")
    (sheet (number 1) (name /) (tstamps /)
      (title_block
        (title)
        (company)
        (rev)
        (date)
        (source tempsensor.sch)
        (comment (number 1) (value ""))
        (comment (number 2) (value ""))
        (comment (number 3) (value ""))
        (comment (number 4) (value "")))))
  (components
    (comp (ref IC1)
      (value ArduinoProMini)
      (footprint "MySensors Arduino:pro_mini")
      (datasheet http://www.arduino.cc/en/uploads/Main/Arduino-Pro-Mini-schematic.pdf)
      (libsource (lib mysensors_arduino) (part ArduinoProMini) (description "Arduino Pro Mini China variant, ATMEGA328, 16k Flash, 1kB SRAM, 512B EEPROM"))
      (sheetpath (names /) (tstamps /))
      (tstamp 5CBF617A))
    (comp (ref U1)
      (value NRF24L01)
      (footprint "MySensors Radio:NRF24L01")
      (libsource (lib mysensors_radios) (part NRF24L01) (description NRF24L01+))
      (sheetpath (names /) (tstamps /))
      (tstamp 5CBF61FB))
    (comp (ref R1)
      (value 4.7k)
      (footprint Resistors_SMD:R_0603_HandSoldering)
      (datasheet ~)
      (libsource (lib Device) (part R) (description Resistor))
      (sheetpath (names /) (tstamps /))
      (tstamp 5CBF6630))
    (comp (ref C1)
      (value 4.7u)
      (footprint Capacitors_SMD:C_0603_HandSoldering)
      (datasheet ~)
      (libsource (lib Device) (part C) (description "Unpolarized capacitor"))
      (sheetpath (names /) (tstamps /))
      (tstamp 5CBF687A))
    (comp (ref J1)
      (value Conn_01x03_Male)
      (footprint Pin_Headers:Pin_Header_Straight_1x03_Pitch2.54mm_SMD_Pin1Left)
      (datasheet ~)
      (libsource (lib Connector) (part Conn_01x03_Male) (description "Generic connector, single row, 01x03, script generated (kicad-library-utils/schlib/autogen/connector/)"))
      (sheetpath (names /) (tstamps /))
      (tstamp 5CBFD68E))
    (comp (ref J2)
      (value Conn_01x03_Male)
      (footprint Pin_Headers:Pin_Header_Straight_1x03_Pitch2.54mm_SMD_Pin1Left)
      (datasheet ~)
      (libsource (lib Connector) (part Conn_01x03_Male) (description "Generic connector, single row, 01x03, script generated (kicad-library-utils/schlib/autogen/connector/)"))
      (sheetpath (names /) (tstamps /))
      (tstamp 5CBFD6BA))
    (comp (ref J4)
      (value Conn_01x03_Male)
      (footprint Pin_Headers:Pin_Header_Straight_1x03_Pitch2.54mm_SMD_Pin1Left)
      (datasheet ~)
      (libsource (lib Connector) (part Conn_01x03_Male) (description "Generic connector, single row, 01x03, script generated (kicad-library-utils/schlib/autogen/connector/)"))
      (sheetpath (names /) (tstamps /))
      (tstamp 5CBFD6F6))
    (comp (ref J5)
      (value Conn_01x03_Male)
      (footprint Pin_Headers:Pin_Header_Straight_1x03_Pitch2.54mm_SMD_Pin1Left)
      (datasheet ~)
      (libsource (lib Connector) (part Conn_01x03_Male) (description "Generic connector, single row, 01x03, script generated (kicad-library-utils/schlib/autogen/connector/)"))
      (sheetpath (names /) (tstamps /))
      (tstamp 5CBFD72E))
    (comp (ref J3)
      (value Conn_01x03_Male)
      (footprint Pin_Headers:Pin_Header_Straight_1x03_Pitch2.54mm_SMD_Pin1Left)
      (datasheet ~)
      (libsource (lib Connector) (part Conn_01x03_Male) (description "Generic connector, single row, 01x03, script generated (kicad-library-utils/schlib/autogen/connector/)"))
      (sheetpath (names /) (tstamps /))
      (tstamp 5CC1CF14))
    (comp (ref J6)
      (value Conn_01x04_Male)
      (datasheet ~)
      (libsource (lib Connector) (part Conn_01x04_Male) (description "Generic connector, single row, 01x04, script generated (kicad-library-utils/schlib/autogen/connector/)"))
      (sheetpath (names /) (tstamps /))
      (tstamp 5CBFD8FF)))
  (libparts
    (libpart (lib Connector) (part Conn_01x03_Male)
      (description "Generic connector, single row, 01x03, script generated (kicad-library-utils/schlib/autogen/connector/)")
      (docs ~)
      (footprints
        (fp Connector*:*_1x??_*))
      (fields
        (field (name Reference) J)
        (field (name Value) Conn_01x03_Male))
      (pins
        (pin (num 1) (name Pin_1) (type passive))
        (pin (num 2) (name Pin_2) (type passive))
        (pin (num 3) (name Pin_3) (type passive))))
    (libpart (lib Connector) (part Conn_01x04_Male)
      (description "Generic connector, single row, 01x04, script generated (kicad-library-utils/schlib/autogen/connector/)")
      (docs ~)
      (footprints
        (fp Connector*:*_1x??_*))
      (fields
        (field (name Reference) J)
        (field (name Value) Conn_01x04_Male))
      (pins
        (pin (num 1) (name Pin_1) (type passive))
        (pin (num 2) (name Pin_2) (type passive))
        (pin (num 3) (name Pin_3) (type passive))
        (pin (num 4) (name Pin_4) (type passive))))
    (libpart (lib Device) (part C)
      (description "Unpolarized capacitor")
      (docs ~)
      (footprints
        (fp C_*))
      (fields
        (field (name Reference) C)
        (field (name Value) C))
      (pins
        (pin (num 1) (name ~) (type passive))
        (pin (num 2) (name ~) (type passive))))
    (libpart (lib Device) (part R)
      (description Resistor)
      (docs ~)
      (footprints
        (fp R_*))
      (fields
        (field (name Reference) R)
        (field (name Value) R))
      (pins
        (pin (num 1) (name ~) (type passive))
        (pin (num 2) (name ~) (type passive))))
    (libpart (lib mysensors_arduino) (part ArduinoProMini)
      (description "Arduino Pro Mini China variant, ATMEGA328, 16k Flash, 1kB SRAM, 512B EEPROM")
      (docs http://www.arduino.cc/en/uploads/Main/Arduino-Pro-Mini-schematic.pdf)
      (footprints
        (fp pro_mini*))
      (fields
        (field (name Reference) IC)
        (field (name Value) ArduinoProMini)
        (field (name Footprint) mysensors_arduino:pro_mini_china))
      (pins
        (pin (num 1) (name "(PCINT17/TXD)PD1/1") (type BiDi))
        (pin (num 2) (name "(PCINT16/RXD)PD0/0") (type BiDi))
        (pin (num 3) (name "(PCINT14/~RESET~)PC6") (type BiDi))
        (pin (num 4) (name GND) (type power_in))
        (pin (num 5) (name "(PCINT18/INT0)PD2/2") (type BiDi))
        (pin (num 6) (name "(PCINT19/OC2B/INT1/PWM)PD3/3") (type BiDi))
        (pin (num 7) (name "(PCINT20/XCK/T0)PD4/4") (type BiDi))
        (pin (num 8) (name "(PCINT21/OC0B/T1/PWM)PD5/5") (type BiDi))
        (pin (num 9) (name "(PCINT22/OC0A/AIN0/PWM)PD6/6") (type BiDi))
        (pin (num 10) (name "(PCINT23/AIN1)PD7/7") (type BiDi))
        (pin (num 11) (name "(PCINT0/CLKO/ICP1)PB0/8") (type BiDi))
        (pin (num 12) (name "(PCINT1/OC1A/PWM)PB1/9") (type BiDi))
        (pin (num 13) (name "(PCINT2/OC1B/~SS~/PWM)PB2/10") (type BiDi))
        (pin (num 14) (name "(PCINT3/OC2A/MOSI/PWM)PB3/11") (type BiDi))
        (pin (num 15) (name "(PCINT4/MISO)PB4/12") (type BiDi))
        (pin (num 16) (name "(PCINT5/SCK)PB5/13") (type BiDi))
        (pin (num 17) (name "(PCINT8/ADC0)PC0/14/A0") (type BiDi))
        (pin (num 18) (name "(PCINT9/ADC1)PC1/15/A1") (type BiDi))
        (pin (num 19) (name "(PCINT10/ADC2)PC2/16/A2") (type BiDi))
        (pin (num 20) (name "(PCINT11/ADC3)PC3/17/A3") (type BiDi))
        (pin (num 21) (name VCC) (type power_in))
        (pin (num 22) (name "(PCINT14/~RESET~)PC6") (type BiDi))
        (pin (num 23) (name GND) (type power_in))
        (pin (num 24) (name RAW) (type power_in))
        (pin (num 25) (name "(PCINT12/SDA/ADC4)PC4/18/A4") (type BiDi))
        (pin (num 26) (name "(PCINT13/SCL/ADC5)PC5/19/A5") (type BiDi))
        (pin (num 27) (name ADC6/A6) (type input))
        (pin (num 28) (name ADC7/A7) (type input))
        (pin (num 29) (name GND) (type power_in))))
    (libpart (lib mysensors_radios) (part NRF24L01)
      (description NRF24L01+)
      (fields
        (field (name Reference) U)
        (field (name Value) NRF24L01))
      (pins
        (pin (num 1) (name GND) (type power_in))
        (pin (num 2) (name VCC) (type power_in))
        (pin (num 3) (name CE) (type input))
        (pin (num 4) (name CSN) (type input))
        (pin (num 5) (name SCK) (type input))
        (pin (num 6) (name MOSI) (type input))
        (pin (num 7) (name MISO) (type input))
        (pin (num 8) (name IRQ) (type output)))))
  (libraries
    (library (logical Connector)
      (uri "C:\\Program Files\\KiCad\\share\\kicad\\library/Connector.lib"))
    (library (logical Device)
      (uri "C:\\Program Files\\KiCad\\share\\kicad\\library/Device.lib"))
    (library (logical mysensors_arduino)
      (uri C:/Users/sverre/Documents/kikad/mysensors-symbols/mysensors_arduino.lib))
    (library (logical mysensors_radios)
      (uri C:/Users/sverre/Documents/kikad/mysensors-symbols/mysensors_radios.lib)))
  (nets
    (net (code 1) (name +3V3)
      (node (ref C1) (pin 1))
      (node (ref J3) (pin 2))
      (node (ref J6) (pin 1))
      (node (ref J5) (pin 1))
      (node (ref U1) (pin 2))
      (node (ref R1) (pin 2))
      (node (ref IC1) (pin 21))
      (node (ref J1) (pin 1))
      (node (ref J2) (pin 1))
      (node (ref J4) (pin 1)))
    (net (code 2) (name GND)
      (node (ref IC1) (pin 23))
      (node (ref IC1) (pin 4))
      (node (ref J4) (pin 3))
      (node (ref J2) (pin 3))
      (node (ref C1) (pin 2))
      (node (ref IC1) (pin 29))
      (node (ref U1) (pin 1))
      (node (ref J1) (pin 3))
      (node (ref J3) (pin 3))
      (node (ref J5) (pin 3))
      (node (ref J6) (pin 4)))
    (net (code 3) (name +12V)
      (node (ref IC1) (pin 24))
      (node (ref J3) (pin 1)))
    (net (code 4) (name "Net-(IC1-Pad25)")
      (node (ref J6) (pin 2))
      (node (ref IC1) (pin 25)))
    (net (code 5) (name "Net-(IC1-Pad26)")
      (node (ref IC1) (pin 26))
      (node (ref J6) (pin 3)))
    (net (code 6) (name "Net-(IC1-Pad6)")
      (node (ref R1) (pin 1))
      (node (ref J1) (pin 2))
      (node (ref J2) (pin 2))
      (node (ref J4) (pin 2))
      (node (ref J5) (pin 2))
      (node (ref IC1) (pin 6)))
    (net (code 7) (name "Net-(IC1-Pad17)")
      (node (ref IC1) (pin 17)))
    (net (code 8) (name "Net-(IC1-Pad27)")
      (node (ref IC1) (pin 27)))
    (net (code 9) (name "Net-(IC1-Pad18)")
      (node (ref IC1) (pin 18)))
    (net (code 10) (name "Net-(IC1-Pad28)")
      (node (ref IC1) (pin 28)))
    (net (code 11) (name "Net-(IC1-Pad19)")
      (node (ref IC1) (pin 19)))
    (net (code 12) (name "Net-(IC1-Pad11)")
      (node (ref IC1) (pin 11)))
    (net (code 13) (name "Net-(IC1-Pad2)")
      (node (ref IC1) (pin 2)))
    (net (code 14) (name "Net-(IC1-Pad3)")
      (node (ref IC1) (pin 3)))
    (net (code 15) (name "Net-(IC1-Pad7)")
      (node (ref IC1) (pin 7)))
    (net (code 16) (name "Net-(IC1-Pad8)")
      (node (ref IC1) (pin 8)))
    (net (code 17) (name "Net-(IC1-Pad9)")
      (node (ref IC1) (pin 9)))
    (net (code 18) (name "Net-(IC1-Pad10)")
      (node (ref IC1) (pin 10)))
    (net (code 19) (name "Net-(IC1-Pad20)")
      (node (ref IC1) (pin 20)))
    (net (code 20) (name "Net-(IC1-Pad22)")
      (node (ref IC1) (pin 22)))
    (net (code 21) (name "Net-(IC1-Pad13)")
      (node (ref U1) (pin 4))
      (node (ref IC1) (pin 13)))
    (net (code 22) (name "Net-(IC1-Pad15)")
      (node (ref U1) (pin 7))
      (node (ref IC1) (pin 15)))
    (net (code 23) (name "Net-(IC1-Pad16)")
      (node (ref U1) (pin 5))
      (node (ref IC1) (pin 16)))
    (net (code 24) (name "Net-(IC1-Pad14)")
      (node (ref IC1) (pin 14))
      (node (ref U1) (pin 6)))
    (net (code 25) (name "Net-(IC1-Pad5)")
      (node (ref U1) (pin 8))
      (node (ref IC1) (pin 5)))
    (net (code 26) (name "Net-(IC1-Pad1)")
      (node (ref IC1) (pin 1)))
    (net (code 27) (name "Net-(IC1-Pad12)")
      (node (ref IC1) (pin 12))
      (node (ref U1) (pin 3)))))