{
    "name": {
        "en-US": "started"
    },
    "description": {
        "en-US": "An actor has started the object."
    },
    "exactMatch": [
        "https://registry.tincanapi.com/#uri/verb/149"
    ]

}
