{
"name": {
	"en-US": "removed",
	"de-DE": "entfernt"
},
"description": {
	"en-US": "Actor removed an object/person from a collection",
	"de-DE": "Akteur hat ein/e Objekt/Person von einer Sammlung entfernt"
},
"exactMatch": [
	"https://activitystrea.ms/registry/verbs/",
	"https://registry.tincanapi.com/#uri/verb/133"
],
"relatedMatch": [
]
}
