{
    "name": {
        "en-US": "clicked",
        "de-DE": "klickte"
    },
    "description": {
        "en-US": "An actor clicked on something on the screen.",
        "de-DE": "Ein Akteur klickte auf ein Objekt auf dem Bildschirm."
    }
}