{
    "name": {
        "de-DE": "findet Möglichkeiten zur Strukturierung einer Aufgabe"
    },
    "description": {
        "de-DE": "Subscore (5/5 bzw. ++) wenn ein Akteuer Möglichkeiten zur Strukturierung einer Aufgabe findet"
    },
    "result":{
        "score":{
          "min": 1,
          "max": 5
        }
    }
}