{
    "name": {
        "en-US": "interrupted",
        "de-DE": "unterbrach"
    },
    "description": {
        "en-US": "An actor has interrupted someone/ cut someone off.",
        "de-DE": "Eine Akteurin hat jemanden unterbrochen/ ist jemandem ins Wort gefallen."
    }
}