{
    "name": {
        "de-DE": "verhält sich höflich, freundlich und wohlwollend"
    },
    "description": {
        "de-DE": "Subscore (5/5 bzw. ++) wenn ein Akteuer sich höflich, freundlich und wohlwollend verhält"
    },
    "result":{
        "score":{
          "min": 1,
          "max": 5
        }
    }
}