{
    "name": {
        "en-US": "received",
        "de-DE": "erhielt"
    },
    "description": {
        "en-US": "An actor received for example an item or help.",
        "de-DE": "Ein Akteur erhielt zum Beispiel einen Gegenstand oder Hilfe."
    },
    "exactMatch": [
        "https://registry.tincanapi.com/#uri/verb/131",
        "https://activitystrea.ms/schema/1.0/receive"
    ]
}