{
    "name": {
        "en-US": "task",
        "de-DE": "Aufgabe"
    },
    "description": {
        "en-US": "Some part of the goal or something to be completed to progress within the game or a level.",
        "de-DE": "Eine Aufgabe, die zum Erreichen des Ziels erfüllt werden muss oder zum Abschließen eines Levels."
    },
    "relatedMatch": ["https://registry.tincanapi.com/#uri/activityType/10"]
}