{
    "name": {
        "en-US": "run",
        "de-DE": "führte aus"
    },
    "description": {
        "en-US": "Indicates, that an actor run some programming context. Typically a Jupyter Notebook Code Cell.",
        "de-DE": "Signalisiert, dass ein Akteur ein Programmierkonstrukt ausführte. Typischerweise eine Jupyter Notebook Codezelle."
    }
}
