{
    "name": {
        "en-US": "deselected",
        "de-DE": "nahm Auswahl zurück"
    },
    "description": {
        "en-US": "An actor deselected a option.",
        "de-DE": "Ein Akteur nahm die Auswahl einer Option zurück."
    }
}
