<svg width="59" height="63" viewBox="0 0 59 63" fill="none" xmlns="http://www.w3.org/2000/svg">
<path fill-rule="evenodd" clip-rule="evenodd" d="M16.5787 15.156C14.301 14.1875 12.1487 13.2723 7.86996 13.4103C0.769692 13.6394 -0.787859 20.421 0.325807 27.9405C1.24169 34.1246 5.53217 42.7791 8.28063 47.3599C11.0291 51.9407 17.8734 62.7775 20.6638 62.6171C23.3353 62.4637 23.2305 58.8215 23.1076 54.5486C23.0037 50.9355 22.8868 46.8715 24.4245 44.0843C26.3054 40.6751 28.8564 43.16 28.6359 45.2542C27.7 54.145 30.7704 51.1132 35.1871 44.3183C38.1646 39.7375 40.284 33.8449 40.1004 27.4344C39.7679 15.8256 35.6563 16.2436 29.7948 16.8396C27.4061 17.0825 24.7268 17.3549 21.8942 16.8549C19.6373 16.4566 18.0807 15.7947 16.5787 15.156ZM12.808 19.7895C14.2119 20.2575 17.7539 20.9584 20.763 20.7254C25.058 20.3929 26.3667 19.8028 27.3081 19.3784C27.5536 19.2677 27.7741 19.1683 28.016 19.0876C28.016 19.0876 22.6685 19.3704 18.4233 18.1517C16.9929 17.7411 15.855 17.3284 14.8482 16.9632C12.5009 16.1119 10.8656 15.5188 7.89469 15.8121C4.33297 16.1637 1.14337 19.1365 2.78115 28.4952C4.3001 37.1749 8.80864 44.2024 12.0679 49.2827C12.3229 49.6802 12.5703 50.0657 12.808 50.4392C16.0835 55.5865 19.3928 59.709 20.295 59.564C21.5135 59.3683 21.3697 57.7821 21.1458 55.312C20.8906 52.4967 20.5313 48.533 21.9665 44.1711C24.106 37.669 30.3556 40.1446 30.3556 43.8881C30.3556 47.141 30.5649 47.1663 30.7671 47.1907C30.7976 47.1944 30.8279 47.198 30.8573 47.2127C31.1259 47.347 35.5704 42.5824 37.4084 34.1105C39.3577 25.126 37.1407 20.2571 34.5671 20.0233C33.4858 19.9251 31.8677 20.405 29.9382 20.9772C27.2752 21.767 24.0191 22.7326 20.763 22.5969C16.2707 22.4098 13.5879 20.6473 12.808 19.7895Z" fill="#2957A4"/>
<path d="M32.9895 62.2951C46.5597 61.5932 58.9601 48.3871 58.9601 31.8792C58.9601 13.5524 43.7521 -2.28009 24.5667 1.22921C42.2331 0.098421 55.6845 14.5999 55.6845 32.3471C55.6845 47.5645 45.1559 59.7214 32.9895 62.2951Z" fill="#62CCF5"/>
</svg>
