-- Merging decision tree log ---
manifest
ADDED from E:\AndroidProject\re_avepay\avepay-emartplace-lasane-android-addfunction-2020\libraries\HorizontalVariableListView\src\main\AndroidManifest.xml:1:1-5:12
INJECTED from E:\AndroidProject\re_avepay\avepay-emartplace-lasane-android-addfunction-2020\libraries\HorizontalVariableListView\src\main\AndroidManifest.xml:1:1-5:12
INJECTED from E:\AndroidProject\re_avepay\avepay-emartplace-lasane-android-addfunction-2020\libraries\HorizontalVariableListView\src\main\AndroidManifest.xml:1:1-5:12
INJECTED from E:\AndroidProject\re_avepay\avepay-emartplace-lasane-android-addfunction-2020\libraries\HorizontalVariableListView\src\main\AndroidManifest.xml:1:1-5:12
INJECTED from E:\AndroidProject\re_avepay\avepay-emartplace-lasane-android-addfunction-2020\libraries\HorizontalVariableListView\src\main\AndroidManifest.xml:1:1-5:12
INJECTED from E:\AndroidProject\re_avepay\avepay-emartplace-lasane-android-addfunction-2020\libraries\HorizontalVariableListView\src\main\AndroidManifest.xml:1:1-5:12
INJECTED from E:\AndroidProject\re_avepay\avepay-emartplace-lasane-android-addfunction-2020\libraries\HorizontalVariableListView\src\main\AndroidManifest.xml:1:1-5:12
	package
		ADDED from E:\AndroidProject\re_avepay\avepay-emartplace-lasane-android-addfunction-2020\libraries\HorizontalVariableListView\src\main\AndroidManifest.xml:1:11-49
		INJECTED from E:\AndroidProject\re_avepay\avepay-emartplace-lasane-android-addfunction-2020\libraries\HorizontalVariableListView\src\main\AndroidManifest.xml
		INJECTED from E:\AndroidProject\re_avepay\avepay-emartplace-lasane-android-addfunction-2020\libraries\HorizontalVariableListView\src\main\AndroidManifest.xml
	android:versionName
		INJECTED from E:\AndroidProject\re_avepay\avepay-emartplace-lasane-android-addfunction-2020\libraries\HorizontalVariableListView\src\main\AndroidManifest.xml
		ADDED from E:\AndroidProject\re_avepay\avepay-emartplace-lasane-android-addfunction-2020\libraries\HorizontalVariableListView\src\main\AndroidManifest.xml:1:1-5:12
		INJECTED from E:\AndroidProject\re_avepay\avepay-emartplace-lasane-android-addfunction-2020\libraries\HorizontalVariableListView\src\main\AndroidManifest.xml
	xmlns:android
		ADDED from E:\AndroidProject\re_avepay\avepay-emartplace-lasane-android-addfunction-2020\libraries\HorizontalVariableListView\src\main\AndroidManifest.xml:1:1-5:12
	android:versionCode
		INJECTED from E:\AndroidProject\re_avepay\avepay-emartplace-lasane-android-addfunction-2020\libraries\HorizontalVariableListView\src\main\AndroidManifest.xml
		ADDED from E:\AndroidProject\re_avepay\avepay-emartplace-lasane-android-addfunction-2020\libraries\HorizontalVariableListView\src\main\AndroidManifest.xml:1:1-5:12
		INJECTED from E:\AndroidProject\re_avepay\avepay-emartplace-lasane-android-addfunction-2020\libraries\HorizontalVariableListView\src\main\AndroidManifest.xml
application
ADDED from E:\AndroidProject\re_avepay\avepay-emartplace-lasane-android-addfunction-2020\libraries\HorizontalVariableListView\src\main\AndroidManifest.xml:3:2-17
uses-sdk
INJECTED from E:\AndroidProject\re_avepay\avepay-emartplace-lasane-android-addfunction-2020\libraries\HorizontalVariableListView\src\main\AndroidManifest.xml reason: use-sdk injection requested
INJECTED from E:\AndroidProject\re_avepay\avepay-emartplace-lasane-android-addfunction-2020\libraries\HorizontalVariableListView\src\main\AndroidManifest.xml
INJECTED from E:\AndroidProject\re_avepay\avepay-emartplace-lasane-android-addfunction-2020\libraries\HorizontalVariableListView\src\main\AndroidManifest.xml
INJECTED from E:\AndroidProject\re_avepay\avepay-emartplace-lasane-android-addfunction-2020\libraries\HorizontalVariableListView\src\main\AndroidManifest.xml
INJECTED from E:\AndroidProject\re_avepay\avepay-emartplace-lasane-android-addfunction-2020\libraries\HorizontalVariableListView\src\main\AndroidManifest.xml
	android:targetSdkVersion
		INJECTED from E:\AndroidProject\re_avepay\avepay-emartplace-lasane-android-addfunction-2020\libraries\HorizontalVariableListView\src\main\AndroidManifest.xml
		ADDED from E:\AndroidProject\re_avepay\avepay-emartplace-lasane-android-addfunction-2020\libraries\HorizontalVariableListView\src\main\AndroidManifest.xml
		INJECTED from E:\AndroidProject\re_avepay\avepay-emartplace-lasane-android-addfunction-2020\libraries\HorizontalVariableListView\src\main\AndroidManifest.xml
	android:minSdkVersion
		INJECTED from E:\AndroidProject\re_avepay\avepay-emartplace-lasane-android-addfunction-2020\libraries\HorizontalVariableListView\src\main\AndroidManifest.xml
		ADDED from E:\AndroidProject\re_avepay\avepay-emartplace-lasane-android-addfunction-2020\libraries\HorizontalVariableListView\src\main\AndroidManifest.xml
		INJECTED from E:\AndroidProject\re_avepay\avepay-emartplace-lasane-android-addfunction-2020\libraries\HorizontalVariableListView\src\main\AndroidManifest.xml
