{
  "project_info": {
    "project_number": "77012667860",
    "firebase_url": "https://avplay-a8898.firebaseio.com",
    "project_id": "avplay-a8898",
    "storage_bucket": "avplay-a8898.appspot.com"
  },
  "client": [
    {
      "client_info": {
        "mobilesdk_app_id": "1:77012667860:android:1216ec643c8e68a64a1a41",
        "android_client_info": {
          "package_name": "com.aveplus.avepay_cpocket"
        }
      },
      "oauth_client": [
        {
          "client_id": "77012667860-gsbnt73ff935r3k2dk8qlj6gpkl96oc7.apps.googleusercontent.com",
          "client_type": 1,
          "android_info": {
            "package_name": "com.aveplus.avepay_cpocket",
            "certificate_hash": "36d5acb0be0c71e79f5c4b340e58ab9539b9abb5"
          }
        },
        {
          "client_id": "77012667860-bmd6sg70a5ihaau5fr20hajolql5ops8.apps.googleusercontent.com",
          "client_type": 3
        }
      ],
      "api_key": [
        {
          "current_key": "AIzaSyB1Udwbi8jt9wjUcTK0_p1WqT6PFHB7Sfo"
        }
      ],
      "services": {
        "appinvite_service": {
          "other_platform_oauth_client": [
            {
              "client_id": "77012667860-bmd6sg70a5ihaau5fr20hajolql5ops8.apps.googleusercontent.com",
              "client_type": 3
            }
          ]
        }
      }
    }
  ],
  "configuration_version": "1"
}