<svg xmlns="http://www.w3.org/2000/svg" width="42" height="42" viewBox="0 0 8 16">
    <path fill="#474B68" fill-rule="nonzero" d="M2.148 3.747v2.074H.628v2.536h1.52v7.536h3.12V8.358h2.095s.196-1.216.291-2.546H5.281V4.078c0-.26.34-.608.676-.608h1.7V.83H5.347C2.07.83 2.148 3.37 2.148 3.747z"/>
</svg>
