<svg width="79" height="81" viewBox="0 0 79 81" fill="none" xmlns="http://www.w3.org/2000/svg">
<path d="M23.3519 65.7587V61.2884L40.1401 42.9109C42.1103 40.7585 43.7328 38.8876 45.0077 37.2982C46.2825 35.6923 47.2262 34.1856 47.8388 32.7783C48.4679 31.3545 48.7825 29.8644 48.7825 28.3081C48.7825 26.52 48.3521 24.972 47.4911 23.6641C46.6467 22.3561 45.4878 21.3462 44.0143 20.6342C42.5408 19.9223 40.8851 19.5663 39.0474 19.5663C37.0937 19.5663 35.3884 19.972 33.9314 20.7832C32.491 21.5779 31.3735 22.6955 30.5788 24.1359C29.8006 25.5763 29.4115 27.2651 29.4115 29.2022H23.5506C23.5506 26.222 24.2377 23.6061 25.6119 21.3544C26.986 19.1028 28.8569 17.3478 31.2245 16.0895C33.6086 14.8312 36.2824 14.2021 39.246 14.2021C42.2262 14.2021 44.8669 14.8312 47.1683 16.0895C49.4696 17.3478 51.2743 19.0448 52.5822 21.1806C53.8902 23.3164 54.5441 25.6922 54.5441 28.3081C54.5441 30.179 54.2047 32.0085 53.5259 33.7966C52.8637 35.5681 51.7047 37.5466 50.0491 39.732C48.41 41.9009 46.1335 44.5499 43.2196 47.6791L31.7957 59.8977V60.2951H55.4382V65.7587H23.3519Z" fill="#374151"/>
</svg>
