<svg width="79" height="80" viewBox="0 0 79 80" fill="none" xmlns="http://www.w3.org/2000/svg">
<path d="M39.246 66.2035C36.3321 66.2035 33.7079 65.6241 31.3735 64.4651C29.039 63.3062 27.1682 61.7168 25.7609 59.6969C24.3536 57.677 23.5837 55.3757 23.4512 52.7929H29.4115C29.6433 55.0942 30.6864 56.9982 32.5407 58.5048C34.4116 59.9949 36.6467 60.7399 39.246 60.7399C41.3321 60.7399 43.1865 60.2515 44.809 59.2747C46.4481 58.2979 47.7312 56.9568 48.6583 55.2515C49.6021 53.5296 50.0739 51.5843 50.0739 49.4154C50.0739 47.1968 49.5855 45.2183 48.6087 43.4799C47.6484 41.7249 46.3239 40.3425 44.6351 39.3325C42.9464 38.3226 41.0176 37.8093 38.8487 37.7928C37.2924 37.7762 35.6947 38.0163 34.0556 38.513C32.4165 38.9931 31.0672 39.614 30.0076 40.3756L24.246 39.6802L27.3254 14.647H53.7494V20.1106H32.491L30.7029 35.1107H31.001C32.044 34.2828 33.352 33.5957 34.9248 33.0494C36.4977 32.503 38.1368 32.2298 39.8421 32.2298C42.9547 32.2298 45.7279 32.9749 48.1617 34.465C50.612 35.9385 52.5325 37.9583 53.9233 40.5246C55.3306 43.0908 56.0342 46.0213 56.0342 49.316C56.0342 52.5611 55.3057 55.4585 53.8488 58.0081C52.4084 60.5413 50.4216 62.5446 47.8885 64.0181C45.3553 65.4751 42.4745 66.2035 39.246 66.2035Z" fill="#374151"/>
</svg>
