<svg width="101" height="101" viewBox="0 0 101 101" fill="none" xmlns="http://www.w3.org/2000/svg">
<rect x="0.5" y="0.5" width="100" height="100" fill="white" stroke="#D1D5DB"/>
<path d="M59.7874 25.6871V30.5435C59.7874 32.0019 58.6208 33.1836 57.1811 33.1836H36.3596V25.6871C36.3596 22.3131 39.0601 19.5776 42.3909 19.5776H53.7552C57.0877 19.5776 59.7874 22.3131 59.7874 25.6871Z" fill="#B8CDDF"/>
<path d="M77.7802 39.0184H67.3404C63.3612 32.6016 56.3306 28.3225 48.2978 28.3225C40.2649 28.3225 33.2354 32.6016 29.2562 39.0184H24.4999L26.4999 63.0001H28.9999C32.9791 69.4177 40.2649 73.8924 48.2978 73.8924C56.3306 73.8924 64.0207 69.4177 67.9999 63.0001H77.9999L77.7802 39.0184Z" fill="#005A96"/>
<path opacity="0.15" d="M55.0733 20.126C56.5388 21.145 57.5261 23.0287 57.5261 25.1899V29.8566C57.5261 31.258 56.5688 32.3936 55.3873 32.3936H54.948V33.1938H57.7586C58.9401 33.1938 59.8974 32.0583 59.8974 30.6569V25.9901C59.8974 22.7975 57.7482 20.2053 55.0733 20.126Z" fill="#222221"/>
<path opacity="0.3" d="M86.6885 46.392H73.9625C73.5947 46.392 72.2657 45.4253 72.2657 44.2435C72.2657 43.0616 73.5947 42.095 73.9625 42.095H86.6885C87.0562 42.095 88.3853 43.0616 88.3853 44.2435C88.3853 45.4244 87.0566 46.392 86.6885 46.392Z" fill="white"/>
<path d="M52.7525 12.0734C52.9528 11.8234 68.376 3.04578 68.0175 14.2974C67.6922 24.51 53.3132 17.2452 53.3132 17.2452L52.7525 12.0734Z" fill="#D33C1E"/>
<path d="M66.6154 15.5906C66.908 6.4866 56.6852 10.6114 52.8108 12.5695L52.7525 12.0424C52.9528 11.7946 68.376 3.09425 68.0175 14.2468C67.939 16.6873 67.0436 18.1207 65.73 18.8909C66.2487 18.0861 66.5699 17.0082 66.6154 15.5906Z" fill="#FF4C22"/>
<path d="M45.1167 11.4832C44.9053 11.214 28.6257 1.76035 29.0036 13.8783C29.3477 24.8764 44.5257 17.052 44.5257 17.052L45.1167 11.4832Z" fill="#FF4C22"/>
<path d="M30.9866 8.57832C30.4131 9.53223 30.0509 10.8333 30.1069 12.6614C30.3894 21.9159 40.8965 17.88 44.2685 16.3425L44.1955 17.0452C44.1955 17.0452 29.3392 24.8899 29.0032 13.8621C28.9184 11.0732 29.7404 9.46109 30.9866 8.57832Z" fill="#D33C1E"/>
<path d="M58.4834 27.271H37.6654C35.2491 27.271 34.0876 28.5025 34.0876 30.0073C34.0876 31.5121 35.2491 32.7436 37.6654 32.7436H58.4834C60.8997 32.7436 62.0611 31.5121 62.0611 30.0073C62.0611 28.5017 60.8997 27.271 58.4834 27.271Z" fill="#568EBD"/>
<path d="M40.045 18.2762L41.0644 12.5172C41.1137 12.2396 41.2589 11.9871 41.4772 11.7988L44.8275 8.90141C45.0679 8.69358 45.3806 8.57832 45.705 8.57832H48.0861H50.4672C50.7917 8.57832 51.1043 8.69358 51.3447 8.90141L54.695 11.7988C54.9129 11.9871 55.0581 12.2396 55.1072 12.5172L56.1273 18.2762C56.2621 19.0377 55.6488 19.7334 54.8404 19.7351L48.0861 19.7505L41.332 19.7351C40.5233 19.7334 39.91 19.0377 40.045 18.2762Z" fill="#FF4C22"/>
<path d="M40.0451 18.2762L41.0713 12.5172C41.12 12.2396 41.2661 11.9871 41.4857 11.7988L44.8556 8.90141C45.0974 8.69358 45.4119 8.57832 45.7383 8.57832H46.6722L43.8423 11.0113C43.6235 11.1997 43.4774 11.4529 43.4279 11.7298L42.4017 17.4888C42.2658 18.2503 42.8827 18.946 43.6962 18.9476L50.4898 18.963L56.1459 18.95C55.9536 19.4038 55.4869 19.7334 54.9272 19.7351L48.1333 19.7505L41.3396 19.7351C40.5262 19.7334 39.9093 19.0377 40.0451 18.2762Z" fill="#D33C1E"/>
<path d="M50.2072 8.57024C50.2072 8.57024 50.0525 6.13137 48.0862 6.0044C46.1015 5.87547 45.9652 8.57812 45.9652 8.57812L50.2072 8.57024Z" fill="#568EBD"/>
<path d="M49.1082 7.71875C49.1109 7.71875 49.1137 7.71875 49.1155 7.71875C49.2932 7.71476 49.3716 7.57324 49.357 7.46254C49.3105 7.09618 48.5386 6.85935 48.0528 6.85935C47.7894 6.85935 47.6099 6.92897 47.6755 7.08533C47.7375 7.23198 48.0146 7.29419 48.2552 7.31073C48.391 7.32044 48.5377 7.325 48.6434 7.37921C48.7409 7.42886 48.7801 7.50933 48.8357 7.58009C48.8913 7.64914 48.9861 7.71875 49.1082 7.71875Z" fill="#CDCDCD"/>
<path d="M52.0679 13.7346C52.2574 13.7346 52.4469 13.7245 52.6356 13.7006C52.877 13.6684 53.1272 13.6076 53.311 13.4282C54.0472 12.7096 53.2325 11.4913 52.5117 11.3276C51.9837 11.2079 51.4306 11.1564 50.8742 11.1564C50.1146 11.1564 49.3476 11.253 48.6293 11.4012C48.4228 11.4444 48.209 11.4978 48.0438 11.645C47.8462 11.8208 47.749 12.1051 47.6947 12.383C47.6388 12.6691 47.6364 13.0142 47.834 13.2009C47.9579 13.3169 48.1272 13.3399 48.2867 13.3574C49.1444 13.4531 50.0012 13.5487 50.8588 13.6444C51.2605 13.6895 51.6646 13.7346 52.0679 13.7346Z" fill="#FF967D"/>
<path d="M11.5 50.5C11.5 43.5964 17.0964 38 24 38H98.5V63H24C17.0964 63 11.5 57.4036 11.5 50.5Z" fill="#005A96"/>
<path d="M24 50.5C24 57.4036 31.4036 63 24.5 63C17.5964 63 12 57.4036 12 50.5C12 43.5964 17.5964 38 24.5 38C31.4036 38 24 43.5964 24 50.5Z" fill="#4B525E"/>
<path opacity="0.3" d="M84.4228 46.3917H71.6968C71.3291 46.3917 70 45.4251 70 44.2432C70 43.0614 71.3291 42.0947 71.6968 42.0947H84.4228C84.7906 42.0947 86.1196 43.0614 86.1196 44.2432C86.1196 45.4242 84.7909 46.3917 84.4228 46.3917Z" fill="white"/>
<path opacity="0.3" d="M34.4228 46.3917H21.6968C21.3291 46.3917 20 45.4251 20 44.2432C20 43.0614 21.3291 42.0947 21.6968 42.0947H34.4228C34.7906 42.0947 36.1196 43.0614 36.1196 44.2432C36.1196 45.4242 34.7909 46.3917 34.4228 46.3917Z" fill="white"/>
<path d="M23.5 66C25.6998 66 27.5 63.8088 27.5 61.132V39.868C27.5 37.1903 25.6998 35 23.5 35C21.3003 35 19.5 37.1912 19.5 39.868V61.132C19.5 63.8097 21.2994 66 23.5 66Z" fill="#374151"/>
<path d="M96 66C98.1998 66 100 63.8088 100 61.132V39.868C100 37.1903 98.1998 35 96 35C93.8002 35 92 37.1912 92 39.868V61.132C92 63.8097 93.7994 66 96 66Z" fill="#568EBD"/>
</svg>
