/*
   Copyright (C) 2024 Michael Nelson Moran

   This file is part of OSCL.

   OSCL is free software; you can redistribute it and/or modify it
   under the terms of the GNU General Public License as published by
   the Free Software Foundation; either version 2, or (at your option)
   any later version.

   OSCL is distributed in the hope that it will be useful, but WITHOUT
   ANY WARRANTY; without even the implied warranty of MERCHANTABILITY
   or FITNESS FOR A PARTICULAR PURPOSE.  See the GNU General Public
   License for more details.

   You should have received a copy of the GNU General Public License
   along with OSCL; see the file COPYING.  If not, write to the Free
   Software Foundation, 59 Temple Place - Suite 330, Boston, MA
   02111-1307, USA.

   To negotiate other licensing arrangments/agreements contact
   the copyright holder:

   Michael N. Moran
   218 Wilshire Terrace       mike@mnmoran.org
   White, GA, USA 30184       http://mnmoran.org
*/

/* Default linker script, for normal executables */
OUTPUT_FORMAT("elf32-littlearm", "elf32-bigarm", "elf32-littlearm")
OUTPUT_ARCH(arm)

ENTRY(__cortexReset)

/* 
 */
MEMORY {
	FLASH		: o = 0x08000000, l = 0x00100000	/* 1MB bank */
	FLASH2		: o = 0x08100000, l = 0x00100000	/* Second 1MB bank on H7A3 & H7B3 */
	AXISRAM1	: o = 0x24000000, l = 0x00040000	/* AXI SRAM1 256KB */
	AXISRAM2	: o = 0x24040000, l = 0x00060000	/* AXI SRAM2 384KB */
	AXISRAM3	: o = 0x240A0000, l = 0x00060000	/* AXI SRAM3 384KB */
	AHBSRAM1	: o = 0x30000000, l = 0x00010000	/* AHB SRAM1 64KB */
	AHBSRAM2	: o = 0x30010000, l = 0x00020000	/* AHB SRAM2 384KB */
	DTCMRAM		: o = 0x20000000, l = 0x00020000	/* DTCM-RAM 128KB */
	ITCMRAM		: o = 0x00000000, l = 0x00010000	/* ITCM-RAM 64KB */
	SRDSRAM		: o = 0x38000000, l = 0x00008000	/* SRD SRAM 32KB */
	BackupSRAM	: o = 0x38800000, l = 0x00001000	/* Backup SRAM 4KB */
	}

SECTIONS
{
	VECTORS : {
	  /* Use something like this to place a specific
	     function's address into the vector table.
	     LONG (ABSOLUTE (_foobar)).
		*/
	  *(.vectors)

	/*	The vect.x file is implementation specific.
		The project build should include an include
		path to the location of its own vect.x .
		e.g., -L $(buildir)
	 */
	INCLUDE vect.x
	} > FLASH

	FASTTEXT : {
		"*FreeRTOS/Source/*.o" (.text*)
		*(.fasttext)
		} > ITCMRAM AT > FLASH

	PROVIDE( ___fasttext_flash_start = LOADADDR(FASTTEXT));
	PROVIDE( ___fastram_ram_start = ADDR(FASTTEXT));
	PROVIDE( ___fastram_ram_end = ADDR(FASTTEXT) + SIZEOF(FASTTEXT) );

	/* Read-only sections, merged into text segment: */
	CODEANDCONST : {
		*(.interp)
		*(.hash)
		*(.dynsym)
		*(.dynstr)
		*(.gnu.version)
		*(.gnu.version_d)
		*(.gnu.version_r)
		*(.rel.init)
		*(.rela.init)
		*(.rel.text .rel.text.* .rel.gnu.linkonce.t.*)
		*(.rela.text .rela.text.* .rela.gnu.linkonce.t.*)
		*(.rel.fini)
		*(.rela.fini)
		*(.rel.rodata .rel.rodata.* .rel.gnu.linkonce.r.*)
		*(.rela.rodata .rela.rodata.* .rela.gnu.linkonce.r.*)
		*(.rel.data .rel.data.* .rel.gnu.linkonce.d.*)
		*(.rela.data .rela.data.* .rela.gnu.linkonce.d.*)
		*(.gnu.linkonce.d.*)
		*(.rel.tdata .rel.tdata.* .rel.gnu.linkonce.td.*)
		*(.rela.tdata .rela.tdata.* .rela.gnu.linkonce.td.*)
		*(.rel.ctors)
		*(.rela.ctors)
		*(.rel.dtors)
		*(.rela.dtors)
		KEEP (*(.init))
    	*(.text .stub .text.* .gnu.linkonce.t.*)
		/* .gnu.warning sections are handled specially by elf32.em.  */
    	*(.gnu.warning)
		KEEP (*(.fini))
		*(.rodata .rodata.* .gnu.linkonce.r.*)
		*(.rodata1)

		PROVIDE_HIDDEN (__exidx_start = .);
		PROVIDE_HIDDEN (__exidx_end = .);

		/* Adjust the address for the data segment.  We want to adjust up to
			the same address within the page on the next page up.  */
		. = ALIGN(2) + (. & (2 - 1));

		/* Ensure the __preinit_array_start label is properly aligned.  We
			could instead move the label definition inside the section, but
			the linker would then create the section even if it turns out to
			be empty, which isn't pretty.  */
		. = ALIGN(32 / 8);

		PROVIDE (__preinit_array_start = .);
		*(.preinit_array)
		PROVIDE (__preinit_array_end = .);

		PROVIDE (__init_array_start = .);
		KEEP (*(SORT_BY_INIT_PRIORITY(.init_array.*) SORT_BY_INIT_PRIORITY(.ctors.*)))
		KEEP (*(.init_array EXCLUDE_FILE (*crtbegin.o *crtbegin?.o *crtend.o *crtend?.o ) .ctors))
		PROVIDE (__init_array_end = .);

		PROVIDE (__fini_array_start = .);
		*(.fini_array)
		PROVIDE (__fini_array_end = .);
		PROVIDE (__etext = .);
		PROVIDE (_etext = .);
		PROVIDE (etext = .);
		} > FLASH

	.ctors : {
		/* gcc uses crtbegin.o to find the start of
			the constructors, so we make sure it is
			first.  Because this is a wildcard, it
			doesn't matter if the user does not
			actually link against crtbegin.o; the
			linker won't look for a file to match a
			wildcard.  The wildcard also means that it
			doesn't matter which directory crtbegin.o
			is in.  */
		KEEP (*crtbegin.o(.ctors))
		/* We don't want to include the .ctor section from
			from the crtend.o file until after the sorted ctors.
			The .ctor section from the crtend file contains the
			end of ctors marker and it must be last */
		KEEP (*(EXCLUDE_FILE (*crtend.o ) .ctors))
		KEEP (*(SORT(.ctors.*)))
		KEEP (*(.ctors))
		} > FLASH

	.dtors : {
		KEEP (*crtbegin.o(.dtors))
		KEEP (*(EXCLUDE_FILE (*crtend.o ) .dtors))
		KEEP (*(SORT(.dtors.*)))
		KEEP (*(.dtors))
		} > FLASH

	.jcr : {
		KEEP (*(.jcr))
		} > FLASH

	.data : {
		*(.rel.sdata .rel.sdata.* .rel.gnu.linkonce.s.*)
		*(.rela.sdata .rela.sdata.* .rela.gnu.linkonce.s.*)
		*(.rel.sdata2 .rel.sdata2.* .rel.gnu.linkonce.s2.*)
		*(.rela.sdata2 .rela.sdata2.* .rela.gnu.linkonce.s2.*)
		*(.rel.plt)
		*(.rela.plt)
		*(.plt)
		*(.sdata2 .sdata2.* .gnu.linkonce.s2.*)
		*(.eh_frame_hdr)
		*(.data .data.*)
		SORT(CONSTRUCTORS)
		*(.data1)
		*(.tdata .tdata.* .gnu.linkonce.td.*)
		KEEP (*(.eh_frame))
		*(.gcc_except_table)
		*(.dynamic)
		*(.sdata .sdata.* .gnu.linkonce.s.*)
		_edata = .;
		PROVIDE (edata = .);
		} > DTCMRAM AT> FLASH

	PROVIDE( ___text_data_start = LOADADDR(.data) );
	PROVIDE( ___data_start = ADDR(.data));
	PROVIDE( ___data_end = ADDR(.data) + SIZEOF(.data) );
	PROVIDE( idata_end = ADDR(.jcr) + SIZEOF(.jcr) + SIZEOF(.data) );

	.bss (NOLOAD) : {
		__bss_start__ = .;
		*(.rel.tbss .rel.tbss.* .rel.gnu.linkonce.tb.*)
		*(.rela.tbss .rela.tbss.* .rela.gnu.linkonce.tb.*)
		*(.rel.sbss .rel.sbss.* .rel.gnu.linkonce.sb.*)
		*(.rela.sbss .rela.sbss.* .rela.gnu.linkonce.sb.*)
		*(.rel.sbss2 .rel.sbss2.* .rel.gnu.linkonce.sb2.*)
		*(.rela.sbss2 .rela.sbss2.* .rela.gnu.linkonce.sb2.*)
		*(.rel.bss .rel.bss.* .rel.gnu.linkonce.b.*)
		*(.rela.bss .rela.bss.* .rela.gnu.linkonce.b.*)
		*(.sbss2 .sbss2.* .gnu.linkonce.sb2.*)
		*(.tbss .tbss.* .gnu.linkonce.tb.*) *(.tcommon)
		PROVIDE (__sbss_start = .);
		PROVIDE (___sbss_start = .);
		*(.dynsbss)
		*(.sbss .sbss.* .gnu.linkonce.sb.*)
		*(.scommon)
		PROVIDE (__sbss_end = .);
		PROVIDE (___sbss_end = .);
		*(.dynbss)
		*(.bss .bss.* .gnu.linkonce.b.*)
		*(COMMON)
  		_bss_end__ = . ; __bss_end__ = . ;
		/* Align here to ensure that the .bss section occupies space up to
			_end.  Align after .bss to ensure correct alignment even if the
			.bss section disappears because there are no input sections.  */
		. = ALIGN(32 / 8);
		. = ALIGN(32 / 8);
		_end = .;
		__end__ = .;
		/*	Normally, the heap (end) starts after the .bss section
			However, since DTCRAM is neither large nor contiguous
			with other SRAM, the heap (end) has been moved start
			in AXISRAM1 after the main frame-buffer.
		 */
		/* PROVIDE (end = .); */
		} > DTCMRAM
	/* The .heap symbol is not used, but this is a
		convenient method to set the start of the
		heap in AXISRAM1 after the 272 x 480 x 2 byte
		frame-buffer. Hopefully, this will be enough
		heap (about 506 x 1024KB with 8 bytes of
		overhead in each allocation block).
		The AXISRAM1 is contiguous with AXISRAM2
		for 513KB of heap space.
	 */
	.heap (NOLOAD) : {
		PROVIDE (end = . + (272*480*2) );	/* heap start */
		} > AXISRAM1
	/* Stabs debugging sections.  */
	.stab          0 : { *(.stab) }
	.stabstr       0 : { *(.stabstr) }
	.stab.excl     0 : { *(.stab.excl) }
	.stab.exclstr  0 : { *(.stab.exclstr) }
	.stab.index    0 : { *(.stab.index) }
	.stab.indexstr 0 : { *(.stab.indexstr) }
	.comment       0 : { *(.comment) }
	/* DWARF debug sections.
		Symbols in the DWARF debugging sections are relative to the beginning
		of the section so we begin them at 0.  */
	/* DWARF 1 */
	.debug          0 : { *(.debug) }
	.line           0 : { *(.line) }
	/* GNU DWARF 1 extensions */
	.debug_srcinfo  0 : { *(.debug_srcinfo) }
	.debug_sfnames  0 : { *(.debug_sfnames) }
	/* DWARF 1.1 and DWARF 2 */
	.debug_aranges  0 : { *(.debug_aranges) }
	.debug_pubnames 0 : { *(.debug_pubnames) }
	/* DWARF 2 */
	.debug_info     0 : { *(.debug_info .gnu.linkonce.wi.*) }
	.debug_abbrev   0 : { *(.debug_abbrev) }
	.debug_line     0 : { *(.debug_line) }
	.debug_frame    0 : { *(.debug_frame) }
	.debug_str      0 : { *(.debug_str) }
	.debug_loc      0 : { *(.debug_loc) }
	.debug_macinfo  0 : { *(.debug_macinfo) }
	/* SGI/MIPS DWARF 2 extensions */
	.debug_weaknames 0 : { *(.debug_weaknames) }
	.debug_funcnames 0 : { *(.debug_funcnames) }
	.debug_typenames 0 : { *(.debug_typenames) }
	.debug_varnames  0 : { *(.debug_varnames) }
/* Not used anywhere
	.stack (NOLOAD) : {
		*(.stack)
		}  > DTCMRAM
*/
}
