Agenda :

1. Course Index Overview on Covered and Not Covered Topics

https://docs.aws.amazon.com/IAM/latest/UserGuide/id_credentials_mfa.html?icmpid=docs_iam_console


IAM :
-Users
-Groups 
-Policies
- Roles are pending 

Custom Policies :

{
    "Version": "2012-10-17",
    "Statement": [
        {
            "Effect": "Allow",
            "Action": [
                "ec2:DescribeAccountAttributes",
                "ec2:DescribeAvailabilityZones",
                "ec2:DescribeInternetGateways",
                "ec2:DescribeSecurityGroups",
                "ec2:DescribeSubnets",
                "ec2:DescribeVpcAttribute",
                "ec2:DescribeVpcs",
                "ec2:DescribeInstances",
                "ec2:DescribeImages",
                "ec2:DescribeKeyPairs",
                "rds:Describe*",
                "iam:ListRolePolicies",
                "iam:ListRoles",
                "iam:GetRole",
                "iam:ListInstanceProfiles",
                "lambda:GetAccountSettings"
            ],
            "Resource": "*"
        },
        {
            "Effect": "Allow",
            "Action": [
                "ec2:RunInstances",
                "rds:CreateDBInstance",
                "rds:CreateDBCluster",
                "lambda:CreateFunction",
                "lambda:InvokeFunction"
            ],
            "Resource": "*",
            "Condition": {
                "StringEquals": {
                    "aws:RequestedRegion": "ap-south-1"
                }
            }
        },
        {
            "Effect": "Allow",
            "Action": [
                "iam:PassRole"
            ],
            "Resource": "arn:aws:iam::7383844747464:role/onlytomumbairegionaccess"
        }
    ]
}
