<svg width="120" height="120" viewBox="0 0 120 120" fill="none" xmlns="http://www.w3.org/2000/svg">
<path d="M72.0004 60.0002C72.0004 53.3828 66.6177 48 60.0002 48C53.3828 48 48 53.3828 48 60.0002C48 66.6177 53.3828 72.0004 60.0002 72.0004C66.6177 72.0004 72.0004 66.6177 72.0004 60.0002ZM60.0002 70.8576C54.0134 70.8576 49.1429 65.9871 49.1429 60.0002C49.1429 54.0134 54.0134 49.1429 60.0002 49.1429C65.9871 49.1429 70.8576 54.0134 70.8576 60.0002C70.8576 65.9871 65.9871 70.8576 60.0002 70.8576Z" fill="#181818"/>
<path d="M56.1689 17.5249C57.0709 18.0714 58.2162 18.0071 59.0513 17.363C59.6103 16.9319 60.3897 16.9319 60.9487 17.363C61.7839 18.0071 62.9291 18.0714 63.8311 17.5249C64.4349 17.1591 65.2093 17.2463 65.7165 17.7373C66.4744 18.4708 67.6052 18.663 68.5628 18.2209C69.2036 17.925 69.9635 18.0984 70.4125 18.6431C71.0834 19.4569 72.1856 19.7744 73.1867 19.4423C73.8567 19.2201 74.5923 19.4775 74.9775 20.069C75.5531 20.9527 76.6129 21.3917 77.6448 21.1738C78.3355 21.0279 79.0376 21.3661 79.3542 21.997C79.8273 22.9397 80.8312 23.4945 81.881 23.3935C82.5837 23.3259 83.2436 23.7405 83.4875 24.4029C83.852 25.3926 84.7875 26.0564 85.8421 26.0736C86.5479 26.0851 87.1572 26.571 87.3254 27.2565C87.5768 28.2808 88.4321 29.0451 89.4781 29.1803C90.1782 29.2707 90.7293 29.8218 90.8197 30.5219C90.9549 31.5679 91.7192 32.4232 92.7435 32.6746C93.429 32.8428 93.9149 33.4522 93.9264 34.158C93.9436 35.2125 94.6074 36.148 95.5971 36.5125C96.2595 36.7565 96.6741 37.4163 96.6065 38.119C96.5055 39.1688 97.0604 40.1728 98.003 40.6458C98.6339 40.9624 98.9721 41.6645 98.8262 42.3552C98.6083 43.3871 99.0473 44.4469 99.931 45.0225C100.523 45.4077 100.78 46.1433 100.558 46.8133C100.226 47.8144 100.543 48.9166 101.357 49.5875C101.902 50.0365 102.075 50.7964 101.779 51.4373C101.337 52.3948 101.529 53.5257 102.263 54.2835C102.754 54.7907 102.841 55.5651 102.475 56.1689C101.929 57.0709 101.993 58.2162 102.637 59.0513C103.068 59.6103 103.068 60.3897 102.637 60.9487C101.993 61.7839 101.929 62.9291 102.475 63.8311C102.841 64.4349 102.754 65.2093 102.263 65.7165C101.529 66.4744 101.337 67.6052 101.779 68.5628C102.075 69.2036 101.902 69.9635 101.357 70.4125C100.543 71.0834 100.226 72.1856 100.558 73.1867C100.78 73.8567 100.523 74.5923 99.931 74.9775C99.0473 75.5531 98.6083 76.6129 98.8262 77.6448C98.9721 78.3355 98.6339 79.0376 98.003 79.3542C97.0604 79.8273 96.5055 80.8312 96.6065 81.881C96.6741 82.5837 96.2595 83.2436 95.5971 83.4875C94.6074 83.852 93.9436 84.7875 93.9264 85.8421C93.9149 86.5479 93.429 87.1572 92.7435 87.3254C91.7192 87.5768 90.9549 88.4321 90.8197 89.4781C90.7293 90.1782 90.1782 90.7293 89.4781 90.8197C88.4321 90.9549 87.5768 91.7192 87.3254 92.7435C87.1572 93.429 86.5479 93.9149 85.8421 93.9264C84.7875 93.9436 83.852 94.6074 83.4875 95.5971C83.2436 96.2595 82.5837 96.6741 81.881 96.6065C80.8312 96.5055 79.8273 97.0604 79.3542 98.003C79.0376 98.6339 78.3355 98.9721 77.6448 98.8262C76.6129 98.6083 75.5531 99.0473 74.9775 99.931C74.5923 100.523 73.8567 100.78 73.1867 100.558C72.1856 100.226 71.0834 100.543 70.4125 101.357C69.9635 101.902 69.2036 102.075 68.5628 101.779C67.6052 101.337 66.4744 101.529 65.7165 102.263C65.2093 102.754 64.4349 102.841 63.8311 102.475C62.9291 101.929 61.7839 101.993 60.9487 102.637C60.3897 103.068 59.6103 103.068 59.0513 102.637C58.2162 101.993 57.0709 101.929 56.1689 102.475C55.5651 102.841 54.7907 102.754 54.2835 102.263C53.5257 101.529 52.3948 101.337 51.4373 101.779C50.7964 102.075 50.0365 101.902 49.5875 101.357C48.9166 100.543 47.8144 100.226 46.8133 100.558C46.1433 100.78 45.4077 100.523 45.0225 99.931C44.4469 99.0473 43.3871 98.6083 42.3552 98.8262C41.6645 98.9721 40.9624 98.6339 40.6458 98.003C40.1728 97.0604 39.1688 96.5055 38.119 96.6065C37.4163 96.6741 36.7565 96.2595 36.5125 95.5971C36.148 94.6074 35.2125 93.9436 34.158 93.9264C33.4522 93.9149 32.8428 93.429 32.6746 92.7435C32.4232 91.7192 31.5679 90.9549 30.5219 90.8197C29.8218 90.7293 29.2707 90.1782 29.1803 89.4781C29.0451 88.4321 28.2808 87.5768 27.2565 87.3254C26.571 87.1572 26.0851 86.5479 26.0736 85.8421C26.0564 84.7875 25.3926 83.852 24.4029 83.4875C23.7405 83.2436 23.3259 82.5837 23.3935 81.881C23.4945 80.8312 22.9397 79.8273 21.997 79.3542C21.3661 79.0376 21.0279 78.3355 21.1738 77.6448C21.3917 76.6129 20.9527 75.5531 20.069 74.9775C19.4775 74.5923 19.2201 73.8567 19.4423 73.1867C19.7744 72.1856 19.4569 71.0834 18.6431 70.4125C18.0984 69.9635 17.925 69.2036 18.2209 68.5628C18.663 67.6052 18.4708 66.4744 17.7373 65.7165C17.2463 65.2093 17.1591 64.4349 17.5249 63.8311C18.0714 62.9291 18.0071 61.7839 17.363 60.9487C16.9319 60.3897 16.9319 59.6103 17.363 59.0513C18.0071 58.2162 18.0714 57.0709 17.5249 56.1689C17.1591 55.5651 17.2463 54.7907 17.7373 54.2835C18.4708 53.5257 18.663 52.3948 18.2209 51.4373C17.925 50.7964 18.0984 50.0365 18.6431 49.5875C19.4569 48.9166 19.7744 47.8144 19.4423 46.8133C19.2201 46.1433 19.4775 45.4077 20.069 45.0225C20.9527 44.4469 21.3917 43.3871 21.1738 42.3552C21.0279 41.6645 21.3661 40.9624 21.997 40.6458C22.9397 40.1728 23.4945 39.1688 23.3935 38.119C23.3259 37.4163 23.7405 36.7565 24.4029 36.5125C25.3926 36.148 26.0564 35.2125 26.0736 34.158C26.0851 33.4522 26.571 32.8428 27.2565 32.6746C28.2808 32.4232 29.0451 31.5679 29.1803 30.5219C29.2707 29.8218 29.8218 29.2707 30.5219 29.1803C31.5679 29.0451 32.4232 28.2808 32.6746 27.2565C32.8428 26.571 33.4522 26.0851 34.158 26.0736C35.2125 26.0564 36.148 25.3926 36.5125 24.4029C36.7565 23.7405 37.4163 23.3259 38.119 23.3935C39.1688 23.4945 40.1728 22.9397 40.6458 21.997C40.9624 21.3661 41.6645 21.0279 42.3552 21.1738C43.3871 21.3917 44.4469 20.9527 45.0225 20.069C45.4077 19.4775 46.1433 19.2201 46.8133 19.4423C47.8144 19.7744 48.9166 19.4569 49.5875 18.6431C50.0365 18.0984 50.7964 17.925 51.4373 18.2209C52.3948 18.663 53.5257 18.4708 54.2835 17.7373C54.7907 17.2463 55.5651 17.1591 56.1689 17.5249Z" stroke="#181818"/>
<path d="M59.9985 50.8594C54.957 50.8594 50.8555 54.9609 50.8555 60.0024C50.8555 65.0439 54.957 69.1454 59.9985 69.1454C65.04 69.1454 69.1415 65.0439 69.1415 60.0024C69.1415 54.9609 65.04 50.8594 59.9985 50.8594ZM59.9985 68.0025C55.5872 68.0025 51.9983 64.4136 51.9983 60.0024C51.9983 55.5912 55.5872 52.0023 59.9985 52.0023C64.4097 52.0023 67.9986 55.5912 67.9986 60.0024C67.9986 64.4136 64.4097 68.0025 59.9985 68.0025Z" fill="#181818"/>
<path d="M60.0006 58.2824C61.2613 58.2824 62.2864 57.2574 62.2864 55.9967C62.2864 54.736 61.2613 53.7109 60.0006 53.7109C58.7399 53.7109 57.7148 54.736 57.7148 55.9967C57.7148 57.2574 58.7399 58.2824 60.0006 58.2824ZM60.0006 54.8538C60.6307 54.8538 61.1435 55.3666 61.1435 55.9967C61.1435 56.6268 60.6307 57.1396 60.0006 57.1396C59.3705 57.1396 58.8577 56.6268 58.8577 55.9967C58.8577 55.3666 59.3705 54.8538 60.0006 54.8538Z" fill="#181818"/>
<path d="M60.0006 61.7188C58.7399 61.7188 57.7148 62.7438 57.7148 64.0045C57.7148 65.2652 58.7399 66.2903 60.0006 66.2903C61.2613 66.2903 62.2864 65.2652 62.2864 64.0045C62.2864 62.7438 61.2613 61.7188 60.0006 61.7188ZM60.0006 65.1474C59.3705 65.1474 58.8577 64.6346 58.8577 64.0045C58.8577 63.3744 59.3705 62.8616 60.0006 62.8616C60.6307 62.8616 61.1435 63.3744 61.1435 64.0045C61.1435 64.6346 60.6307 65.1474 60.0006 65.1474Z" fill="#181818"/>
<path d="M55.4264 57.7188C54.1656 57.7188 53.1406 58.7438 53.1406 60.0045C53.1406 61.2652 54.1656 62.2903 55.4264 62.2903C56.6871 62.2903 57.7121 61.2652 57.7121 60.0045C57.7121 58.7438 56.6871 57.7188 55.4264 57.7188ZM55.4264 61.1474C54.7963 61.1474 54.2835 60.6346 54.2835 60.0045C54.2835 59.3744 54.7963 58.8616 55.4264 58.8616C56.0565 58.8616 56.5693 59.3744 56.5693 60.0045C56.5693 60.6346 56.0565 61.1474 55.4264 61.1474Z" fill="#181818"/>
<path d="M64.5709 57.7188C63.3102 57.7188 62.2852 58.7438 62.2852 60.0045C62.2852 61.2652 63.3102 62.2903 64.5709 62.2903C65.8316 62.2903 66.8567 61.2652 66.8567 60.0045C66.8567 58.7438 65.8316 57.7188 64.5709 57.7188ZM64.5709 61.1474C63.9408 61.1474 63.428 60.6346 63.428 60.0045C63.428 59.3744 63.9408 58.8616 64.5709 58.8616C65.201 58.8616 65.7138 59.3744 65.7138 60.0045C65.7138 60.6346 65.201 61.1474 64.5709 61.1474Z" fill="#181818"/>
<path d="M60.0018 29.7188C43.3014 29.7188 29.7148 43.3053 29.7148 60.0057C29.7148 76.706 43.3014 90.2926 60.0018 90.2926C76.7021 90.2926 90.2887 76.706 90.2887 60.0057C90.2887 43.3053 76.7021 29.7188 60.0018 29.7188ZM60.0018 89.1484C43.9309 89.1484 30.859 76.0752 30.859 60.0057C30.859 43.9361 43.9322 30.8629 60.0018 30.8629C76.0713 30.8629 89.1445 43.9361 89.1445 60.0057C89.1445 76.0752 76.0713 89.1484 60.0018 89.1484Z" fill="#181818"/>
<path d="M60.0013 39.0859C48.4664 39.0859 39.082 48.4709 39.082 60.0052C39.082 71.5395 48.467 80.9244 60.0013 80.9244C71.5356 80.9244 80.9205 71.5395 80.9205 60.0052C80.9205 48.4709 71.5356 39.0859 60.0013 39.0859ZM68.4835 77.8667C67.1799 78.4887 65.7978 78.9673 64.3569 79.2922C62.4124 75.1361 61.2344 73.1483 59.9685 73.1483C58.768 73.1483 57.5057 74.8115 55.3684 79.229C54.0071 78.901 52.6989 78.4357 51.4633 77.8423C52.5102 73.1809 52.7674 71.087 51.7525 70.3916C50.7683 69.7156 48.8158 70.5677 44.8917 72.7468C44.0259 71.7217 43.2591 70.61 42.6141 69.4233C46.0243 66.3702 47.1765 64.8328 46.8275 63.8202C46.5836 63.1105 45.5927 62.2916 40.2927 61.5681C40.2519 61.0523 40.2253 60.5329 40.2253 60.0063C40.2253 59.2829 40.2672 58.5696 40.3432 57.8665C45.6009 57.1445 46.5846 56.3288 46.8279 55.6215C47.229 54.4567 45.7907 52.8837 42.8029 50.2633C43.4121 49.1923 44.1168 48.1836 44.908 47.249C48.606 49.2047 50.4407 49.8479 51.4525 49.8479C51.826 49.8479 52.0887 49.7612 52.2923 49.6209C53.2974 48.9311 52.8382 47.0316 51.7892 43.1432C51.702 42.8192 51.6122 42.4809 51.5224 42.1442C52.8071 41.5314 54.1694 41.0579 55.5878 40.7334C57.528 44.8783 58.7046 46.8621 59.9684 46.8621C61.2338 46.8621 62.4118 44.8743 64.3563 40.7176C65.7915 41.0416 67.1696 41.5186 68.4691 42.137C67.5609 46.0421 67.1359 48.3065 68.217 49.0473C68.4247 49.1896 68.7114 49.3034 69.1778 49.3034C70.1212 49.3034 71.8043 48.834 75.0528 47.1973C75.9207 48.2156 76.6896 49.3213 77.3391 50.5019C74.3762 52.9596 72.7379 54.4434 73.1431 55.6199C73.387 56.3286 74.3748 57.147 79.661 57.8695C79.7371 58.5711 79.7784 59.2833 79.7784 60.0057C79.7784 60.7282 79.7371 61.4395 79.661 62.1419C74.3752 62.8649 73.3875 63.6828 73.1431 64.3915C72.7375 65.5681 74.3758 67.0517 77.3391 69.5095C76.7008 70.6687 75.9487 71.7559 75.1002 72.7591C71.1609 70.5702 69.2006 69.7161 68.218 70.3922C67.1981 71.0902 67.4639 73.282 68.4833 77.8669L68.4835 77.8667ZM42.0837 68.3629C41.2638 66.6114 40.6938 64.7215 40.4183 62.7384C45.25 63.4221 45.7118 64.1139 45.7455 64.1854C45.7832 64.419 45.4817 65.2915 42.0837 68.3629V68.3629ZM40.5082 56.6887C40.8312 54.7867 41.4235 52.9759 42.2501 51.2988C45.3058 54.0055 45.8511 54.9448 45.7481 55.2458C45.7119 55.3244 45.2567 56.0096 40.5082 56.6887V56.6887ZM77.8731 51.5437C78.6385 53.1529 79.1889 54.8816 79.4962 56.6923C74.717 56.0116 74.2598 55.3243 74.2261 55.2529C74.1491 54.6973 76.2742 52.8732 77.8731 51.5437ZM74.2231 64.7658C74.2593 64.6862 74.717 63.999 79.4956 63.3178C79.189 65.1285 78.638 66.8572 77.8726 68.4664C76.2736 67.1373 74.1491 65.3137 74.2231 64.7658V64.7658ZM74.2563 46.3178C69.7638 48.5479 68.9439 48.1606 68.8644 48.1051C68.3909 47.7801 69.0368 44.7617 69.518 42.675C71.2786 43.6459 72.8741 44.8786 74.2563 46.3179L74.2563 46.3178ZM63.2025 40.4912C62.3433 42.3193 60.6769 45.7193 59.9693 45.7193C59.2631 45.7193 57.5993 42.3274 56.7411 40.5019C57.8029 40.3249 58.8906 40.2285 60.0019 40.2285C61.0917 40.2285 62.1601 40.3208 63.2025 40.4912V40.4912ZM50.4823 42.6769C50.5502 42.931 50.6196 43.1917 50.6864 43.4387C51.2339 45.4683 51.9834 48.2479 51.6492 48.6755C51.4655 48.7771 50.4951 48.8842 45.6976 46.3708C47.0905 44.9095 48.7017 43.6585 50.4824 42.6769H50.4823ZM45.6751 73.6182C47.4317 72.6452 50.5476 70.9819 51.1033 71.3319C51.5875 71.7876 50.8604 75.3014 50.416 77.2968C48.6527 76.3147 47.0567 75.0708 45.6751 73.6182H45.6751ZM56.5238 79.4699C58.7146 74.9923 59.6213 74.2917 59.9693 74.2917C60.6769 74.2917 62.3428 77.6917 63.2025 79.5198C62.1601 79.6902 61.0918 79.7825 60.0019 79.7825C58.8146 79.7825 57.6539 79.6713 56.5238 79.4698V79.4699ZM69.5342 77.327C69.0918 75.325 68.3688 71.7928 68.8643 71.3346C69.4214 70.984 72.5536 72.654 74.3169 73.63C72.9251 75.0922 71.3143 76.3438 69.5342 77.327H69.5342Z" fill="#181818"/>
<path d="M60.0009 35.4219C46.4523 35.4219 35.4297 46.4451 35.4297 59.9931C35.4297 73.5411 46.4529 84.5643 60.0009 84.5643C73.5489 84.5643 84.5721 73.5411 84.5721 59.9931C84.5721 46.4451 73.5489 35.4219 60.0009 35.4219ZM60.0009 83.4227C47.0823 83.4227 36.5713 72.9123 36.5713 59.9931C36.5713 47.0739 47.0817 36.5634 60.0009 36.5634C72.9201 36.5634 83.4305 47.0739 83.4305 59.9931C83.4305 72.9123 72.9201 83.4227 60.0009 83.4227Z" fill="#181818"/>
</svg>
