<svg width="240" height="180" viewBox="0 0 240 180" fill="none" xmlns="http://www.w3.org/2000/svg">
<path d="M240 158.181H0V158.301H240V158.181Z" fill="#E6E6E6"/>
<path d="M59.9132 165.491H44.0156V165.611H59.9132V165.491Z" fill="#E6E6E6"/>
<path d="M38.9866 165.491H29.7754V165.611H38.9866V165.491Z" fill="#E6E6E6"/>
<path d="M101.065 167.269H91.8535V167.389H101.065V167.269Z" fill="#E6E6E6"/>
<path d="M149.093 169.965H128.361V170.085H149.093V169.965Z" fill="#E6E6E6"/>
<path d="M124.089 169.965H121.051V170.085H124.089V169.965Z" fill="#E6E6E6"/>
<path d="M217.609 167.269H172.643V167.389H217.609V167.269Z" fill="#E6E6E6"/>
<path d="M113.759 136.633H21.0758C20.3498 136.632 19.6539 136.341 19.1409 135.823C18.6279 135.306 18.3398 134.605 18.3398 133.874V2.73459C18.3462 2.00796 18.6371 1.31317 19.1493 0.801158C19.6616 0.289141 20.3539 0.00124477 21.0758 0H113.759C114.486 0 115.183 0.290653 115.697 0.808019C116.211 1.32539 116.5 2.02708 116.5 2.75875V133.874C116.5 134.606 116.211 135.308 115.697 135.825C115.183 136.342 114.486 136.633 113.759 136.633V136.633ZM21.0758 0.0966291C20.3816 0.0979089 19.7162 0.3764 19.2258 0.870976C18.7353 1.36555 18.4598 2.0358 18.4598 2.73459V133.874C18.4598 134.573 18.7353 135.243 19.2258 135.738C19.7162 136.232 20.3816 136.511 21.0758 136.512H113.759C114.454 136.511 115.12 136.233 115.611 135.738C116.102 135.244 116.379 134.574 116.38 133.874V2.73459C116.379 2.03535 116.102 1.36512 115.611 0.870681C115.12 0.376243 114.454 0.0979062 113.759 0.0966291H21.0758Z" fill="#E6E6E6"/>
<path d="M217.587 136.633H124.899C124.172 136.632 123.476 136.341 122.962 135.824C122.449 135.307 122.159 134.606 122.158 133.874V2.73459C122.166 2.00752 122.458 1.31274 122.971 0.800855C123.484 0.288972 124.177 0.00123119 124.899 0H217.587C218.308 0.00251452 218.999 0.290973 219.51 0.802853C220.022 1.31473 220.312 2.00879 220.318 2.73459V133.874C220.318 134.604 220.031 135.304 219.519 135.822C219.007 136.339 218.312 136.63 217.587 136.633V136.633ZM124.899 0.0966291C124.204 0.0979062 123.538 0.376243 123.047 0.870681C122.556 1.36512 122.279 2.03535 122.278 2.73459V133.874C122.279 134.574 122.556 135.244 123.047 135.738C123.538 136.233 124.204 136.511 124.899 136.512H217.587C218.282 136.511 218.948 136.233 219.439 135.738C219.93 135.244 220.207 134.574 220.208 133.874V2.73459C220.207 2.03535 219.93 1.36512 219.439 0.870681C218.948 0.376243 218.282 0.0979062 217.587 0.0966291H124.899Z" fill="#E6E6E6"/>
<path d="M128.352 116.911H117.797V159.056H128.352V116.911Z" fill="#F2F2F2"/>
<path d="M126.345 159.056H128.351V153.316H124.242L126.345 159.056Z" fill="#FAFAFA"/>
<path d="M82.0982 116.911H71.543V159.056H82.0982V116.911Z" fill="#F2F2F2"/>
<path d="M128.352 116.911H80.3516V155.534H128.352V116.911Z" fill="#FAFAFA"/>
<path d="M126.609 118.81V129.028H82.0791V118.81H126.594M126.781 118.621H81.9062V129.212H126.796V118.621H126.781Z" fill="#F2F2F2"/>
<path d="M82.3532 159.056H80.3516V153.316H84.4556L82.3532 159.056Z" fill="#FAFAFA"/>
<path d="M103.291 123.917C103.291 124.128 103.353 124.334 103.47 124.51C103.586 124.685 103.752 124.822 103.946 124.903C104.14 124.984 104.353 125.005 104.559 124.964C104.765 124.923 104.954 124.821 105.102 124.672C105.25 124.522 105.351 124.332 105.392 124.125C105.433 123.918 105.412 123.703 105.332 123.508C105.252 123.313 105.116 123.146 104.941 123.029C104.767 122.912 104.562 122.849 104.352 122.849C104.07 122.849 103.801 122.961 103.602 123.162C103.403 123.362 103.291 123.633 103.291 123.917V123.917Z" fill="#E6E6E6"/>
<path d="M126.609 131.111V141.329H82.0791V131.111H126.594M126.781 130.927H81.9062V141.518H126.796V130.932L126.781 130.927Z" fill="#F2F2F2"/>
<path d="M103.291 136.247C103.291 136.458 103.353 136.664 103.47 136.84C103.586 137.015 103.752 137.152 103.946 137.233C104.14 137.314 104.353 137.335 104.559 137.294C104.765 137.253 104.954 137.151 105.102 137.002C105.25 136.852 105.351 136.662 105.392 136.455C105.433 136.248 105.412 136.033 105.332 135.838C105.252 135.643 105.116 135.476 104.941 135.359C104.767 135.241 104.562 135.179 104.352 135.179C104.07 135.179 103.801 135.291 103.602 135.491C103.403 135.692 103.291 135.963 103.291 136.247Z" fill="#E6E6E6"/>
<path d="M126.609 143.416V153.64H82.0791V143.416H126.594M126.781 143.228H81.9062V153.823H126.796V143.228H126.781Z" fill="#F2F2F2"/>
<path d="M103.291 148.528C103.292 148.739 103.355 148.945 103.472 149.12C103.589 149.295 103.755 149.431 103.949 149.511C104.143 149.591 104.356 149.612 104.562 149.57C104.767 149.528 104.956 149.426 105.104 149.277C105.251 149.127 105.352 148.937 105.393 148.73C105.433 148.523 105.412 148.308 105.331 148.114C105.251 147.919 105.115 147.752 104.941 147.635C104.766 147.518 104.561 147.456 104.352 147.456C104.212 147.456 104.074 147.483 103.945 147.537C103.816 147.591 103.699 147.67 103.6 147.77C103.501 147.87 103.423 147.988 103.37 148.118C103.317 148.248 103.29 148.388 103.291 148.528V148.528Z" fill="#E6E6E6"/>
<path d="M75.6548 92.4351H65.0996V159.061H75.6548V92.4351Z" fill="#F2F2F2"/>
<path d="M73.6464 159.056H75.6528V153.316H71.5488L73.6464 159.056Z" fill="#FAFAFA"/>
<path d="M36.2075 92.4351H25.6523V159.061H36.2075V92.4351Z" fill="#F2F2F2"/>
<path d="M75.6515 92.4351H34.4531V155.538H75.6515V92.4351Z" fill="#FAFAFA"/>
<path d="M73.8768 94.213V108.5H36.2304V94.213H73.8768M74.0976 93.9956H36V108.707H74.088V94.0005L74.0976 93.9956Z" fill="#F2F2F2"/>
<path d="M73.8773 110.244V148.137H55.9445V110.244H73.8773ZM74.0981 110.022H55.7285V148.359H74.0981V110.022Z" fill="#F2F2F2"/>
<path d="M54.1632 110.244V148.137H36.2304V110.244H54.1632ZM54.3792 110.022H36V148.359H54.3696V110.022H54.3792Z" fill="#F2F2F2"/>
<path d="M36.4595 159.056H34.4531V153.316H38.5619L36.4595 159.056Z" fill="#FAFAFA"/>
<path d="M53.9902 101.364C53.9893 101.576 54.051 101.784 54.1675 101.961C54.284 102.138 54.4501 102.276 54.6447 102.358C54.8393 102.44 55.0538 102.462 55.2608 102.421C55.4678 102.38 55.6581 102.278 55.8076 102.129C55.9571 101.979 56.0591 101.788 56.1006 101.579C56.1421 101.371 56.1213 101.155 56.0408 100.959C55.9603 100.763 55.8237 100.595 55.6484 100.477C55.473 100.359 55.2668 100.296 55.0558 100.296C54.7741 100.296 54.5037 100.408 54.304 100.608C54.1043 100.808 53.9915 101.08 53.9902 101.364Z" fill="#E6E6E6"/>
<path d="M57.791 128.289C57.791 128.501 57.8536 128.709 57.9709 128.886C58.0883 129.062 58.255 129.199 58.45 129.281C58.6449 129.362 58.8595 129.383 59.0663 129.341C59.2731 129.299 59.463 129.196 59.6118 129.046C59.7607 128.895 59.8618 128.704 59.9023 128.495C59.9429 128.287 59.9211 128.071 59.8397 127.875C59.7583 127.679 59.621 127.512 59.4451 127.395C59.2693 127.278 59.0628 127.216 58.8518 127.217C58.7121 127.217 58.5738 127.244 58.4448 127.298C58.3157 127.352 58.1986 127.431 58.1 127.531C58.0015 127.631 57.9234 127.749 57.8704 127.879C57.8174 128.009 57.7904 128.149 57.791 128.289V128.289Z" fill="#E6E6E6"/>
<path d="M50.1953 128.289C50.1963 128.5 50.2593 128.706 50.3764 128.881C50.4936 129.056 50.6596 129.192 50.8535 129.272C51.0474 129.352 51.2605 129.373 51.466 129.331C51.6715 129.289 51.86 129.187 52.0079 129.038C52.1558 128.888 52.2563 128.698 52.2969 128.491C52.3374 128.284 52.3161 128.069 52.2357 127.875C52.1553 127.68 52.0193 127.513 51.845 127.396C51.6706 127.279 51.4657 127.217 51.2561 127.217C51.1164 127.217 50.9781 127.244 50.8491 127.298C50.72 127.352 50.6029 127.431 50.5043 127.531C50.4058 127.631 50.3277 127.749 50.2747 127.879C50.2217 128.009 50.1947 128.149 50.1953 128.289V128.289Z" fill="#E6E6E6"/>
<path d="M48.9925 73.8581H44.5429C44.953 76.0307 45.2112 78.2296 45.3157 80.4386C45.3157 82.8543 41.9269 92.435 46.7557 92.435C51.5845 92.435 48.1957 82.8784 48.1957 80.4386C48.3082 78.229 48.5744 76.0302 48.9925 73.8581V73.8581Z" fill="#F2F2F2"/>
<path d="M32.0625 83.6564V86.5552C32.0676 88.1093 32.6831 89.5982 33.7748 90.6971C34.8666 91.7959 36.3458 92.4155 37.8897 92.4206H40.7697C42.3136 92.4155 43.7928 91.7959 44.8846 90.6971C45.9763 89.5982 46.5918 88.1093 46.5969 86.5552V83.6564H32.0625Z" fill="#F5F5F5"/>
<path d="M93.9219 110.766C93.9219 114.148 97.6803 116.911 102.274 116.911H106.421C111.015 116.911 114.773 114.148 114.773 110.766H93.9219Z" fill="#F2F2F2"/>
<path d="M203.812 105.809C201.297 107.876 197.822 111.659 194.644 116.984C192.523 120.53 191.246 124.231 190.684 129.149C190.684 123.593 190.718 117.626 190.737 111.993C191.375 110.543 192.835 107.2 193.881 104.562C197.371 95.7543 198.681 93.585 201.815 85.99C206.006 75.8439 210.297 63.833 209.068 64.7945C206.563 66.7512 196.963 84.8449 195.926 87.4346C193.1 94.3456 191.353 101.655 190.747 109.104C190.747 103.789 190.785 98.9575 190.804 95.2083C190.871 82.98 191.078 79.0327 191.179 77.8152C191.567 77.1968 192.023 76.4769 192.292 76.0904C194.548 72.805 195.417 70.0124 197.539 65.1133C200.553 58.1802 203.145 45.8649 202.387 46.4833C199.228 49.073 196.742 54.6291 193.468 61.7168C190.195 68.8046 191.131 72.8774 190.483 78.9264C190.348 80.1149 190.243 84.5985 190.166 90.8069C189.321 84.1878 187.727 79.8299 184.823 75.8681C181.252 70.9932 177.796 67.703 175.262 65.983C172.727 64.263 179.639 76.2353 182.942 81.4436C185.884 86.1011 188.596 90.203 190.142 94.2469C190.06 102.668 190.022 113.326 190.022 123.236C189.263 118.723 188.025 113.858 186.374 110.094C184.387 105.572 181.334 98.6338 178.9 96.2809C178.319 95.7157 181.444 109.21 183.451 112.795C185.457 116.38 186.931 119.767 188.193 121.801C188.486 122.284 189.465 124.105 190.022 125.158C190.022 137.271 190.089 147.958 190.195 151.596H190.713C190.679 150.659 190.67 144.494 190.684 136.338C191.937 131.913 194.798 126.859 197.159 122.25C199.732 117.259 206.327 103.755 203.812 105.809Z" fill="#F2F2F2"/>
<path d="M197.97 159.056H182.927L181.789 144.213H199.107L197.97 159.056Z" fill="#F2F2F2"/>
<path d="M200.228 145.943H180.668L180.111 140.933H200.79L200.228 145.943Z" fill="#F5F5F5"/>
<path d="M59.6442 9.90441H32.7402V39.6419H59.6442V9.90441Z" fill="#F2F2F2"/>
<path d="M62.5576 9.90441H34.7656V39.6419H62.5576V9.90441Z" fill="#F5F5F5"/>
<path d="M60.2305 37.2987V12.2477L37.0945 12.2477V37.2987H60.2305Z" fill="white"/>
<path d="M54.6191 31.2207V18.3159H42.7007V31.2207H54.6191Z" fill="#F5F5F5"/>
<path d="M196.824 13.3685H171.83V40.9946H196.824V13.3685Z" fill="#F2F2F2"/>
<path d="M199.531 13.3685H173.717V40.9946H199.531V13.3685Z" fill="#F5F5F5"/>
<path d="M197.371 38.8158V15.5476L175.881 15.5476V38.8158H197.371Z" fill="white"/>
<path d="M186.626 33.9312C190.329 33.9312 193.331 30.9093 193.331 27.1817C193.331 23.454 190.329 20.4321 186.626 20.4321C182.922 20.4321 179.92 23.454 179.92 27.1817C179.92 30.9093 182.922 33.9312 186.626 33.9312Z" fill="#F5F5F5"/>
<path d="M87.5932 27.6358H67.6348V49.6961H87.5932V27.6358Z" fill="#F2F2F2"/>
<path d="M89.7547 27.6358H69.1387V49.6961H89.7547V27.6358Z" fill="#F5F5F5"/>
<path d="M88.0293 47.9568V29.3751H70.8693V47.9568H88.0293Z" fill="white"/>
<path d="M79.4483 33.9651L74.7539 42.1496H84.1427L79.4483 33.9651Z" fill="#F5F5F5"/>
<path d="M119.999 180C171.398 180 213.066 177.551 213.066 174.531C213.066 171.51 171.398 169.062 119.999 169.062C68.5992 169.062 26.9316 171.51 26.9316 174.531C26.9316 177.551 68.5992 180 119.999 180Z" fill="#F5F5F5"/>
<path d="M167.623 52.761L163.367 50.8329C163.367 50.8329 157.751 62.3391 156.142 62.9223C153.954 63.7129 149.423 65.911 146.737 66.2966C146.372 66.7786 145.776 68.2778 145.832 68.8225C149.44 70.177 157.369 68.379 159.068 66.9618C162.933 63.7466 167.623 52.761 167.623 52.761Z" fill="#E58A7B"/>
<path d="M168.93 50.1428C169.723 53.4351 165.424 60.0582 165.424 60.0582L159.791 56.5105C159.791 56.5105 160.846 53.787 162.134 51.0153C164.197 46.5371 168.024 46.3877 168.93 50.1428Z" fill="#BD923C"/>
<path opacity="0.2" d="M168.93 50.1428C169.723 53.4351 165.424 60.0582 165.424 60.0582L159.791 56.5105C159.791 56.5105 160.846 53.787 162.134 51.0153C164.197 46.5371 168.024 46.3877 168.93 50.1428Z" fill="black"/>
<path opacity="0.2" d="M162.027 57.9312L164.246 59.3291L164.636 51.6792C163.345 52.7927 162.435 56.1476 162.027 57.9312Z" fill="black"/>
<path d="M165.22 47.6682C165.22 47.6682 160.835 58.6297 163.393 79.0391H180.67C180.945 76.0601 180.035 61.5219 183.326 47.485C181.431 47.0688 179.513 46.7935 177.585 46.6607C175.14 46.5015 172.689 46.5015 170.244 46.6607C168.55 46.8541 166.87 47.1909 165.22 47.6682V47.6682Z" fill="#BD923C"/>
<path opacity="0.2" d="M165.22 47.6682C165.22 47.6682 160.835 58.6297 163.393 79.0391H180.67C180.945 76.0601 180.035 61.5219 183.326 47.485C181.431 47.0688 179.513 46.7935 177.585 46.6607C175.14 46.5015 172.689 46.5015 170.244 46.6607C168.55 46.8541 166.87 47.1909 165.22 47.6682V47.6682Z" fill="black"/>
<g style="mix-blend-mode:multiply">
<path d="M161.209 175.06C161.183 175.581 167.735 176 175.839 176C183.944 176 190.543 175.581 190.569 175.06C190.594 174.539 184.047 174.125 175.938 174.125C167.829 174.125 161.239 174.544 161.209 175.06Z" fill="#BCBCBC"/>
</g>
<path d="M172.758 161.38L169.693 162.713L172.333 170.374L175.397 169.041L172.758 161.38Z" fill="#E58A7B"/>
<path d="M186.421 171.35H183.19L182.006 162.949H185.237L186.421 171.35Z" fill="#E58A7B"/>
<path d="M182.959 170.933H186.588C186.651 170.933 186.712 170.959 186.76 171.005C186.808 171.051 186.84 171.114 186.85 171.184L187.318 174.409C187.328 174.49 187.322 174.572 187.301 174.65C187.28 174.728 187.244 174.8 187.196 174.862C187.148 174.923 187.089 174.972 187.022 175.005C186.956 175.039 186.884 175.055 186.811 175.055C185.546 175.031 184.937 174.944 183.341 174.944C182.358 174.944 180.337 175.059 178.973 175.059C177.608 175.059 177.518 173.555 178.08 173.416C180.603 172.804 181.581 171.97 182.422 171.16C182.571 171.013 182.761 170.933 182.959 170.933V170.933Z" fill="#263238"/>
<path d="M172.223 169.69L175.656 168.562C175.717 168.543 175.782 168.547 175.841 168.575C175.899 168.603 175.948 168.653 175.978 168.716L177.265 171.608C177.295 171.682 177.31 171.762 177.309 171.842C177.309 171.923 177.293 172.003 177.262 172.076C177.232 172.149 177.187 172.213 177.132 172.265C177.077 172.317 177.012 172.354 176.943 172.375C175.694 172.76 174.858 172.997 173.296 173.508C172.219 173.859 171.121 174.433 170.057 174.814C169.319 175.079 167.585 175.089 166.689 175.089C165.363 175.089 165.067 173.517 165.638 173.445C167.075 173.267 167.268 173.349 168.062 172.9C169.36 172.262 170.537 171.349 171.528 170.21C171.715 169.971 171.955 169.792 172.223 169.69V169.69Z" fill="#263238"/>
<path d="M147.271 66.2799L143.719 64.6072L142.256 69.0323C143.712 69.2815 145.193 69.2815 146.649 69.0323L147.271 66.2799Z" fill="#E58A7B"/>
<path d="M141.094 64.4893L141 67.4286L142.274 69.0187L143.736 64.5953L141.094 64.4893Z" fill="#E58A7B"/>
<path d="M173.176 162.032L170.104 163.365L171.464 167.325L174.537 165.992L173.176 162.032Z" fill="#CF6F64"/>
<path d="M185.235 162.949H182.006L182.619 167.28H185.849L185.235 162.949Z" fill="#CF6F64"/>
<path opacity="0.2" d="M162.844 73.5189C162.908 74.3914 162.981 75.2832 163.075 76.199L175.921 71.5136C177.927 70.8457 179.67 69.4293 180.864 67.4983C180.915 66.2112 180.979 64.8567 181.078 63.4444C181.121 62.7599 181.173 62.0561 181.228 61.3427C181.284 60.6293 181.361 59.8387 181.443 59.0771L162.844 73.5189Z" fill="black"/>
<path d="M167.05 57.7037L166.621 57.6459C166.874 55.2367 168.474 53.3382 170.159 53.3864V53.8682C168.684 53.8345 167.277 55.5451 167.05 57.7037Z" fill="white"/>
<path d="M169.339 62.1572H169.266V61.6754C170.741 61.738 172.126 60.0082 172.354 57.8544L172.782 57.9122C172.555 60.2684 171.007 62.1572 169.339 62.1572Z" fill="white"/>
<path d="M177.352 37.3706C176.747 40.0266 176.035 44.8903 177.592 46.6594C177.592 46.6594 176.502 49.354 172.113 49.354C168.101 49.354 170.251 46.6594 170.251 46.6594C172.92 45.9556 172.967 43.7672 172.615 41.6944L177.352 37.3706Z" fill="#E58A7B"/>
<path d="M175.418 39.1354L172.617 41.6939C172.704 42.1701 172.754 42.6537 172.767 43.1395C173.586 44.055 175.229 41.7373 175.396 40.552C175.481 40.0853 175.489 39.605 175.418 39.1354Z" fill="#CF6F64"/>
<path d="M167.796 37.3387C167.991 37.7182 168.253 38.0484 168.567 38.3088C168.881 38.5691 169.239 38.7539 169.619 38.8517C170.648 39.1071 171.163 38.0422 170.88 36.9725C170.627 36.0088 169.782 34.7127 168.735 34.9343C168.511 34.9862 168.301 35.0977 168.123 35.2594C167.945 35.4211 167.805 35.6284 167.713 35.8638C167.621 36.0993 167.58 36.3561 167.595 36.6127C167.609 36.8693 167.678 37.1183 167.796 37.3387V37.3387Z" fill="#CF6F64"/>
<path d="M169.509 28.8381C167.904 29.6624 167.338 36.8254 169.355 37.8859C171.371 38.9464 172.547 27.2715 169.509 28.8381Z" fill="#263238"/>
<path d="M177.845 33.375C177.459 36.971 177.416 39.0872 175.7 40.9285C175.168 41.5396 174.496 41.9736 173.759 42.1828C173.021 42.3919 172.247 42.368 171.521 42.1136C170.794 41.8593 170.145 41.3844 169.644 40.7415C169.143 40.0985 168.809 39.3125 168.681 38.4702C168.162 35.2405 168.878 29.9044 172.087 28.4727C172.762 28.1386 173.503 28.0131 174.235 28.1094C174.967 28.2057 175.663 28.5202 176.25 29.0203C176.838 29.5204 177.295 30.1879 177.576 30.9536C177.856 31.7193 177.949 32.5553 177.845 33.375V33.375Z" fill="#E58A7B"/>
<path d="M172.569 30.6995C174.946 30.0198 176.692 29.557 176.066 31.7792C175.238 34.7486 174.242 37.6215 175.576 37.7516C176.392 37.8336 179.996 36.1175 179.537 34.3774C179.138 32.8638 180.824 32.4492 181.124 31.6828C182.235 28.9063 179.056 29.2726 179.622 27.5855C180.189 25.8984 177.048 23.1797 175.332 24.5342C172.539 26.7227 167.746 26.6889 170.265 23.0881C172.071 20.5189 168.849 21.0443 168.849 21.0443C168.849 21.0443 170.797 22.341 167.519 24.3462C164.052 26.4865 167.232 32.2371 172.569 30.6995Z" fill="#263238"/>
<path d="M179.111 37.3387C178.642 38.1013 177.938 38.6406 177.134 38.8517C176.075 39.1071 175.668 38.0422 176.066 36.9725C176.422 36.0088 177.4 34.7127 178.412 34.9343C179.424 35.156 179.656 36.3943 179.111 37.3387Z" fill="#E58A7B"/>
<path d="M163.409 79.0387C163.409 79.0387 160.509 108.202 160.281 119.269C160.05 130.78 170.111 166.697 170.111 166.697L175.259 164.287C175.259 164.287 169.253 131.47 170.111 120.166C171.02 107.84 174.779 79.058 174.779 79.058L163.409 79.0387Z" fill="#051C4A"/>
<path opacity="0.2" d="M170.611 87.0446C168.298 92.4337 169.856 103.092 171.109 109.406C171.585 104.947 172.151 100.108 172.688 95.6296C172.636 88.7461 172.16 83.4293 170.611 87.0446Z" fill="black"/>
<path d="M175.012 162.379C175.038 162.379 175.621 164.22 175.621 164.22L169.683 167.026L168.748 165.068L175.012 162.379Z" fill="#BD923C"/>
<path d="M169.529 79.0387C169.529 79.0387 171.747 106.775 173.215 117.163C174.828 128.544 181.152 166.446 181.152 166.446H187.069C187.069 166.446 183.525 129.464 182.855 118.194C182.126 105.97 180.676 79.0387 180.676 79.0387H169.529Z" fill="#051C4A"/>
<path d="M187.159 164.714C187.185 164.714 187.356 166.57 187.356 166.57H180.852L180.389 164.439L187.159 164.714Z" fill="#BD923C"/>
<path opacity="0.2" d="M184.893 162.518C184.879 162.518 184.866 162.513 184.856 162.503C184.846 162.493 184.839 162.479 184.837 162.465C184.802 162.127 181.606 128.722 181.005 118.599C180.353 107.619 179.04 83.2613 179.028 83.0154C179.027 83.0074 179.028 82.9994 179.03 82.9918C179.032 82.9842 179.036 82.9773 179.041 82.9714C179.046 82.9655 179.052 82.9608 179.058 82.9576C179.065 82.9544 179.072 82.9527 179.079 82.9528V82.9528C179.093 82.9527 179.107 82.9586 179.117 82.9694C179.127 82.9801 179.134 82.9948 179.135 83.0106C179.135 83.2564 180.461 107.594 181.113 118.594C181.713 128.717 184.91 162.098 184.94 162.46C184.941 162.468 184.941 162.476 184.939 162.484C184.937 162.492 184.934 162.499 184.93 162.505C184.925 162.512 184.919 162.517 184.913 162.521C184.907 162.524 184.9 162.527 184.893 162.527V162.518Z" fill="black"/>
<path d="M172.931 34.3771C172.931 34.671 172.768 34.9071 172.597 34.9071C172.425 34.9071 172.301 34.671 172.318 34.3771C172.335 34.0831 172.481 33.847 172.653 33.847C172.824 33.847 172.948 34.088 172.931 34.3771Z" fill="#263238"/>
<path d="M169.988 34.3771C169.988 34.671 169.82 34.9071 169.653 34.9071C169.486 34.9071 169.357 34.671 169.37 34.3771C169.383 34.0831 169.537 33.847 169.709 33.847C169.88 33.847 170.005 34.088 169.988 34.3771Z" fill="#263238"/>
<path d="M170.917 34.5238C170.559 35.4213 170.098 36.2621 169.545 37.0245C169.974 37.5064 170.776 37.2847 170.776 37.2847L170.917 34.5238Z" fill="#DF5753"/>
<path d="M170.989 38.5141C170.979 38.5142 170.969 38.5119 170.96 38.5075C170.951 38.5031 170.943 38.4966 170.936 38.4885C170.929 38.4803 170.924 38.4707 170.92 38.4602C170.917 38.4497 170.916 38.4386 170.916 38.4274C170.917 38.404 170.926 38.3819 170.941 38.3658C170.957 38.3496 170.977 38.3406 170.998 38.3407C171.326 38.3432 171.65 38.2632 171.947 38.1064C172.244 37.9497 172.506 37.7202 172.713 37.4348C172.728 37.4202 172.747 37.4122 172.767 37.4122C172.786 37.4122 172.805 37.4202 172.82 37.4348C172.834 37.451 172.842 37.4726 172.842 37.495C172.842 37.5175 172.834 37.5391 172.82 37.5553C172.598 37.8586 172.318 38.1021 172.001 38.268C171.685 38.4339 171.339 38.518 170.989 38.5141V38.5141Z" fill="#263238"/>
<path d="M173.46 33.4875C173.439 33.4994 173.416 33.5056 173.393 33.5056C173.37 33.5056 173.347 33.4994 173.327 33.4875C173.166 33.371 172.984 33.2985 172.794 33.2759C172.604 33.2533 172.412 33.2813 172.233 33.3574C172.216 33.3672 172.197 33.373 172.177 33.3744C172.158 33.3758 172.138 33.3728 172.12 33.3656C172.101 33.3585 172.085 33.3472 172.07 33.3326C172.056 33.3179 172.044 33.3002 172.036 33.2803C172.02 33.2375 172.019 33.1893 172.035 33.1461C172.05 33.1029 172.079 33.0681 172.117 33.0491C172.341 32.9462 172.584 32.9056 172.826 32.9308C173.067 32.9559 173.299 33.0461 173.502 33.1936C173.519 33.2062 173.533 33.2223 173.544 33.241C173.555 33.2597 173.562 33.2806 173.566 33.3026C173.569 33.3246 173.569 33.3471 173.565 33.3689C173.56 33.3908 173.552 33.4114 173.541 33.4297C173.519 33.4574 173.491 33.4774 173.46 33.4875V33.4875Z" fill="#263238"/>
<path d="M168.845 32.5244C168.822 32.5182 168.802 32.5048 168.785 32.4859C168.771 32.4702 168.76 32.4514 168.752 32.4307C168.744 32.41 168.74 32.3878 168.74 32.3654C168.74 32.343 168.744 32.3207 168.752 32.3001C168.76 32.2794 168.771 32.2606 168.785 32.2449C168.95 32.0378 169.154 31.8761 169.384 31.7725C169.613 31.6688 169.86 31.6261 170.106 31.6474C170.126 31.6509 170.145 31.6588 170.162 31.6708C170.179 31.6827 170.193 31.6984 170.204 31.717C170.216 31.7355 170.223 31.7564 170.227 31.7784C170.231 31.8005 170.231 31.8231 170.226 31.845C170.217 31.8896 170.194 31.9289 170.161 31.9555C170.127 31.9822 170.087 31.9943 170.046 31.9896V31.9896C169.851 31.9758 169.656 32.012 169.476 32.0955C169.295 32.1789 169.134 32.3075 169.004 32.4714C168.984 32.4958 168.959 32.5136 168.931 32.523C168.903 32.5323 168.874 32.5328 168.845 32.5244V32.5244Z" fill="#263238"/>
<path d="M184.99 52.2266L180.528 50.8913C180.528 50.8913 176.151 62.9952 174.602 63.781C172.5 64.8607 167.176 68.6013 164.91 70.3704C164.786 70.9729 164.885 72.5685 165.168 73.0071C169.029 72.2166 176.422 69.0207 177.966 67.3962C181.489 63.6894 184.99 52.2266 184.99 52.2266Z" fill="#E58A7B"/>
<path d="M181.878 171.567C181.66 171.586 181.443 171.52 181.264 171.379C181.209 171.323 181.168 171.252 181.145 171.172C181.121 171.093 181.117 171.008 181.132 170.926C181.134 170.875 181.149 170.825 181.175 170.783C181.201 170.741 181.236 170.707 181.277 170.685C181.638 170.478 182.645 171.196 182.761 171.278C182.774 171.287 182.784 171.3 182.789 171.316C182.795 171.331 182.795 171.348 182.791 171.365C182.788 171.381 182.78 171.397 182.77 171.409C182.759 171.422 182.746 171.432 182.731 171.437C182.452 171.514 182.166 171.558 181.878 171.567ZM181.449 170.815C181.416 170.807 181.383 170.807 181.35 170.815C181.334 170.825 181.32 170.839 181.311 170.857C181.302 170.875 181.298 170.896 181.299 170.916C181.287 170.972 181.289 171.031 181.304 171.086C181.319 171.141 181.347 171.19 181.385 171.23C181.552 171.398 181.972 171.418 182.525 171.297C182.196 171.053 181.825 170.889 181.436 170.815H181.449Z" fill="#BD923C"/>
<path d="M182.714 171.44C182.702 171.444 182.69 171.444 182.679 171.44C182.358 171.238 181.753 170.443 181.843 170.038C181.856 169.974 181.889 169.917 181.935 169.876C181.981 169.834 182.037 169.812 182.096 169.812C182.154 169.803 182.212 169.808 182.268 169.827C182.323 169.847 182.374 169.879 182.418 169.922C182.774 170.264 182.795 171.315 182.795 171.368C182.797 171.384 182.795 171.4 182.788 171.414C182.781 171.428 182.77 171.439 182.757 171.445C182.742 171.448 182.727 171.447 182.714 171.44ZM182.139 169.971H182.109C182.01 169.971 181.997 170.033 181.993 170.057C181.942 170.293 182.323 170.896 182.641 171.18C182.639 170.773 182.527 170.376 182.319 170.043C182.269 169.994 182.205 169.968 182.139 169.971V169.971Z" fill="#BD923C"/>
<path d="M170.49 170.966C170.227 171.069 169.941 171.069 169.679 170.966C169.619 170.93 169.569 170.878 169.532 170.814C169.495 170.75 169.474 170.676 169.469 170.6C169.463 170.553 169.469 170.504 169.485 170.459C169.5 170.415 169.526 170.375 169.559 170.345C169.902 169.998 171.304 170.345 171.463 170.412C171.478 170.417 171.492 170.427 171.501 170.441C171.51 170.455 171.515 170.472 171.515 170.489C171.515 170.507 171.511 170.525 171.503 170.541C171.494 170.556 171.482 170.569 171.467 170.576C171.152 170.736 170.825 170.867 170.49 170.966V170.966ZM169.79 170.393C169.741 170.404 169.696 170.429 169.658 170.465C169.644 170.477 169.633 170.492 169.627 170.51C169.621 170.528 169.62 170.548 169.623 170.566C169.626 170.617 169.64 170.666 169.664 170.709C169.688 170.752 169.721 170.787 169.76 170.812C169.988 170.947 170.515 170.841 171.197 170.518C170.738 170.388 170.262 170.346 169.79 170.393V170.393Z" fill="#BD923C"/>
<path d="M171.45 170.575H171.416C170.987 170.488 170.129 169.934 170.104 169.52C170.104 169.423 170.142 169.288 170.348 169.211C170.418 169.183 170.491 169.172 170.565 169.177C170.639 169.182 170.711 169.203 170.777 169.24C171.24 169.495 171.484 170.421 171.497 170.464C171.5 170.479 171.5 170.494 171.496 170.508C171.492 170.522 171.485 170.535 171.476 170.546C171.47 170.558 171.461 170.568 171.45 170.575V170.575ZM170.434 169.356H170.391C170.258 169.409 170.258 169.471 170.258 169.491C170.258 169.741 170.88 170.199 171.313 170.353C171.213 169.966 171.002 169.627 170.713 169.389C170.626 169.34 170.527 169.328 170.434 169.356Z" fill="#BD923C"/>
<path d="M165.281 70.0849L160.806 72.3987L160.287 73.8448L161.939 75.0932C161.939 75.0932 165.028 74.7173 165.908 72.4854L165.281 70.0849Z" fill="#E58A7B"/>
<path d="M165.459 73.0836C165.359 72.1179 165.075 71.1878 164.627 70.3563L165.335 69.7588C165.867 70.7169 166.206 71.794 166.33 72.9149L165.459 73.0836Z" fill="#263238"/>
<path d="M166.23 70.7743C166.325 70.9414 166.371 71.1372 166.363 71.335C166.355 71.5328 166.293 71.7231 166.185 71.8799C166.078 72.0367 165.93 72.1524 165.762 72.2114C165.593 72.2703 165.413 72.2696 165.245 72.2093C165.077 72.149 164.93 72.0321 164.823 71.8744C164.717 71.7167 164.656 71.526 164.649 71.3281C164.642 71.1302 164.69 70.9348 164.786 70.7685C164.881 70.6021 165.02 70.4729 165.184 70.3984C165.367 70.2935 165.58 70.2741 165.776 70.3445C165.972 70.4149 166.135 70.5693 166.23 70.7743V70.7743Z" fill="#263238"/>
<path d="M157.777 74.271L158.374 74.9459L162.39 73.0177L160.802 72.4007L157.777 74.271Z" fill="#E58A7B"/>
<path opacity="0.2" d="M175.012 162.379C175.038 162.379 175.621 164.22 175.621 164.22L169.683 167.026L168.748 165.068L175.012 162.379Z" fill="black"/>
<path opacity="0.2" d="M187.159 164.714C187.185 164.714 187.356 166.57 187.356 166.57H180.852L180.389 164.439L187.159 164.714Z" fill="black"/>
<path d="M186.157 50.8394C187.337 55.115 182.725 60.9621 182.725 60.9621L176.354 58.041C177.109 55.5697 177.979 53.1449 178.962 50.7767C180.919 46.0383 184.964 46.5252 186.157 50.8394Z" fill="#BD923C"/>
<path opacity="0.2" d="M186.157 50.8394C187.337 55.115 182.725 60.9621 182.725 60.9621L176.354 58.041C177.109 55.5697 177.979 53.1449 178.962 50.7767C180.919 46.0383 184.964 46.5252 186.157 50.8394Z" fill="black"/>
<path d="M117.544 7.52258H114.477V8.02021H117.544V7.52258Z" fill="#051C4A"/>
<path d="M157.25 27.2186L156.879 35.5106L157.373 35.533L157.744 27.241L157.25 27.2186Z" fill="#051C4A"/>
<path d="M156.295 9.75463H99.6552L94.3848 128.473H151.025L156.295 9.75463Z" fill="#051C4A"/>
<path opacity="0.56" d="M154.604 11.3877H97.9638L92.6934 130.106H149.333L154.604 11.3877Z" fill="#FAFAFA"/>
<path opacity="0.07" d="M152.915 13.0158H96.2752L91 131.734H147.64L152.915 13.0158Z" fill="#051C4A"/>
<path d="M146.468 64.7943H98.1219L97.7188 73.8774H146.064L146.468 64.7943Z" fill="white"/>
<path d="M124.712 58.1657H98.4178L98.2402 62.2289H124.535L124.712 58.1657Z" fill="#051C4A"/>
<path d="M145.378 89.3091H97.0321L96.6289 98.3922H144.975L145.378 89.3091Z" fill="white"/>
<path d="M136.515 110.659H104.004L103.52 121.545H136.03L136.515 110.659Z" fill="#33CC7F"/>
<path d="M134.34 123.235H101.83C101.816 123.239 101.801 123.239 101.787 123.235C101.782 123.221 101.782 123.206 101.787 123.192L102.267 112.302C102.267 112.294 102.268 112.287 102.271 112.28C102.274 112.273 102.278 112.267 102.284 112.262C102.289 112.257 102.296 112.254 102.303 112.251C102.31 112.249 102.317 112.248 102.324 112.249H134.835C134.841 112.246 134.847 112.244 134.854 112.244C134.861 112.244 134.867 112.246 134.873 112.249C134.877 112.255 134.878 112.261 134.878 112.268C134.878 112.275 134.877 112.281 134.873 112.287L134.403 123.202C134.397 123.213 134.388 123.222 134.377 123.228C134.366 123.234 134.353 123.237 134.34 123.235V123.235ZM101.888 123.119H134.283L134.763 112.345H102.368L101.888 123.119Z" fill="white"/>
<path d="M119.032 82.6803H97.326L97.1484 86.7484H118.849L119.032 82.6803Z" fill="#051C4A"/>
<path d="M135.894 35.4531C135.77 38.0966 134.836 40.6366 133.221 42.7244C132.025 44.3015 130.486 45.5817 128.722 46.467C126.958 47.3522 125.016 47.8189 123.045 47.8312C121.452 47.8435 119.874 47.5273 118.407 46.9023C116.94 46.2773 115.616 45.3566 114.516 44.1969C113.416 43.0373 112.564 41.6633 112.011 40.1595C111.459 38.6557 111.218 37.054 111.304 35.4531C111.473 32.131 112.896 28.9993 115.283 26.6985C117.67 24.3976 120.839 23.1014 124.144 23.075C125.738 23.06 127.318 23.3742 128.787 23.9982C130.255 24.6221 131.581 25.5426 132.683 26.7026C133.784 27.8627 134.637 29.2378 135.189 30.7428C135.742 32.2479 135.982 33.851 135.894 35.4531V35.4531Z" fill="white"/>
<path d="M137.053 25.6646C137.021 26.3675 136.773 27.0431 136.342 27.5972C136.024 28.0161 135.614 28.3561 135.145 28.5914C134.676 28.8267 134.159 28.951 133.635 28.9549C133.127 28.958 132.626 28.8358 132.176 28.5992C131.726 28.3625 131.34 28.0185 131.053 27.5972C130.672 27.0279 130.483 26.3502 130.515 25.6646C130.562 24.7826 130.941 23.9516 131.575 23.3411C132.209 22.7307 133.05 22.3866 133.928 22.3793C134.351 22.3754 134.771 22.4588 135.161 22.6243C135.551 22.7899 135.903 23.0341 136.196 23.3419C136.489 23.6497 136.716 24.0146 136.863 24.414C137.011 24.8135 137.075 25.2391 137.053 25.6646V25.6646Z" fill="#33CC7F"/>
<path d="M103.33 69.3359C103.307 69.7252 103.138 70.0913 102.857 70.3602C102.577 70.6292 102.205 70.7811 101.818 70.7853C101.631 70.7876 101.445 70.7512 101.273 70.6784C101.1 70.6056 100.944 70.4979 100.815 70.362C100.685 70.2262 100.585 70.065 100.519 69.8885C100.454 69.712 100.426 69.5239 100.435 69.3359C100.456 68.9458 100.624 68.5784 100.906 68.3089C101.187 68.0395 101.559 67.8884 101.947 67.8865C102.134 67.8849 102.32 67.9218 102.492 67.9949C102.664 68.0679 102.82 68.1756 102.949 68.3113C103.078 68.447 103.179 68.6078 103.245 68.784C103.31 68.9602 103.339 69.148 103.33 69.3359V69.3359Z" fill="#263238"/>
<path d="M109.802 69.3359C109.78 69.7257 109.611 70.0924 109.33 70.3616C109.05 70.6308 108.677 70.7823 108.29 70.7854C108.103 70.787 107.918 70.7501 107.746 70.677C107.574 70.6039 107.419 70.4961 107.29 70.3603C107.161 70.2245 107.061 70.0636 106.996 69.8874C106.931 69.7113 106.902 69.5236 106.912 69.3359C106.933 68.9466 107.1 68.58 107.38 68.3106C107.66 68.0413 108.032 67.8896 108.419 67.8865C108.606 67.8843 108.792 67.9207 108.964 67.9935C109.137 68.0663 109.293 68.1739 109.422 68.3098C109.552 68.4456 109.652 68.6068 109.718 68.7833C109.783 68.9598 109.812 69.1479 109.802 69.3359V69.3359Z" fill="#263238"/>
<path d="M116.277 69.3359C116.255 69.7257 116.086 70.0924 115.806 70.3616C115.525 70.6308 115.153 70.7823 114.765 70.7854C114.578 70.7869 114.393 70.75 114.221 70.677C114.048 70.6039 113.893 70.4963 113.763 70.3606C113.634 70.2249 113.533 70.064 113.468 69.8878C113.402 69.7116 113.373 69.5238 113.383 69.3359C113.404 68.9462 113.573 68.5795 113.854 68.3103C114.135 68.0411 114.507 67.8896 114.895 67.8865C115.082 67.8843 115.267 67.9207 115.44 67.9935C115.612 68.0663 115.768 68.1739 115.898 68.3098C116.027 68.4456 116.128 68.6068 116.193 68.7833C116.258 68.9598 116.287 69.1479 116.277 69.3359V69.3359Z" fill="#263238"/>
<path d="M102.242 93.8508C102.219 94.2401 102.05 94.6061 101.769 94.8751C101.489 95.1441 101.117 95.296 100.73 95.3002C100.543 95.3017 100.358 95.2648 100.185 95.1918C100.013 95.1188 99.8576 95.0111 99.7282 94.8754C99.5988 94.7397 99.4982 94.5788 99.4327 94.4026C99.3673 94.2264 99.3382 94.0386 99.3474 93.8508C99.3693 93.461 99.5378 93.0943 99.8186 92.8251C100.099 92.5559 100.472 92.4044 100.859 92.4013C101.046 92.3998 101.231 92.4367 101.404 92.5097C101.576 92.5828 101.731 92.6904 101.861 92.8261C101.99 92.9618 102.091 93.1227 102.156 93.2989C102.222 93.4751 102.251 93.6629 102.242 93.8508Z" fill="#263238"/>
<path d="M108.712 93.8508C108.69 94.2397 108.522 94.6057 108.242 94.8748C107.962 95.1438 107.592 95.2959 107.205 95.3002C107.018 95.3024 106.832 95.266 106.659 95.1932C106.487 95.1204 106.331 95.0128 106.201 94.8769C106.072 94.7411 105.971 94.5799 105.906 94.4034C105.841 94.2269 105.812 94.0388 105.822 93.8508C105.844 93.461 106.013 93.0943 106.293 92.8251C106.574 92.5559 106.946 92.4044 107.334 92.4013C107.521 92.3997 107.706 92.4366 107.878 92.5097C108.05 92.5828 108.205 92.6906 108.334 92.8264C108.463 92.9622 108.563 93.1231 108.628 93.2993C108.693 93.4754 108.722 93.6631 108.712 93.8508V93.8508Z" fill="#263238"/>
<path d="M115.202 93.8507C115.181 94.2404 115.012 94.6071 114.731 94.8763C114.45 95.1455 114.078 95.2971 113.69 95.3001C113.504 95.301 113.319 95.2636 113.147 95.1903C112.975 95.117 112.82 95.0093 112.69 94.8738C112.561 94.7382 112.461 94.5776 112.395 94.4018C112.329 94.2259 112.3 94.0384 112.308 93.8507C112.331 93.4614 112.5 93.0953 112.781 92.8263C113.061 92.5574 113.433 92.4055 113.82 92.4013C114.007 92.399 114.193 92.4354 114.365 92.5082C114.538 92.581 114.694 92.6887 114.823 92.8245C114.953 92.9604 115.053 93.1215 115.119 93.298C115.184 93.4745 115.212 93.6626 115.202 93.8507V93.8507Z" fill="#263238"/>
<path d="M121.663 93.8508C121.64 94.2401 121.471 94.6061 121.191 94.8751C120.91 95.1441 120.539 95.296 120.151 95.3002C119.965 95.301 119.78 95.2637 119.608 95.1904C119.436 95.1171 119.281 95.0094 119.151 94.8739C119.022 94.7383 118.922 94.5777 118.856 94.4018C118.79 94.226 118.761 94.0385 118.769 93.8508C118.792 93.4614 118.961 93.0954 119.241 92.8264C119.522 92.5574 119.894 92.4055 120.281 92.4013C120.468 92.3998 120.653 92.4367 120.825 92.5097C120.998 92.5828 121.153 92.6904 121.283 92.8261C121.412 92.9618 121.513 93.1227 121.578 93.2989C121.643 93.4751 121.673 93.6629 121.663 93.8508V93.8508Z" fill="#263238"/>
<path d="M128.162 93.8508C128.139 94.2401 127.97 94.6061 127.689 94.8751C127.409 95.1441 127.037 95.296 126.65 95.3002C126.463 95.3024 126.277 95.266 126.105 95.1932C125.932 95.1204 125.776 95.0128 125.647 94.8769C125.517 94.7411 125.417 94.5799 125.351 94.4034C125.286 94.2269 125.258 94.0388 125.268 93.8508C125.289 93.461 125.458 93.0943 125.739 92.8251C126.02 92.5559 126.392 92.4044 126.78 92.4013C126.966 92.3998 127.152 92.4367 127.324 92.5097C127.496 92.5828 127.652 92.6904 127.781 92.8261C127.911 92.9618 128.011 93.1227 128.077 93.2989C128.142 93.4751 128.171 93.6629 128.162 93.8508Z" fill="#263238"/>
<path d="M127.179 34.8084C129.188 32.8308 129.295 29.6611 127.417 27.7285C125.54 25.796 122.389 25.8325 120.38 27.81C118.371 29.7875 118.264 32.9573 120.142 34.8898C122.019 36.8224 125.17 36.7859 127.179 34.8084Z" fill="#051C4A"/>
<path d="M133.221 42.7244C132.025 44.3015 130.486 45.5818 128.722 46.467C126.958 47.3523 125.016 47.819 123.045 47.8313C121.134 47.8476 119.248 47.3903 117.554 46.4997C115.859 45.6091 114.409 44.3126 113.33 42.7244C115.663 40.386 119.354 38.8593 123.444 38.8593C127.533 38.8593 131.095 40.386 133.221 42.7244Z" fill="#051C4A"/>
<path opacity="0.1" d="M127.179 34.8084C129.188 32.8308 129.295 29.6611 127.417 27.7285C125.54 25.796 122.389 25.8325 120.38 27.81C118.371 29.7875 118.264 32.9573 120.142 34.8898C122.019 36.8224 125.17 36.7859 127.179 34.8084Z" fill="white"/>
<path opacity="0.1" d="M133.221 42.7244C132.025 44.3015 130.486 45.5818 128.722 46.467C126.958 47.3523 125.016 47.819 123.045 47.8313C121.134 47.8476 119.248 47.3903 117.554 46.4997C115.859 45.6091 114.409 44.3126 113.33 42.7244C115.663 40.386 119.354 38.8593 123.444 38.8593C127.533 38.8593 131.095 40.386 133.221 42.7244Z" fill="white"/>
</svg>
