[
    {
        "name":"romi",
        "todo":[
            {
                "status":"open",
                "title":"Submit code to taksu",
                "duedate":"21-10-2022"
            },
            {
                "status":"done",
                "title":"Interview with Taksu",
                "duedate":"21-10-2022"
            },
            {
                "status":"overdue",
                "title":"Interview with Taksu",
                "duedate":"21-10-2022"
            }
        ]
    },
    {
        "name":"lingga",
        "todo":[
            {
                "status":"open",
                "title":"to do title",
                "duedate":"21-10-2022"
            },
            {
                "status":"done",
                "title":"to do title",
                "duedate":"21-10-2022"
            },
            {
                "status":"overdue",
                "title":"to do title",
                "duedate":"21-10-2022"
            }
        ]
    }
]