<svg xmlns="http://www.w3.org/2000/svg" width="32" height="30" viewBox="0 0 32 30">
    <path fill="#1D79B7" fill-rule="evenodd" d="M24.647 30a1.25 1.25 0 0 1-.73-.238l-8.21-5.965-8.21 5.965a1.243 1.243 0 0 1-1.913-1.39l3.137-9.65-8.21-5.964a1.242 1.242 0 1 1 .731-2.249H11.39l3.134-9.65a1.245 1.245 0 0 1 2.366 0l3.134 9.65H30.17a1.243 1.243 0 0 1 .73 2.249l-8.208 5.965 3.137 9.65A1.24 1.24 0 0 1 24.647 30"/>
</svg>
