<?xml version="1.0" encoding="utf-8"?>
<!-- Generator: Adobe Illustrator 16.0.4, SVG Export Plug-In . SVG Version: 6.00 Build 0)  -->
<!DOCTYPE svg PUBLIC "-//W3C//DTD SVG 1.1//EN" "http://www.w3.org/Graphics/SVG/1.1/DTD/svg11.dtd">
<svg version="1.1" id="Layer_1" xmlns="http://www.w3.org/2000/svg" xmlns:xlink="http://www.w3.org/1999/xlink" x="0px" y="0px"
	 width="960px" height="960px" viewBox="0 0 960 960" enable-background="new 0 0 960 960" xml:space="preserve">
<path fill="#008A94" d="M960,94.771v560.893L480,865.229L0,655.663V94.771H960z M165.948,363.222
	c58.885,0,87.237-40.645,87.237-85.849c0-46.196-29.74-84.461-91.4-84.461H96.357v170.31H165.948z M203.618,277.175
	c0,35.688-18.438,47.782-46.592,47.782h-10.31v-93.978h16.258C189.938,230.979,203.618,248.228,203.618,277.175z M382.255,296.01
	c0,14.275-7.931,29.145-26.171,29.145c-18.438,0-26.567-15.464-26.567-30.731V192.912h-50.954v100.917
	c0,41.834,22.999,72.367,77.323,72.367c52.144,0,76.927-31.524,76.927-73.953v-99.331h-50.558V296.01z M579.331,270.434
	c11.896-8.724,17.646-22.007,17.646-34.3c0-23.99-18.835-43.42-49.566-43.42h-84.263v170.508h89.814
	c33.11,0,54.324-23.99,54.324-50.359c0-16.258-8.327-32.714-27.955-41.239V270.434L579.331,270.434z M512.119,229.591h21.016
	c10.508,0,16.456,6.146,16.456,14.672c0,11.698-10.508,14.672-17.051,14.672h-20.421V229.591z M558.909,308.302
	c0,6.939-3.37,17.051-19.43,17.051h-27.162v-33.705h25.774C550.78,291.648,558.909,298.191,558.909,308.302z M739.529,363.222
	h49.566l-83.271-174.275h-5.948L614.82,363.222h48.575l8.525-19.033h59.083L739.529,363.222z M701.66,277.77h0.991l14.474,33.903
	h-30.533L701.66,277.77z M858.488,363.222v-170.31h-50.558v170.31H858.488z M87.832,550.384
	c16.258,9.12,39.851,12.689,57.695,12.689c44.411,0,60.867-25.18,60.867-47.188c0-52.738-70.979-52.342-70.979-70.186
	c0-7.931,8.327-10.904,18.637-10.904c12.887,0,32.317,6.146,42.429,12.688v-37.076c-17.844-7.534-37.076-10.111-49.963-10.111
	c-38.265,0.198-57.299,21.611-57.299,45.403c0,47.187,70.979,46.195,70.979,70.186c0,8.724-8.922,12.293-20.421,12.293
	c-14.077,0-38.86-7.336-51.945-17.646V550.384z M308.501,562.677c50.558,0,85.65-34.895,85.65-80.694
	c0-45.006-33.903-80.892-85.056-80.892c-50.558,0-85.849,35.886-85.849,80.892C223.247,527.782,256.555,562.677,308.501,562.677z
	 M309.294,438.959c24.783,0,39.454,19.43,39.454,43.222c0,24.783-15.067,44.015-39.454,44.015c-23.99,0-39.852-18.835-39.852-44.015
	C269.442,457.992,285.304,438.959,309.294,438.959z M512.119,498.637c0,12.888-7.336,26.567-23.792,26.567
	c-16.654,0-24.188-14.076-24.188-28.153v-92.59h-46.394v92.193c0,38.266,21.016,66.022,70.582,66.022
	c47.584,0,70.186-28.749,70.186-67.41v-90.806h-46.195v94.176H512.119z M705.626,439.157v-34.895H574.771v34.895h42.23V559.9h46.196
	V439.157H705.626L705.626,439.157z M861.462,559.9V404.461h-46.394v57.497h-46.593v-57.497H722.28V559.9h46.195v-62.651h46.593
	V559.9H861.462z"/>
</svg>
