<svg width="24" height="24" viewBox="0 0 24 24" fill="none" xmlns="http://www.w3.org/2000/svg" class="block sm:hidden">
    <path d="M22.1841 12C23.1775 12 23.9966 12.8098 23.8483 13.792C23.5532 15.7472 22.7782 17.609 21.5807 19.205C20.0216 21.2831 17.8305 22.7985 15.3369 23.5235C12.8432 24.2485 10.1818 24.1439 7.75273 23.2253C5.32363 22.3068 3.25812 20.624 1.86672 18.4299C0.475323 16.2358 -0.166772 13.6491 0.0369655 11.0585C0.240703 8.4679 1.27926 6.01349 2.99651 4.06426C4.71376 2.11502 7.0169 0.776288 9.55968 0.249326C11.5123 -0.155335 13.5252 -0.0645126 15.4184 0.500467C16.3705 0.784607 16.7544 1.87072 16.3316 2.76986C15.9085 3.66972 14.8358 4.03458 13.8666 3.81229C12.6975 3.54415 11.4774 3.52829 10.2892 3.77453C8.50925 4.1434 6.89705 5.08051 5.69497 6.44498C4.4929 7.80945 3.76591 9.52753 3.62329 11.3409C3.48067 13.1544 3.93014 14.9651 4.90412 16.5009C5.8781 18.0368 7.32395 19.2148 9.02432 19.8577C10.7247 20.5007 12.5877 20.574 14.3332 20.0665C16.0788 19.559 17.6125 18.4982 18.7039 17.0435C19.4331 16.0716 19.9385 14.959 20.1936 13.7851C20.4046 12.8143 21.1907 12 22.1841 12Z"
          fill="#AC6AFF"></path>
    <path d="M17.5873 12C17.5873 15.0928 15.0819 17.6 11.9914 17.6C8.90079 17.6 6.39539 15.0928 6.39539 12C6.39539 8.90723 8.90079 6.40002 11.9914 6.40002C15.0819 6.40002 17.5873 8.90723 17.5873 12ZM9.75297 12C9.75297 13.2371 10.7551 14.24 11.9914 14.24C13.2276 14.24 14.2298 13.2371 14.2298 12C14.2298 10.7629 13.2276 9.76002 11.9914 9.76002C10.7551 9.76002 9.75297 10.7629 9.75297 12Z"
          fill="#AC6AFF"></path>
    <path d="M22.0296 10.2287C23.0078 10.0561 23.6737 9.11656 23.3573 8.17505C22.7765 6.44666 21.8093 4.87283 20.5299 3.57443C19.832 2.86616 18.6917 3.03713 18.0963 3.83354C17.5015 4.62917 17.6827 5.7462 18.3332 6.49696C18.9313 7.18723 19.413 7.97076 19.7591 8.81621C20.1355 9.73575 21.0512 10.4014 22.0296 10.2287Z"
          fill="#AC6AFF"></path>
</svg>