<?xml version="1.0" encoding="utf-8"?>
<!-- Generator: Adobe Illustrator 22.1.0, SVG Export Plug-In . SVG Version: 6.00 Build 0)  -->
<svg version="1.1" id="Layer_1" xmlns="http://www.w3.org/2000/svg" xmlns:xlink="http://www.w3.org/1999/xlink" x="0px" y="0px"
	 width="50px" height="50px" viewBox="0 0 50 50" style="enable-background:new 0 0 50 50;" xml:space="preserve">
<style type="text/css">
	.st0{fill:#EC1D24;}
</style>
<path class="st0" d="M33.1,23L25,31.4L16.9,23l1.8-1.7l5.1,5.3V11.5h2.4v15.2l5.1-5.3L33.1,23L33.1,23z M16.2,33h17.7v2.4H16.2V33
	L16.2,33z"/>
</svg>
