<svg xmlns="http://www.w3.org/2000/svg" viewBox="0 0 277 227" width="277" height="227">
	<defs>
		<clipPath clipPathUnits="userSpaceOnUse" id="cp1">
			<path d="M-849 -215L431 -215L431 585L-849 585Z" />
		</clipPath>
	</defs>
	<style>
		tspan { white-space:pre }
		.shp0 { fill: #00833e } 
		.shp1 { fill: #ffffff } 
	</style>
	<g id="Game options – 1" clip-path="url(#cp1)">
		<g id="-e-paint-rect">
			<path id="color-rect" class="shp0" d="M15.82 18L262.32 18L262.32 210.5L15.82 210.5L15.82 18Z" />
			<g id="Group 3961">
				<path id="option-border" fill-rule="evenodd" class="shp1" d="M266.01 212.22L242.22 225.49L238.87 211C238.21 210.98 236.04 225.49 236.04 225.49L213.56 210.65L195.43 222.28L193.4 210.68L188.32 222.51L166.89 210.5L140.77 221.54L138.06 210.78L133.73 222.28C133.73 222.28 112.54 210.78 112.05 210.78L93.13 222.28L91.36 210.87C90.35 210.87 86.7 223.43 86.7 223.43C86.7 223.43 64.17 211.65 64.04 211.65L39.84 226.78C39.84 226.78 37.41 212.57 36.76 212.59L32.8 224.8L12.94 212.4L2.29 187.87C2.29 187.87 12.9 184.88 12.9 184.11L2.52 181.45L12.38 161.6C12.41 160.71 4.36 137.41 4.36 137.41C4.36 137.41 13.74 133.67 13.79 132.89L5.74 131.45C5.74 131.45 15.25 106.71 15.27 106.37L3.21 87.64C3.21 87.64 14.72 85.76 14.68 84.76L2.75 81.9L13.33 62.71L1.83 41.99L12.09 38.98C12.01 38.19 0 35.8 0 35.8C0 35.8 10.91 17.83 10.92 17.73L36.6 2.07C36.6 2.07 38.85 15.62 39.6 15.62L42.08 3.51L61.81 15.12C61.96 15.11 82.89 3.8 82.89 3.8L83.29 14.5C84.24 14.48 90.99 5.19 90.99 5.19L108.75 14.51C109.77 14.56 134.88 5.48 134.88 5.48L138.44 15.06C139.23 15.07 140.94 3.6 140.94 3.6L163.63 15.25C163.74 15.25 183.79 4.63 183.79 4.63C183.79 4.63 187.8 15.33 188.08 15.33L190.49 4.91C190.49 4.91 212.62 14.61 213.38 14.56L236.69 0C236.69 0 239.05 13.12 239.71 13.07L241.36 1.56L264.37 11.73L273.64 36.02C273.64 36.02 263.53 40.4 263.51 40.66L275.69 40.89L262.35 63.37C262.34 63.73 273.06 90.09 273.06 90.09L261.88 89.51L270.43 94.51L262.39 114.45C262.41 115.08 273.43 136.49 273.43 136.49L263.79 137.26C263.87 138.3 275.24 141.07 275.24 141.07C275.24 141.07 264.53 161.24 264.5 162.24L275.71 183.97L264.01 185.84C264 186.6 276.64 189.25 276.64 189.25L266.01 212.22ZM34.86 20.43C32.65 19.99 22.83 20.15 15.8 20.39L15.8 20.44C15.8 25.74 16.78 35.77 17.59 44.06C18.27 50.99 18.86 56.98 18.86 59.74C18.86 63.18 19.28 74.4 19.65 84.31C20 93.34 20.32 101.88 20.32 104.33C20.32 106.18 19.88 113.85 19.32 123.56C18.53 137.22 17.28 158.95 17.28 166.17C17.28 167.2 17.3 167.93 17.36 168.3C17.87 171.87 17.96 189.26 17.96 200.52C17.96 203.57 17.95 206.13 17.95 207.89C26.14 208.06 53 207.13 71.11 206.38C73.21 206.08 83.09 205.71 135.08 205.78L138.15 205.78L224.52 205.64C228 205.64 239.73 206.03 249.16 206.35C253.49 206.49 257.43 206.62 260 206.7C259.23 200.55 259.01 193.53 259.01 187.64C259.01 184.26 259.08 181.28 259.12 179.07L259.17 175.96L259.33 169.06C259.47 164.09 259.67 157 259.67 151.45C259.67 148.27 259.61 145.59 259.42 144.12C258.69 138.25 257.28 115.51 257.28 110.77L256.66 76.91C256.66 74.96 257.01 69.17 257.41 62.46C257.94 53.81 258.53 44 258.53 39.92C258.53 36.42 259.29 22.74 259.63 16.82C257.04 16.96 253 17.22 248.24 17.53C245.2 17.72 241.77 17.94 238.09 18.18L238.1 18.35L237.09 18.23C221.42 19.21 201.47 20.32 187.25 20.32C171.86 20.32 114.61 20.08 105.56 19.33C101.11 18.95 82.85 19.49 66.73 19.97C45.98 20.56 36.7 20.79 34.86 20.43Z" />
			</g>
			<g id="Group 4099" style="opacity: 0.059">
				<path id="Path 22054" class="shp1" d="M77.28 28.49L81.57 37.4L63.65 34.97L66.49 28.49L64 28.49L60.44 36.6L85.23 39.96L79.71 28.49L77.28 28.49Z" />
				<path id="Path 22055" fill-rule="evenodd" class="shp1" d="M72.15 70.55L59.66 40.01L85.45 42.73L72.15 70.55ZM63.03 42.43L72.27 65.01L82.1 44.44L63.03 42.43Z" />
				<path id="Path 22056" fill-rule="evenodd" class="shp1" d="M61.1 103.71L72.86 71.98L84.82 104.73L61.1 103.71ZM72.88 78.5L64.25 101.79L81.66 102.54L72.88 78.5Z" />
				<path id="Path 22057" fill-rule="evenodd" class="shp1" d="M72.86 139.71L59.99 108.18L83.88 111.58L72.86 139.71ZM63.42 110.74L72.78 133.66L80.79 113.21L63.42 110.74Z" />
				<path id="Path 22058" fill-rule="evenodd" class="shp1" d="M59.54 171.5L72.87 139.88L83.81 171.92L59.54 171.5ZM72.68 146.2L62.86 169.5L80.74 169.81L72.68 146.2Z" />
				<path id="Path 22059" class="shp1" d="M67.49 198.51L69.88 198.51L60.45 175.72L81.34 176.78L71.86 198.51L74.35 198.51L84.66 174.88L57.15 173.49L67.49 198.51Z" />
				<path id="Path 22060" class="shp1" d="M26.25 65.94L36.45 38.43L46.82 66.83L26.25 65.94Z" />
				<path id="Path 22061" class="shp1" d="M45.92 74.72L36.41 99.02L25.3 71.79L45.92 74.72Z" />
				<path id="Path 22062" class="shp1" d="M25.6 131.54L37.18 104.07L46.68 131.9L25.6 131.54Z" />
				<path id="Path 22063" class="shp1" d="M25 139.98L35.24 164.75L47.4 136.87L25 135.73L25 139.98Z" />
				<path id="Path 22064" class="shp1" d="M160.34 28.49L164.63 37.4L146.72 34.97L149.56 28.49L147.07 28.49L143.5 36.6L168.3 39.96L162.78 28.49L160.34 28.49Z" />
				<path id="Path 22065" fill-rule="evenodd" class="shp1" d="M155.22 70.55L142.72 40.01L168.51 42.73L155.22 70.55ZM146.1 42.43L155.33 65.01L165.17 44.44L146.1 42.43Z" />
				<path id="Path 22066" fill-rule="evenodd" class="shp1" d="M144.16 103.71L155.92 71.98L167.89 104.73L144.16 103.71ZM155.95 78.5L147.32 101.79L164.73 102.54L155.95 78.5Z" />
				<path id="Path 22067" fill-rule="evenodd" class="shp1" d="M155.93 139.71L143.06 108.18L166.95 111.58L155.93 139.71ZM146.48 110.74L155.84 133.66L163.85 113.21L146.48 110.74Z" />
				<path id="Path 22068" fill-rule="evenodd" class="shp1" d="M142.6 171.5L155.93 139.88L166.88 171.92L142.6 171.5ZM155.75 146.2L145.93 169.5L163.81 169.81L155.75 146.2Z" />
				<path id="Path 22069" class="shp1" d="M150.56 198.51L152.94 198.51L143.52 175.72L164.41 176.78L154.93 198.51L157.42 198.51L167.72 174.88L140.21 173.49L150.56 198.51Z" />
				<path id="Path 22070" class="shp1" d="M109.32 65.94L119.52 38.43L129.89 66.83L109.32 65.94Z" />
				<path id="Path 22071" class="shp1" d="M128.99 74.72L119.48 99.02L108.36 71.79L128.99 74.72Z" />
				<path id="Path 22072" class="shp1" d="M108.67 131.54L120.24 104.07L129.75 131.9L108.67 131.54Z" />
				<path id="Path 22073" class="shp1" d="M130.47 136.87L118.31 164.75L106.27 135.64L130.47 136.87Z" />
				<path id="Path 22074" class="shp1" d="M243.41 28.49L247.7 37.4L229.78 34.97L232.63 28.49L230.13 28.49L226.57 36.6L251.37 39.96L245.84 28.49L243.41 28.49Z" />
				<path id="Path 22075" fill-rule="evenodd" class="shp1" d="M238.28 70.55L225.79 40.01L251.58 42.73L238.28 70.55ZM229.16 42.43L238.4 65.01L248.23 44.44L229.16 42.43Z" />
				<path id="Path 22076" fill-rule="evenodd" class="shp1" d="M227.23 103.71L238.99 71.98L250.95 104.73L227.23 103.71ZM239.01 78.5L230.38 101.79L247.8 102.54L239.01 78.5Z" />
				<path id="Path 22077" fill-rule="evenodd" class="shp1" d="M239 139.71L226.13 108.18L250.01 111.58L239 139.71ZM229.55 110.74L238.91 133.66L246.92 113.21L229.55 110.74Z" />
				<path id="Path 22078" fill-rule="evenodd" class="shp1" d="M225.67 171.5L239 139.88L249.95 171.92L225.67 171.5ZM238.81 146.2L228.99 169.5L246.88 169.81L238.81 146.2Z" />
				<path id="Path 22079" class="shp1" d="M233.62 198.51L236.01 198.51L226.59 175.72L247.47 176.78L237.99 198.51L240.48 198.51L250.79 174.88L223.28 173.49L233.62 198.51Z" />
				<path id="Path 22080" class="shp1" d="M192.38 65.94L202.58 38.43L212.95 66.83L192.38 65.94Z" />
				<path id="Path 22081" class="shp1" d="M212.05 74.72L202.54 99.02L191.43 71.79L212.05 74.72Z" />
				<path id="Path 22082" class="shp1" d="M191.73 131.54L203.31 104.07L212.81 131.9L191.73 131.54Z" />
				<path id="Path 22083" class="shp1" d="M213.53 136.87L201.37 164.75L189.34 135.64L213.53 136.87Z" />
			</g>
			<path id="streak" fill-rule="evenodd" class="shp1" d="M78.97 81.33C79.12 81.36 79.12 81.73 79.37 81.5C79.48 81.74 79.77 81.57 79.91 81.74C79.95 81.8 79.98 81.88 80.07 81.82C80.17 81.76 80.13 81.66 80.11 81.58C80.09 81.5 80.04 81.42 79.96 81.47C79.84 81.54 79.83 81.41 79.78 81.4C79.49 81.32 79.43 80.9 79.06 80.96C78.95 80.97 78.81 80.91 78.85 80.7C78.88 80.52 78.85 80.33 78.57 80.38C78.5 80.39 78.39 80.36 78.36 80.28C78.32 80.16 78.32 80.12 78.16 80.2C78.01 80.27 78 80.05 78 79.92C77.89 79.91 77.84 80.07 77.71 79.96C77.59 79.85 77.63 79.8 77.67 79.69C77.7 79.61 77.57 79.5 77.7 79.42C77.69 79.4 77.67 79.36 77.67 79.36C77.5 79.4 77.34 79.27 77.17 79.37C76.95 79.51 76.51 79.35 76.43 79.09C76.4 78.96 76.34 78.93 76.23 78.86C76.04 78.75 75.75 78.71 75.64 78.55C75.51 78.35 75.36 78.25 75.16 78.18C75.12 78.16 75.1 78.09 75.07 78.05C74.95 77.92 74.9 77.7 74.63 77.8C74.51 77.85 74.34 77.79 74.23 77.68C74.07 77.53 73.91 77.43 73.67 77.4C73.55 77.39 73.39 77.2 73.25 77.08C73.24 77.06 73.24 77.01 73.22 77.01C72.79 76.88 72.57 76.4 72.1 76.34C71.96 76.33 71.86 76.27 71.92 76.09C71.97 75.96 71.86 75.86 71.77 75.91C71.47 76.07 71.33 75.82 71.15 75.69C70.88 75.51 70.67 75.27 70.37 75.14C70.3 75.1 70.16 75.05 70.29 74.89C70.36 74.81 70.25 74.76 70.18 74.8C70.09 74.85 70.01 74.83 69.92 74.82C69.74 74.8 69.58 74.79 69.78 74.51C69.58 74.63 69.48 74.52 69.34 74.47C68.97 74.32 68.66 74.08 68.35 73.85C68.2 73.74 68.07 73.58 67.94 73.44C67.9 73.4 67.87 73.42 67.83 73.41C67.67 73.38 67.5 73.36 67.43 73.18C67.38 73.06 67.25 73.04 67.15 73.02C67.1 72.9 67.27 72.91 67.25 72.81C67.23 72.8 67.21 72.78 67.21 72.79C67.08 72.87 66.94 72.77 66.82 72.82C66.78 72.83 66.73 72.8 66.74 72.77C66.85 72.6 66.64 72.45 66.72 72.27C67.18 72.62 67.71 72.85 68.15 73.19C68.55 73.49 69 73.7 69.44 73.92C69.49 73.95 69.51 73.99 69.53 74.05C69.59 74.33 69.75 74.43 70.05 74.4C70.08 74.4 70.14 74.41 70.14 74.41C70.12 74.76 70.46 74.54 70.57 74.69C70.7 74.86 70.9 74.94 71.09 75.03C71.14 75.05 71.2 75.11 71.25 75.03C71.3 74.96 71.24 74.91 71.19 74.87C70.99 74.73 70.84 74.54 70.59 74.45C70.38 74.38 70.16 74.26 70.09 74C70.07 73.91 70 73.83 69.92 73.85C69.51 73.95 69.24 73.64 69.03 73.44C68.81 73.22 68.52 73.16 68.3 72.97C68.18 72.86 67.95 72.84 67.87 72.71C67.74 72.52 67.5 72.54 67.36 72.34C67.27 72.21 67.08 72.08 66.9 72C66.78 71.96 66.66 71.9 66.57 71.81C66.51 71.75 66.44 71.64 66.51 71.53C66.54 71.49 66.6 71.43 66.64 71.44C66.77 71.45 66.68 71.59 66.76 71.67C66.87 71.5 66.98 71.53 67.13 71.65C67.23 71.73 67.39 71.75 67.52 71.8C67.59 71.82 67.67 71.84 67.67 71.93C67.67 72.01 67.6 72.02 67.53 72.03C67.47 72.04 67.43 72.08 67.45 72.14C67.48 72.21 67.57 72.23 67.61 72.19C67.86 71.96 68.24 71.95 68.47 71.68C68.61 71.52 68.57 71.11 68.3 71.11C68.24 71.11 68.17 71.06 68.12 71.07C67.95 71.09 67.96 70.98 67.98 70.89C68.01 70.78 68.1 70.73 68.22 70.78C68.32 70.82 68.46 70.9 68.5 70.96C68.64 71.17 68.73 71.09 68.84 70.95C68.94 70.83 69.09 70.88 69.19 70.91C69.34 70.95 69.21 71.11 69.24 71.25C69.51 70.99 69.71 71.13 69.91 71.32C69.93 71.33 69.96 71.36 69.98 71.35C70.41 71.26 70.6 71.61 70.87 71.83C71.16 72.07 71.48 72.18 71.87 72.06C72.02 72.02 72.15 72.03 72.22 71.87C72.23 71.85 72.3 71.82 72.34 71.83C72.38 71.84 72.42 71.96 72.48 71.88C72.52 71.82 72.46 71.75 72.42 71.69C72.32 71.56 72.24 71.41 72.07 71.35C71.99 71.32 71.98 71.23 72.02 71.16C72.06 71.09 72.12 71.06 72.18 71.09C72.39 71.2 72.66 71.13 72.84 71.34C72.88 71.06 73.06 70.93 73.32 70.99C73.46 71.03 73.51 70.96 73.53 70.86C73.55 70.74 73.51 70.65 73.37 70.68C73.23 70.7 73.23 70.63 73.26 70.54C73.32 70.35 73.28 70.33 73.09 70.37C73 70.39 72.74 70.42 72.82 70.11C72.86 69.96 72.61 69.89 72.5 69.76C72.46 69.71 72.38 69.69 72.36 69.62C72.44 69.54 72.5 69.61 72.57 69.63C72.78 69.71 73.13 69.6 73.21 69.39C73.24 69.29 73.39 69.11 73.14 69.04C73.13 69.04 73.12 69.04 73.12 69.04C73.17 68.84 73.13 68.65 73.15 68.46C73.17 68.33 73.3 68.25 73.47 68.32C73.56 68.35 73.6 68.23 73.61 68.16C73.68 67.88 73.87 67.96 74.04 68.01C74.1 68.02 74.15 68.09 74.21 68.13C74.35 68.24 74.4 68.23 74.5 68.06C74.54 68.01 74.61 67.98 74.68 67.97C74.78 67.94 74.71 68.04 74.73 68.07C74.85 68.25 74.98 68.06 75.1 68.07C75.25 68.07 75.22 67.9 75.17 67.79C75.28 67.74 75.33 67.81 75.36 67.89C75.39 67.95 75.42 68.04 75.51 67.97C75.59 67.92 75.59 67.85 75.54 67.78C75.5 67.74 75.48 67.69 75.44 67.66C75.31 67.55 75.35 67.44 75.47 67.39C75.65 67.32 75.74 67.21 75.66 67.01C75.87 67.03 76.03 67.1 76.21 67.1C76.51 67.08 76.61 67.02 76.61 66.72C76.61 66.55 76.77 66.42 76.73 66.24C76.66 65.99 76.73 65.81 76.98 65.7C77.07 65.66 77.08 65.54 77.09 65.44C77.12 65.17 77.2 64.95 77.53 64.93C77.68 64.92 77.72 64.78 77.8 64.69C77.92 64.59 77.98 64.51 77.81 64.41C77.76 64.39 77.79 64.32 77.82 64.29C78.03 64.03 77.94 63.56 78.4 63.47C78.43 63.47 78.44 63.42 78.42 63.36C78.13 63.52 78.02 63.12 77.75 63.15C77.67 63.15 77.59 63.1 77.49 63.15C77.3 63.22 77.15 63.18 77.05 62.97C76.95 62.78 77.12 62.74 77.27 62.63C77.04 62.62 76.94 62.54 76.9 62.37C76.88 62.25 76.74 62.24 76.66 62.17C76.6 62.13 76.57 62.08 76.62 62.01C76.66 61.95 76.72 61.89 76.79 61.94C76.86 61.99 76.91 62.07 76.99 61.97C77.05 61.89 77.04 61.79 77 61.72C76.87 61.5 76.87 61.38 77.17 61.42C77.24 61.43 77.3 61.41 77.31 61.33C77.33 61.2 77.41 61.18 77.5 61.23C77.56 61.27 77.69 61.23 77.67 61.41C77.64 61.64 77.79 61.73 78 61.68C78.08 61.66 78.12 61.66 78.14 61.75C78.16 61.84 78.26 61.87 78.32 61.94C78.48 62.12 78.51 62.41 78.81 62.45C78.79 62.5 78.78 62.54 78.76 62.58C78.74 62.68 78.76 62.72 78.88 62.74C79.05 62.76 79.23 62.78 79.38 62.9C79.46 62.97 79.53 62.89 79.6 62.85C79.68 62.82 79.68 62.75 79.64 62.67C79.51 62.42 79.57 62.19 79.74 61.98C79.82 61.9 79.75 61.82 79.73 61.73C79.7 61.62 79.58 61.48 79.83 61.4C79.6 61.44 79.52 61.32 79.51 61.17C79.5 60.97 79.64 60.83 79.77 60.7C79.81 60.66 79.88 60.64 79.94 60.61C80.22 60.51 80.24 60.45 80.09 60.19C80.05 60.13 79.95 60.05 80.05 59.99C80.17 59.92 80.13 60.08 80.17 60.1C80.44 60.24 80.51 60.51 80.65 60.74C80.73 60.89 80.81 60.66 80.92 60.67C80.92 60.79 80.73 60.97 80.89 61.02C81.07 61.07 81.08 60.86 81.1 60.72C81.12 60.57 81.22 60.49 81.37 60.48C81.41 60.59 81.34 60.65 81.31 60.74C81.28 60.82 81.19 60.9 81.31 61C81.39 61.06 81.31 61.11 81.26 61.13C81.14 61.19 81.17 61.3 81.14 61.39C81.13 61.43 81.13 61.49 81.17 61.51C81.23 61.55 81.28 61.51 81.31 61.46C81.37 61.36 81.64 61.38 81.49 61.15C81.48 61.13 81.55 61.1 81.6 61.09C81.86 61.05 81.91 60.82 81.87 60.65C81.83 60.47 81.94 60.39 82.02 60.33C82.1 60.27 82.25 60.26 82.37 60.36C82.48 60.46 82.58 60.58 82.77 60.52C82.84 60.5 82.83 60.58 82.83 60.64C82.83 60.74 82.86 60.83 82.98 60.87C83.01 60.88 83.04 60.91 83.05 60.94C83.14 61.25 83.23 61.34 83.53 61.49C83.61 61.53 83.72 61.57 83.72 61.69C83.72 61.8 83.62 61.79 83.54 61.82C83.48 61.84 83.44 61.89 83.46 61.99C83.69 61.84 83.9 61.85 84.13 61.96C84.3 62.03 84.37 61.9 84.4 61.78C84.44 61.66 84.44 61.55 84.61 61.57C84.72 61.59 84.68 61.52 84.68 61.45C84.68 61.34 84.63 61.18 84.8 61.14C84.98 61.1 85.22 61.27 85.24 61.43C85.25 61.48 85.25 61.54 85.26 61.59C85.29 61.71 85.38 61.74 85.49 61.71C85.59 61.67 85.61 61.6 85.58 61.49C85.47 61.17 85.54 61.06 85.8 60.9C85.96 60.8 85.98 60.96 86.08 60.97C86.14 60.97 86.23 61.05 86.26 60.95C86.3 60.84 86.19 60.88 86.14 60.86C86.03 60.83 86.01 60.72 85.97 60.64C85.94 60.6 85.95 60.55 85.99 60.51C86.03 60.48 86.08 60.49 86.11 60.51C86.35 60.76 86.53 60.47 86.73 60.43C86.91 60.4 87.07 60.3 87.15 60.09C87.19 59.98 87.3 60 87.39 60.09C87.57 60.3 87.52 60.57 87.28 60.71C87.22 60.74 87.12 60.7 87.1 60.82C87.29 60.79 87.36 60.84 87.25 61.03C87.2 61.11 87.27 61.2 87.33 61.27C87.41 61.35 87.47 61.44 87.53 61.52C87.59 61.59 87.6 61.65 87.53 61.71C87.46 61.77 87.42 61.74 87.38 61.68C87.34 61.63 87.29 61.6 87.25 61.66C87.2 61.71 87.25 61.76 87.28 61.8C87.37 61.92 87.5 61.91 87.62 61.92C87.74 61.92 87.69 61.79 87.71 61.72C87.73 61.68 87.73 61.63 87.79 61.62C87.86 61.61 87.87 61.67 87.9 61.71C87.94 61.77 87.94 61.85 88.06 61.86C88.08 61.67 87.95 61.51 87.98 61.31C88.02 61.1 88.12 60.99 88.28 60.9C88.31 60.88 88.39 60.86 88.37 60.84C88.22 60.72 88.36 60.65 88.4 60.58C88.3 60.41 88.13 60.76 88.09 60.51C88.06 60.36 88.16 60.31 88.33 60.44C88.28 60.25 88.14 60.12 88.23 60.01C88.29 59.94 88.44 59.9 88.53 60.07C88.55 59.92 88.54 59.83 88.41 59.8C88.37 59.79 88.31 59.85 88.32 59.77C88.32 59.73 88.36 59.65 88.38 59.65C88.58 59.67 88.76 59.66 88.92 59.48C89.01 59.37 89.5 59.6 89.57 59.74C89.68 59.55 89.84 59.54 89.95 59.75C90.03 59.9 90.15 59.98 90.28 60.04C90.39 60.09 90.5 60.1 90.41 60.26C90.39 60.3 90.43 60.35 90.47 60.37C90.53 60.4 90.57 60.39 90.6 60.33C90.64 60.25 90.75 60.23 90.78 60.13C90.81 60.03 90.9 60 90.99 60.01C91.05 60.02 91.1 60.06 91.09 60.12C91.09 60.23 91.01 60.27 90.91 60.28C90.9 60.28 90.88 60.31 90.84 60.37C91.02 60.35 91.17 60.36 91.23 60.17C91.25 60.12 91.29 60.05 91.37 60.08C91.44 60.11 91.36 60.19 91.38 60.21C91.46 60.33 91.46 60.46 91.48 60.6C91.52 60.75 91.85 60.7 91.98 60.52C92.12 60.34 92.3 60.35 92.39 60.57C92.43 60.65 92.47 60.72 92.56 60.76C92.67 60.8 92.71 60.85 92.65 60.99C92.56 61.21 92.78 61.3 92.91 61.41C92.99 61.47 93.11 61.49 93.18 61.61C93.13 61.43 93.22 61.35 93.34 61.28C93.4 61.23 93.46 61.18 93.53 61.24C93.61 61.32 93.5 61.34 93.47 61.39C93.35 61.59 93.59 61.63 93.65 61.75C93.7 61.83 93.85 61.87 93.94 61.77C93.98 61.73 94.03 61.66 94.04 61.73C94.08 61.95 94.32 61.97 94.42 62.16C94.16 62.16 93.98 62.45 93.67 62.18C93.73 62.48 93.99 62.45 94.07 62.62C94.09 62.64 94.25 62.65 94.3 62.5C94.38 62.22 94.54 62.17 94.76 62.36C94.95 62.52 95.18 62.51 95.39 62.57C95.56 62.62 95.7 62.7 95.85 62.76C95.9 62.78 95.95 62.84 95.99 62.83C96.41 62.71 96.21 62.99 96.18 63.14C96.14 63.36 96.02 63.56 96.32 63.74C96.54 63.87 96.62 63.8 96.71 63.63C96.89 63.27 96.99 62.89 96.8 62.5C96.69 62.26 96.93 62.07 96.89 61.84C96.88 61.8 97.12 61.74 97.21 61.64C97.4 61.44 97.41 61.68 97.49 61.74C97.65 61.85 97.85 61.93 97.79 62.19C97.78 62.23 97.83 62.23 97.87 62.22C98.02 62.2 98.03 62.33 98.08 62.42C97.86 62.43 97.83 62.43 97.6 62.31C97.48 62.54 97.66 62.72 97.71 62.92C97.74 63.03 97.89 62.95 97.92 62.88C97.99 62.72 98.08 62.59 98.19 62.46C98.32 62.32 98.45 62.14 98.11 62.09C98.04 62.08 98.02 62 98.03 61.93C98.04 61.86 98.11 61.87 98.17 61.85C98.52 61.79 98.68 62.05 98.87 62.25C99 62.38 99.11 62.54 99.32 62.57C99.51 62.59 99.5 62.74 99.4 62.81C99.18 62.96 99.31 63.04 99.44 63.12C99.5 63.16 99.59 63.18 99.56 63.27C99.54 63.37 99.45 63.37 99.37 63.34C99.27 63.31 99.17 63.32 99.14 63.42C99.1 63.55 99.21 63.55 99.3 63.58C99.39 63.61 99.47 63.66 99.56 63.71C99.66 63.77 99.89 63.79 99.64 63.98C99.53 64.06 99.68 64.17 99.66 64.29C99.73 64.08 99.87 64.11 100.02 64.12C100.22 64.13 100.42 64.12 100.6 64.04C100.73 63.98 100.79 64.11 100.89 64.11C101.02 64.11 101.15 64.18 101.27 64.05C101.44 63.85 101.6 63.99 101.75 64.1C101.82 64.16 101.85 64.28 101.99 64.21C102.12 64.15 102.1 64.08 102.04 63.98C102.01 63.92 102.08 63.89 102.13 63.88C102.3 63.82 102.47 63.85 102.64 63.86C102.76 63.86 102.76 64.03 102.74 64.07C102.69 64.16 102.61 64.25 102.76 64.29C102.91 64.33 102.89 64.18 102.92 64.1C102.93 64.07 102.94 64.05 102.95 64.01C103.09 64.13 103.34 64.05 103.38 64.32C103.39 64.37 103.55 64.37 103.64 64.41C103.8 64.48 103.8 64.53 103.71 64.65C104.07 64.59 104.07 64.59 103.96 64.4C104.21 64.29 104.42 64.41 104.62 64.55C104.74 64.63 104.78 64.75 104.63 64.84C104.49 64.91 104.56 65.07 104.48 65.17C104.45 65.2 104.49 65.3 104.39 65.3C104.34 65.3 104.28 65.26 104.27 65.34C104.26 65.4 104.33 65.42 104.38 65.44C104.45 65.45 104.51 65.45 104.54 65.38C104.57 65.32 104.52 65.19 104.67 65.24C104.75 65.27 104.85 65.28 104.81 65.42C104.79 65.49 104.84 65.5 104.91 65.5C105.01 65.5 105.12 65.51 105.24 65.51L105.13 65.12C105.34 65.11 105.54 65.06 105.73 64.95C105.81 64.91 105.9 64.92 105.85 65.06C105.81 65.2 105.88 65.26 106.01 65.28C106.15 65.3 106.23 65.39 106.3 65.5C106.38 65.63 106.43 65.76 106.62 65.78C106.75 65.79 106.76 65.95 106.7 66.03C106.66 66.09 106.77 66.33 106.54 66.19C106.51 66.18 106.44 66.2 106.42 66.22C106.26 66.44 106.2 66.33 106.19 66.15C106.06 66.14 106.12 66.26 106.07 66.28C106 66.31 105.91 66.31 105.93 66.41C105.96 66.51 106.03 66.5 106.13 66.5C106.27 66.48 106.31 66.64 106.4 66.71C106.45 66.74 106.51 66.84 106.55 66.81C106.85 66.6 106.92 66.92 107.06 67.04C107.22 67.17 107.33 67.18 107.49 67.07C107.69 66.91 107.9 66.77 107.93 66.49C107.94 66.41 108.01 66.37 108.06 66.38C108.41 66.41 108.22 66.19 108.19 66.08C108.17 65.99 108.05 65.92 108.19 65.83C108.29 65.76 108.38 65.75 108.45 65.87C108.47 65.89 108.52 65.92 108.54 65.91C108.87 65.76 108.76 66.05 108.76 66.15C108.75 66.33 108.68 66.51 108.65 66.69C108.63 66.75 108.61 66.76 108.56 66.77C108.28 66.86 108.14 67.12 107.97 67.34C107.86 67.46 107.9 67.62 108.07 67.69C108.34 67.79 108.5 67.95 108.46 68.27C108.45 68.42 108.6 68.49 108.72 68.55C108.85 68.6 108.98 68.71 108.87 68.82C108.77 68.93 108.73 69.23 108.46 69.05C108.37 69 108.29 68.98 108.22 69.06C108.17 69.11 108.14 69.17 108.17 69.23C108.22 69.33 108.3 69.33 108.4 69.29C108.53 69.25 108.52 69.37 108.54 69.44C108.58 69.6 108.58 69.77 108.73 69.89C108.8 69.96 108.74 70.01 108.7 70.05C108.63 70.12 108.54 70.17 108.47 70.24C108.41 70.29 108.39 70.36 108.44 70.43C108.49 70.5 108.56 70.51 108.63 70.47C108.78 70.37 108.97 70.36 109.11 70.23C109.13 70.27 109.16 70.29 109.15 70.31C109.02 70.68 109.34 70.74 109.55 70.82C109.74 70.88 109.87 70.71 109.94 70.55C109.98 70.47 109.96 70.35 110.08 70.35C110.19 70.35 110.14 70.47 110.16 70.54C110.26 70.82 110.72 70.97 110.9 70.74C110.99 70.63 111.08 70.61 111.19 70.6C111.35 70.57 111.46 70.49 111.57 70.37C111.7 70.24 111.85 70.12 112 70.37C112.06 70.47 112.15 70.43 112.24 70.4C112.29 70.37 112.36 70.33 112.4 70.42C112.43 70.48 112.39 70.53 112.34 70.55C112.06 70.67 112.14 70.8 112.3 70.97C112.35 71.02 112.46 71.11 112.41 71.19C112.35 71.28 112.23 71.32 112.12 71.28C111.91 71.22 111.77 71.37 111.65 71.49C111.5 71.63 111.69 71.78 111.75 71.85C111.87 72.01 111.88 72.17 111.88 72.34C111.87 72.5 111.88 72.64 112.12 72.56C112.25 72.51 112.32 72.62 112.29 72.75C112.25 72.91 112.36 73.01 112.46 73C112.72 72.97 112.93 73.12 113.13 73.19C113.36 73.27 113.5 73.27 113.68 73.16C113.77 73.12 113.9 73.13 113.91 73.26C113.95 73.5 114.16 73.55 114.3 73.68C114.39 73.76 114.83 73.59 114.92 73.46C114.94 73.43 114.97 73.41 114.99 73.38C115.08 73.43 115 73.57 115.11 73.57C115.24 73.56 115.14 73.38 115.27 73.33C115.36 73.46 115.26 73.73 115.5 73.74C115.79 73.76 115.82 74.03 115.98 74.16C116.28 74.41 116.58 74.64 117.01 74.71C117.27 74.75 117.55 74.63 117.83 74.82C118.05 74.99 118.09 74.94 117.85 75.23C118.17 75.1 118.42 75.12 118.66 75.24C118.76 75.29 118.88 75.32 118.96 75.41C118.99 75.44 119.07 75.45 119.03 75.53C119 75.57 118.96 75.56 118.91 75.56C118.66 75.54 118.45 75.76 118.49 76.02C118.51 76.13 118.54 76.23 118.47 76.33C118.41 76.42 118.37 76.52 118.45 76.59C118.52 76.65 118.65 76.66 118.73 76.61C119.04 76.4 119.31 76.48 119.58 76.66C119.7 76.74 119.81 76.74 119.92 76.62C119.98 76.54 120.1 76.49 120.16 76.41C120.32 76.22 120.46 76.31 120.6 76.43C120.75 76.54 120.71 76.66 120.61 76.8C120.51 76.94 120.46 77.11 120.36 77.26C120.15 77.58 120.45 78.06 120.84 78.03C120.97 78.03 121 78.11 121.08 78.17C121.25 78.29 121.44 78.4 121.47 78.64C121.47 78.67 121.51 78.72 121.53 78.72C121.79 78.66 121.9 78.91 122.09 78.99C122.19 78.92 121.98 78.74 122.19 78.74C122.3 78.74 122.36 78.82 122.37 78.96C122.4 79.2 122.66 79.17 122.82 79.25C123.1 79.4 123.44 79.43 123.54 79.85C123.57 80 123.68 80.16 123.72 80.34C123.76 80.54 123.94 80.6 124.09 80.51C124.25 80.42 124.36 80.49 124.49 80.54C124.59 80.59 124.64 80.65 124.54 80.74C124.38 80.89 124.47 81.04 124.55 81.15C124.65 81.3 124.76 81.16 124.85 81.11C125.04 81 125.15 81.13 125.27 81.24C125.32 81.29 125.36 81.34 125.36 81.4C125.4 81.78 125.63 81.81 125.95 81.74C126.27 81.68 126.72 82.05 126.76 82.38C126.77 82.47 126.78 82.53 126.87 82.57C126.97 82.62 126.98 82.7 126.97 82.82C126.95 83.09 127.08 83.14 127.35 83.2C127.79 83.29 128.25 83.32 128.66 83.53C128.85 83.63 129.03 83.67 129.01 83.93C129 83.97 129.09 84.03 129.14 84.05C129.29 84.13 129.37 84.18 129.3 84.4C129.25 84.56 129.4 84.76 129.52 84.92C129.57 84.97 129.64 85.01 129.67 85.07C129.79 85.35 129.9 85.6 130.29 85.55C130.5 85.52 130.39 85.75 130.43 85.88C130.62 85.74 130.81 85.55 131 85.83C131.18 86.07 131.13 86.29 130.86 86.44C130.95 86.54 131 86.46 131.05 86.44C131.26 86.36 131.27 86.36 131.23 86.58C131.23 86.62 131.23 86.66 131.26 86.68C131.5 86.81 131.65 87.07 131.92 87.16C131.99 87.18 132.1 87.19 132.08 87.31C132.05 87.43 131.96 87.49 131.87 87.48C131.66 87.46 131.62 87.59 131.57 87.74C131.78 87.58 132.07 87.62 132.27 87.43C132.41 87.3 132.52 87.15 132.57 86.99C132.63 86.81 132.67 86.64 132.85 86.53C132.91 86.5 132.91 86.45 132.87 86.39C132.69 86.16 132.85 86.02 133.02 85.88C133.11 85.81 133.21 85.73 133.24 85.61C133.27 85.49 133.34 85.43 133.47 85.44C133.62 85.45 133.74 85.54 133.81 85.66C133.86 85.75 133.85 85.83 133.74 85.91C133.63 86 133.65 86.12 133.78 86.19C133.96 86.29 134.13 86.48 134.35 86.23C134.4 86.18 134.51 86.2 134.51 86.32C134.51 86.48 134.64 86.53 134.75 86.6C134.69 86.76 134.56 86.77 134.39 86.77C134.57 87.03 134.5 87.2 134.3 87.38C134.05 87.59 133.98 87.88 134.05 88.21C134.06 88.23 134.07 88.28 134.07 88.28C133.8 88.41 134 88.66 133.93 88.85C133.89 88.94 133.91 89.06 134.03 89.1C134.25 89.17 134.46 89.33 134.72 89.27C134.88 89.24 134.98 89.32 135.04 89.45C135.11 89.63 135.15 89.82 135.33 89.92C135.38 89.94 135.35 90 135.34 90.04C135.25 90.51 135.35 90.59 135.75 90.87C135.99 91.04 136.11 91.04 136.28 90.86C136.3 90.84 136.35 90.82 136.38 90.82C136.58 90.91 136.78 91.01 137.01 90.93C137.02 90.93 137.05 90.94 137.06 90.95C137.26 91.31 137.6 91.38 137.97 91.44C138.06 91.45 138.37 91.44 138.24 91.74C138.21 91.82 138.3 91.82 138.35 91.85C138.58 91.96 138.84 91.97 139.06 92.1C139.12 92.13 139.21 92.16 139.23 92.22C139.29 92.53 139.59 92.65 139.72 92.89C139.92 93.24 140.26 93.25 140.58 93.35C140.65 93.37 140.75 93.39 140.78 93.33C140.94 93.06 141.24 93.15 141.47 93.06C141.58 93.02 141.7 92.98 141.8 92.89C141.68 93.15 141.75 93.52 141.35 93.59C141.17 93.62 141.18 93.78 141.19 93.89C141.19 94 141.3 94.09 141.41 94.1C141.72 94.14 141.92 94.27 142.07 94.55C142.11 94.64 142.3 94.74 142.45 94.72C142.67 94.69 142.87 94.56 143 94.88C143.07 95.08 143.28 95.25 143.04 95.5C143.3 95.33 143.27 95.78 143.49 95.66C143.51 95.6 143.47 95.59 143.44 95.55C143.37 95.47 143.38 95.35 143.42 95.29C143.45 95.22 143.58 95.26 143.63 95.31C143.73 95.42 143.85 95.36 143.96 95.37C144.24 95.4 144.38 95.65 144.23 95.89C144.1 96.09 144.07 96.25 144.29 96.42C144.46 96.54 144.62 96.69 144.75 96.85C144.91 97.03 145.02 97.25 145.18 97.44C145.31 97.6 145.53 97.7 145.53 97.93C145.69 97.95 145.51 97.71 145.67 97.78C145.86 97.86 146.11 97.56 146.26 97.89C146.33 98.04 146.49 98.16 146.39 98.37C146.36 98.44 146.47 98.49 146.54 98.53C146.86 98.75 147.25 98.78 147.59 98.96C147.68 99.01 147.69 99.02 147.66 99.13C147.55 99.46 147.61 99.57 147.92 99.7C148 99.73 148.07 99.79 148.11 99.86C148.2 100.02 148.34 100.13 148.51 100.2C148.64 100.25 148.75 100.32 148.82 100.45C148.89 100.6 149.06 100.62 149.19 100.68C149.53 100.86 149.81 101.09 149.98 101.45C150.07 101.64 150.27 101.75 150.48 101.78C150.67 101.81 150.85 101.93 150.92 102.05C151.11 102.34 151.38 102.53 151.62 102.75C151.93 103.05 152.16 103.47 152.66 103.56C152.73 103.57 152.82 103.67 152.83 103.74C152.86 104.01 153.07 104.08 153.25 104.2C153.28 103.89 153.32 103.85 153.83 103.76C153.79 103.93 153.53 104.05 153.74 104.27C153.87 104.41 154.01 104.5 154.18 104.59C154.55 104.77 154.85 105.07 155.18 105.31C155.47 105.52 155.71 105.79 156.07 105.88C156.3 105.94 156.31 106.18 156.38 106.35C156.48 106.64 156.75 106.86 157.04 106.82C157.19 106.8 157.01 106.7 157.06 106.64C157.25 106.59 157.38 106.71 157.53 106.79C157.59 106.83 157.63 106.91 157.71 106.9C157.88 106.88 157.92 106.99 157.94 107.12C158.01 107.49 158.14 107.6 158.51 107.66C158.63 107.68 158.73 107.75 158.87 107.71C158.94 107.68 158.99 107.77 158.94 107.83C158.7 108.1 158.94 108.3 159.07 108.45C159.29 108.7 159.53 108.95 159.88 109.06C159.95 109.08 160.01 109.08 160.08 109.05C160.15 109.02 160.23 108.94 160.31 109.06C160.31 109.07 160.38 109.06 160.38 109.06C160.4 108.74 160.74 108.84 160.88 108.69C160.92 108.65 160.93 108.58 161 108.64C161.06 108.68 161.03 108.73 161 108.78C160.86 109.05 160.87 109.08 161.18 109.08C161.31 109.09 161.41 109.15 161.42 109.25C161.44 109.46 161.59 109.58 161.67 109.75C161.82 110.04 162.09 110.08 162.32 109.85C162.4 109.76 162.49 109.72 162.61 109.76C162.8 109.82 162.98 109.92 163.19 109.95C163.31 109.97 163.47 110.5 163.4 110.64C163.29 110.83 163.33 110.98 163.51 111.07C163.77 111.21 163.74 111.53 163.97 111.7C164.24 111.9 164.51 111.89 164.65 111.6C164.75 111.4 164.87 111.56 164.97 111.58C165.05 111.59 165.11 111.69 165.18 111.75C164.89 111.99 164.9 112.27 164.98 112.61C165.05 112.25 165.29 112.31 165.53 112.31C165.68 112.31 165.78 112.22 165.72 112.04C165.61 111.73 165.83 111.47 166.14 111.47C166.42 111.47 166.55 111.7 166.77 111.79C166.89 111.85 166.74 112.1 166.52 112.13C166.46 112.14 166.36 112.08 166.34 112.18C166.3 112.48 166.14 112.34 166 112.29C165.93 112.26 165.83 112.2 165.79 112.32C165.76 112.43 165.85 112.47 165.95 112.49C166.28 112.54 166.41 112.79 166.24 113.06C166.15 113.22 166.31 113.44 166.11 113.58C166.08 113.59 166.14 113.64 166.18 113.67C166.29 113.74 166.36 113.69 166.41 113.61C166.51 113.63 166.36 114.09 166.64 113.72C166.69 113.66 166.78 113.67 166.84 113.72C167.02 113.86 167.19 113.98 167.27 114.24C167.35 114.48 167.52 114.75 167.8 114.88C167.92 114.94 168.02 114.9 168.12 114.81C168.19 114.74 168.21 114.79 168.29 114.85C168.49 115 168.51 115.26 168.79 115.39C169.25 115.6 169.59 116.01 169.82 116.48C169.88 116.62 169.94 116.76 169.98 116.87C169.73 117.06 169.42 117.16 169.31 117.5C169.47 117.36 169.73 117.41 169.86 117.17C169.99 116.96 170.24 117.09 170.35 117.19C170.55 117.4 170.82 117.5 171.05 117.61C171.31 117.73 171.41 117.97 171.62 118.11C171.82 118.25 171.98 118.47 172.23 118.5C172.52 118.54 172.65 118.76 172.67 118.94C172.72 119.32 173.03 119.39 173.26 119.44C173.57 119.51 173.78 119.65 173.93 119.91C174.03 120.09 174.13 120.09 174.26 119.94C174.33 119.87 174.41 119.83 174.5 119.91C174.57 119.97 174.56 120.05 174.51 120.12C174.42 120.23 174.48 120.3 174.56 120.38C174.7 120.51 174.88 120.61 174.89 120.84C174.89 120.87 174.93 120.92 174.95 120.92C175.22 120.95 175.28 121.17 175.38 121.36C175.41 121.41 175.44 121.48 175.51 121.47C175.82 121.44 175.86 121.69 175.94 121.88C176.06 122.13 176.14 122.35 176.51 122.31C176.79 122.28 177.12 122.66 177.12 122.94C177.12 123.06 177.17 123.1 177.28 123.1C177.51 123.12 177.65 123.21 177.64 123.48C177.63 123.62 177.72 123.74 177.87 123.67C178.01 123.61 178.07 123.7 178.15 123.76C178.38 123.92 178.54 124.16 178.76 124.32C178.92 124.44 179.07 124.53 179.27 124.54C179.39 124.56 179.48 124.63 179.54 124.74C179.59 124.82 179.63 124.91 179.73 124.91C179.89 124.92 179.87 125 179.85 125.11C179.81 125.36 180.09 125.61 180.32 125.56C180.36 125.55 180.39 125.53 180.42 125.52C180.49 125.5 180.41 125.31 180.55 125.4C180.66 125.47 180.58 125.57 180.53 125.66C180.52 125.67 180.53 125.69 180.53 125.71C180.83 125.68 181.15 125.88 181.28 126.17C181.36 126.36 181.44 126.52 181.67 126.6C181.84 126.67 182.12 126.78 181.93 127.12C181.84 127.29 182 127.47 182.16 127.56C182.36 127.68 182.44 127.81 182.41 128.09C182.64 127.98 182.73 128.16 182.86 128.28C182.93 128.36 182.96 128.42 182.9 128.52C182.82 128.64 182.85 128.77 182.97 128.81C183.19 128.9 183.39 129.17 183.69 128.9C183.67 129.03 183.69 129.13 183.65 129.18C183.55 129.33 183.49 129.43 183.74 129.44C183.82 129.44 183.8 129.52 183.79 129.57C183.77 129.79 183.89 129.79 184.02 129.7C184.16 129.59 184.25 129.62 184.37 129.71C184.5 129.8 184.64 129.91 184.81 129.9C184.93 129.89 184.96 129.98 184.98 130.07C184.99 130.18 184.89 130.17 184.83 130.19C184.73 130.23 184.6 130.25 184.62 130.4C184.63 130.53 184.77 130.56 184.86 130.57C184.99 130.59 185.03 130.64 185.09 130.75C185.21 130.95 185.45 131.05 185.55 131.28C185.58 131.36 185.66 131.42 185.66 131.53C185.67 131.74 185.99 131.82 186.24 131.66C186.4 131.55 186.54 131.57 186.71 131.65C186.63 131.75 186.56 131.83 186.42 131.77C186.32 131.72 186.24 131.78 186.31 131.88C186.4 132 186.48 132.15 186.61 132.25C186.72 132.33 186.83 132.34 186.94 132.27C187.03 132.21 187.13 132.14 187.17 132.29C187.21 132.43 187.21 132.59 187.04 132.65C186.96 132.68 186.86 132.64 186.75 132.74C187.01 132.77 187.18 132.91 187.36 133.04C187.52 133.14 187.78 133.09 187.94 132.98C188.06 132.9 188.12 132.92 188.15 133C188.22 133.16 188.37 133.25 188.43 133.44C188.47 133.57 188.68 133.73 188.82 133.87C188.9 133.94 188.96 134 188.91 134.1C189.06 134.12 189 133.88 189.17 133.97C189.35 134.07 189.36 134.21 189.32 134.38C189.49 134.36 189.7 134.32 189.51 134.59C189.46 134.66 189.49 134.73 189.52 134.8C189.59 134.95 189.84 134.97 189.84 135.2C189.84 135.23 189.96 135.2 190.01 135.17C190.14 135.09 190.26 135.11 190.3 135.24C190.33 135.37 190.36 135.56 190.18 135.63C190.03 135.68 189.94 135.76 189.89 135.97C190.08 135.82 190.26 135.77 190.37 135.62C190.44 135.53 190.85 135.61 190.93 135.74C191.02 135.89 191.13 136.02 191.28 136.13C191.43 136.22 191.39 136.41 191.31 136.54C191.22 136.7 191.14 136.57 191.05 136.52C190.89 136.43 190.86 136.56 190.85 136.67C190.82 136.9 190.75 136.95 190.57 136.76C190.51 136.7 190.38 136.7 190.31 136.64C190.01 136.39 189.67 136.17 189.57 135.76C189.54 135.67 189.48 135.69 189.43 135.67C189.35 135.63 189.19 135.61 189.32 135.45C189.39 135.34 189.31 135.29 189.22 135.28C188.92 135.26 188.78 135.05 188.63 134.82C188.61 134.79 188.59 134.74 188.55 134.72C188.38 134.66 188.41 134.59 188.52 134.48C188.68 134.32 188.56 134.11 188.56 133.92C188.56 133.89 188.49 133.86 188.44 133.88C188.32 133.92 188.28 134.05 188.29 134.14C188.32 134.43 188.12 134.44 187.93 134.47C187.85 134.48 187.77 134.45 187.69 134.46C187.47 134.48 187.35 134.71 187.46 134.9C187.56 135.08 187.65 135.25 187.86 135.37C188.1 135.52 188.27 135.8 188.42 136.04C188.53 136.23 188.66 136.35 188.84 136.47C189.07 136.62 189.31 136.67 189.56 136.69C189.73 136.7 189.86 136.74 189.9 136.93C189.9 136.94 189.91 136.96 189.93 136.97C190.25 137.18 190.35 137.56 190.58 137.84C190.63 137.89 190.67 137.96 190.73 137.95C190.98 137.89 191.05 138.16 191.25 138.21C191.32 138.23 191.31 138.28 191.28 138.34C191.22 138.5 191.11 138.64 191.43 138.66C191.57 138.66 191.64 138.9 191.73 139.03C192.06 139.53 192.4 140.01 192.89 140.36C193.12 140.53 193.17 140.83 193.42 140.98C193.59 141.07 193.72 141.29 193.96 141.1C194.02 141.05 194.1 141.1 194.15 141.16C194.21 141.23 194.26 141.31 194.2 141.4C194.08 141.57 193.97 141.73 194.2 141.91C194.25 141.95 194.25 142.04 194.23 142.11C194.21 142.23 194.27 142.31 194.38 142.34C194.55 142.39 194.59 142.58 194.71 142.65C194.97 142.82 195 143.18 195.3 143.31C195.51 143.41 195.62 143.59 195.61 143.83C195.59 144.05 195.86 144.3 196.04 144.22C196.32 144.11 196.45 144.28 196.58 144.44C196.75 144.65 196.91 144.86 197.19 144.94C197.24 144.95 197.27 144.98 197.28 145.03C197.29 145.1 197.23 145.13 197.18 145.13C196.75 145.17 196.78 145.55 196.68 145.82C196.64 145.92 196.76 145.99 196.86 146.01C196.96 146.03 197 146.09 197.05 146.17C197.22 146.44 197.26 146.72 197.12 147.01C197.11 147.03 197.12 147.07 197.13 147.08C197.18 147.13 197.23 147.12 197.27 147.07C197.38 146.96 197.48 147.03 197.54 147.12C197.62 147.28 197.72 147.34 197.91 147.16C197.87 147.37 197.85 147.49 197.82 147.62C197.79 147.62 197.77 147.62 197.76 147.61C197.68 147.56 197.65 147.37 197.52 147.46C197.41 147.54 197.51 147.64 197.57 147.74C198.02 148.44 198.46 149.15 198.99 149.8C199.2 150.06 199.34 150.4 199.52 150.69C199.68 150.94 199.61 151.37 200.01 151.47C200.02 151.48 200.04 151.5 200.04 151.51C200.14 151.99 200.55 152.21 200.86 152.51C201.01 152.66 201.04 152.92 201.02 153.05C200.95 153.4 201.17 153.61 201.32 153.84C201.52 154.12 201.7 154.4 201.87 154.7C202.18 155.26 202.5 155.83 202.86 156.37C203 156.59 203.11 156.85 203.22 157.1C203.38 157.48 203.53 157.88 203.81 158.21C203.95 158.37 203.96 158.46 203.73 158.51C203.67 158.53 203.62 158.57 203.62 158.68C203.86 158.55 203.91 158.69 203.98 158.89C204.08 159.18 204.23 159.45 204.46 159.67C204.58 159.79 204.72 159.93 204.44 160.04C204.37 160.07 204.34 160.16 204.38 160.23C204.42 160.32 204.44 160.39 204.39 160.48C204.34 160.55 204.36 160.59 204.45 160.62C204.59 160.66 204.61 160.8 204.6 160.92C204.6 161.11 204.59 161.28 204.74 161.43C204.83 161.52 204.74 161.62 204.64 161.59C204.41 161.54 204.17 161.53 204.02 161.25C203.81 160.85 203.66 160.44 203.5 160.02C203.46 159.92 203.45 159.81 203.33 159.77C203.28 159.75 203.25 159.67 203.23 159.61C203.19 159.47 203.09 159.28 203.02 159.22C202.95 159.16 202.77 159.18 202.87 159C202.89 158.96 202.81 158.94 202.77 158.97C202.67 159.02 202.53 158.85 202.46 159.02C202.43 159.1 202.41 159.17 202.38 159.27C202.25 159.14 202.13 158.98 202.09 158.87C201.97 158.47 201.6 158.3 201.39 157.99C201.31 157.87 201.25 157.77 201.37 157.64C201.39 157.61 201.43 157.57 201.4 157.52C201.36 157.46 201.3 157.49 201.26 157.52C201.1 157.62 201.02 157.52 200.95 157.41C200.87 157.25 200.74 157.36 200.64 157.35C200.53 157.34 200.61 157.48 200.6 157.55C200.56 157.67 200.74 157.84 200.6 157.87C200.43 157.92 200.22 157.75 200.17 157.61C200.08 157.29 199.85 157.06 199.71 156.78C199.64 156.62 199.49 156.56 199.41 156.42C199.37 156.37 199.28 156.35 199.21 156.4C199.14 156.44 199.14 156.51 199.18 156.59C199.23 156.71 199.22 156.85 199.32 156.95C199.37 156.99 199.41 157.09 199.37 157.12C199.14 157.31 199.35 157.44 199.41 157.58C199.55 157.92 199.71 158.25 199.86 158.58C199.99 158.87 200.14 159.15 200.33 159.42C200.43 159.56 200.68 159.68 200.51 159.97C200.43 160.1 200.57 160.29 200.7 160.4C200.76 160.44 200.86 160.47 200.86 160.53C200.84 160.9 201.17 161.06 201.31 161.33C201.34 161.38 201.46 161.45 201.34 161.49C201.23 161.52 201.22 161.7 201.03 161.61C200.71 161.45 200.73 161.12 200.58 160.88C200.38 160.54 200.1 160.29 199.86 159.98C199.85 160.19 199.82 160.37 199.94 160.56C200.06 160.75 200.17 160.97 200.09 161.21C200.07 161.27 200.07 161.32 200.12 161.36C200.51 161.59 200.43 162.1 200.73 162.4C200.78 162.45 200.78 162.59 200.67 162.63C200.58 162.66 200.52 162.58 200.5 162.5C200.42 162.25 200.22 162.09 200.03 161.92C199.96 161.86 199.89 161.74 199.76 161.83C199.65 161.91 199.62 162.02 199.68 162.14C199.7 162.17 199.71 162.21 199.74 162.28C199.5 162.22 199.41 162.12 199.3 161.97C199.03 161.64 198.87 161.23 198.51 160.95C198.37 160.84 198.28 160.71 198.1 160.69C197.99 160.68 198 160.56 197.94 160.49C197.91 160.44 197.86 160.38 197.79 160.41C197.7 160.45 197.72 160.52 197.73 160.59C197.79 160.84 198 160.99 198.1 161.21C198.15 161.3 198.26 161.42 198.16 161.49C198.07 161.55 197.93 161.49 197.85 161.36C197.62 161 197.24 160.75 197.1 160.32C197.09 160.27 197.02 160.22 196.96 160.21C196.69 160.12 196.64 159.77 196.36 159.7C196.27 159.68 196.33 159.6 196.3 159.54C196.26 159.44 196.29 159.29 196.11 159.26C196 159.24 196.03 159.12 196.04 159.05C196.05 158.94 196 158.87 195.92 158.8C195.86 158.75 195.79 158.69 195.71 158.75C195.61 158.83 195.69 158.89 195.74 158.95C195.78 159 195.81 159.06 195.85 159.11C195.92 159.23 195.89 159.3 195.74 159.29C195.5 159.26 195.47 159.35 195.57 159.55C195.61 159.63 195.72 159.77 195.6 159.83C195.49 159.89 195.34 159.84 195.26 159.7C195.23 159.67 195.22 159.61 195.18 159.6C194.93 159.47 194.79 159.26 194.68 159C194.63 158.9 194.55 158.8 194.37 158.77C194.23 158.74 194.04 158.48 194.03 158.27C194.01 158.01 193.72 158 193.66 157.8C193.65 157.77 193.59 157.78 193.56 157.81C193.48 157.87 193.46 157.96 193.49 158.05C193.57 158.29 193.65 158.53 193.77 158.75C193.93 159.04 194.09 159.32 194.11 159.66C194.12 159.71 194.14 159.77 194.13 159.79C193.92 160.01 194.1 160.13 194.23 160.27C194.44 160.49 194.62 160.73 194.7 161.03C194.71 161.09 194.76 161.11 194.81 161.14C194.96 161.2 195.07 161.35 195.08 161.45C195.11 161.82 195.38 162.02 195.56 162.27C195.67 162.43 195.73 162.6 195.75 162.83C195.55 162.67 195.35 162.59 195.22 162.4C194.95 161.99 194.56 161.71 194.2 161.39C194.02 161.24 193.81 161.11 193.79 160.8C193.78 160.7 193.49 160.61 193.31 160.54C193.27 160.52 193.21 160.6 193.22 160.68C193.24 160.77 193.23 160.85 193.19 160.94C192.99 160.91 192.97 160.7 192.84 160.61C192.78 160.57 192.73 160.48 192.65 160.54C192.57 160.61 192.64 160.67 192.69 160.72C192.79 160.82 192.81 160.94 192.81 161.08C192.81 161.42 193.04 161.68 193.19 161.96C193.39 162.31 193.6 162.68 193.93 162.93C193.97 162.96 194 163.01 194 163.05C194.04 163.35 194.21 163.59 194.36 163.84C194.38 163.87 194.4 163.94 194.38 163.97C194.26 164.14 194.27 164.23 194.5 164.25C194.59 164.26 194.59 164.32 194.53 164.38C194.34 164.56 193.95 164.53 193.75 164.4C193.23 164.06 192.94 163.54 192.61 163.05C192.52 162.91 192.4 162.76 192.2 162.8C192.03 162.83 192.19 162.58 192.03 162.62C191.92 162.65 191.8 162.68 191.74 162.57C191.51 162.07 191.06 161.74 190.78 161.29C190.7 161.17 190.57 161.06 190.62 160.88C190.64 160.81 190.59 160.74 190.53 160.73C190.3 160.69 190.21 160.49 190.08 160.34C190.03 160.29 189.99 160.23 189.93 160.25C189.71 160.37 189.62 160.19 189.5 160.08C189.46 160.04 189.4 159.97 189.34 160.02C189.28 160.07 189.32 160.14 189.35 160.19C189.62 160.65 189.87 161.13 190.17 161.58C190.3 161.78 190.42 162.01 190.55 162.22C190.58 162.26 190.6 162.31 190.57 162.34C190.52 162.38 190.46 162.36 190.42 162.32C190.39 162.28 190.36 162.23 190.32 162.2C190.1 162 190.05 161.88 189.82 162.2C189.75 162.3 189.7 162.3 189.66 162.19C189.49 161.76 189.22 161.41 188.89 161.09C188.84 161.04 188.81 160.96 188.72 161.01C188.49 161.13 188.38 160.96 188.25 160.83C187.89 160.47 187.61 160.04 187.26 159.67C186.82 159.2 186.39 158.71 185.98 158.21C185.8 157.98 185.61 157.76 185.45 157.52C185.36 157.39 185.22 157.22 185.01 157.26C184.98 157.26 184.94 157.26 184.93 157.25C184.83 156.97 184.51 157.08 184.34 156.92C184.2 156.78 184.14 156.6 183.97 156.47C183.69 156.27 183.44 156.02 183.19 155.78C183.1 155.69 182.98 155.58 182.96 155.46C182.91 155.15 182.65 155.26 182.5 155.21C182.39 155.18 182.41 155.32 182.48 155.37C182.6 155.46 182.63 155.59 182.66 155.72C182.68 155.83 182.63 155.9 182.55 155.95C182.44 156.01 182.42 155.9 182.36 155.86C181.85 155.54 181.76 154.9 181.34 154.52C181.04 154.24 180.82 153.86 180.44 153.65C180.3 153.58 180.18 153.57 180.05 153.64C179.82 153.75 179.7 153.67 179.63 153.44C179.58 153.3 179.5 153.23 179.35 153.36C179.14 153.53 178.97 153.48 178.87 153.24C178.82 153.14 178.72 153.14 178.66 153.08C178.6 153.03 178.53 153 178.49 152.94C178.27 152.6 177.95 152.33 177.75 151.96C177.65 151.78 177.4 151.72 177.26 151.56C177.1 151.38 176.88 151.39 176.66 151.49C176.54 151.55 176.48 151.51 176.53 151.35C176.57 151.19 176.27 150.6 176.13 150.54C176.06 150.51 175.98 150.52 175.92 150.57C175.85 150.63 175.77 150.65 175.67 150.63C175.59 150.61 175.46 150.63 175.44 150.54C175.41 150.43 175.57 150.44 175.62 150.38C175.69 150.31 175.91 150.36 175.85 150.23C175.81 150.12 175.62 149.98 175.49 150.02C175.27 150.09 175.09 149.96 174.87 149.97C174.9 150.09 174.93 150.22 174.96 150.36C174.73 150.31 174.58 150.21 174.57 149.98C174.56 149.85 174.53 149.79 174.4 149.75C174.25 149.71 174.05 149.63 174.09 149.48C174.13 149.34 174.05 149.07 174.38 149.06C174.51 149.06 174.39 148.88 174.34 148.84C174.09 148.65 173.84 148.42 173.51 148.65C173.19 148.87 173.17 148.61 173.08 148.42C173.26 148.58 173.42 148.58 173.55 148.37C173.63 148.24 173.54 147.89 173.36 147.82C173.2 147.75 173.08 147.63 172.94 147.55C172.82 147.48 172.71 147.43 172.6 147.55C172.5 147.66 172.61 147.77 172.63 147.87C172.64 147.91 172.69 147.94 172.72 147.97C172.76 148.03 172.82 148.11 172.77 148.16C172.71 148.23 172.64 148.15 172.58 148.12C172.34 147.99 172.08 148 171.82 147.96C171.79 147.95 171.73 147.96 171.72 147.98C171.62 148.27 171.33 148.39 171.13 148.56C170.94 148.71 170.79 148.86 170.69 149.08C170.65 149.17 170.52 149.23 170.38 149.22C170.48 148.89 170.5 148.49 170.71 148.28C170.91 148.06 170.98 147.82 171.13 147.6C171.22 147.46 171.28 147.36 171.15 147.23C171.03 147.1 170.95 147.23 170.86 147.29C170.67 147.39 170.48 147.48 170.41 147.72C170.38 147.81 170.27 147.79 170.19 147.79C170.11 147.79 170.1 147.73 170.09 147.66C170.08 147.6 170.05 147.53 170.01 147.5C169.93 147.44 169.77 147.4 169.79 147.29C169.83 147.16 169.93 147.01 170.04 146.95C170.26 146.84 170.29 146.62 170.4 146.44C170.44 146.39 170.44 146.32 170.38 146.3C170.22 146.23 170.16 146.04 170.01 145.97C169.86 145.91 169.75 145.89 169.87 145.67C169.92 145.56 169.75 145.51 169.64 145.54C169.37 145.61 169.12 145.73 168.83 145.61C168.74 145.57 168.68 145.66 168.68 145.75C168.66 146.02 168.43 146.13 168.26 146.28C168.16 146.37 168.02 146.35 167.96 146.24C167.9 146.12 167.99 146.05 168.11 146C168.4 145.88 168.58 145.55 168.55 145.25C168.53 145.08 168.34 145 168.18 145.11C168.08 145.17 167.99 145.25 167.91 145.32C167.88 145.35 167.86 145.38 167.83 145.4C167.64 145.59 167.38 145.64 167.14 145.73C167.09 145.75 167.01 145.79 166.99 145.69C166.98 145.61 166.98 145.54 167.08 145.52C167.16 145.5 167.23 145.46 167.28 145.39C167.34 145.31 167.4 145.24 167.26 145.19C167.05 145.12 167.14 145 167.22 144.9C167.3 144.8 167.36 144.68 167.41 144.56C167.49 144.37 167.4 144.26 167.28 144.24C167.01 144.19 166.82 143.84 166.49 144.02C166.46 144.04 166.42 144 166.42 143.96C166.43 143.89 166.45 143.83 166.51 143.78C166.73 143.58 166.73 143.48 166.53 143.33C166.44 143.25 166.37 143.22 166.28 143.33C166.22 143.4 166.13 143.42 166.04 143.42C165.99 143.42 165.92 143.43 165.9 143.37C165.88 143.31 165.93 143.25 165.98 143.24C166.07 143.22 166.07 143.09 166.21 143.1C166.34 143.12 166.23 143 166.24 142.95C166.27 142.75 166.12 142.7 165.99 142.65C165.87 142.6 165.85 142.72 165.8 142.81C165.73 142.93 165.56 142.87 165.46 142.84C165.25 142.78 165.02 142.6 164.98 143.01C164.97 143.06 164.9 143.07 164.86 143.06C164.71 143.02 164.59 143.07 164.46 143.22C164.42 143.03 164.47 142.95 164.58 142.87C164.74 142.76 164.75 142.25 164.61 142.12C164.57 142.08 164.51 142.07 164.47 142.11C164.32 142.26 164.18 142.41 164.3 142.63C164.37 142.76 164.32 142.78 164.21 142.8C164.08 142.82 164 142.86 163.95 143.01C163.91 143.15 163.73 143.23 163.58 143.2C163.42 143.16 163.36 143.24 163.31 143.34C163.25 143.46 163.18 143.55 163.07 143.62C162.95 143.68 162.92 143.77 163 143.88C163.1 144 163.07 144.14 163.03 144.27C162.92 144.55 162.96 144.65 163.25 144.79C163.37 144.85 163.49 144.89 163.55 145.03C163.62 145.2 163.49 145.39 163.31 145.38C163.23 145.38 163.18 145.41 163.12 145.45C163 145.54 162.88 145.54 162.8 145.4C162.76 145.32 162.72 145.28 162.63 145.31C162.56 145.34 162.53 145.4 162.52 145.48C162.47 145.77 162.4 145.81 162.08 145.75C162.01 145.73 161.95 145.71 161.9 145.8C161.84 145.88 161.76 145.91 161.67 145.86C161.63 145.83 161.59 145.82 161.55 145.87C161.53 145.9 161.61 146.02 161.48 145.97C161.39 145.92 161.42 145.83 161.45 145.75C161.48 145.69 161.56 145.68 161.62 145.68C162.01 145.63 162.11 145.29 162.26 145.01C162.3 144.95 162.31 144.84 162.28 144.75C162.17 144.44 162.24 144.25 162.51 144.09C162.6 144.04 162.68 143.98 162.71 143.88C162.74 143.79 162.8 143.69 162.71 143.6C162.62 143.51 162.54 143.62 162.46 143.62C162.18 143.6 162.02 143.81 161.8 143.92C161.73 143.96 161.63 143.99 161.58 143.91C161.52 143.82 161.63 143.79 161.68 143.73C161.89 143.47 162.25 143.42 162.47 143.17C162.85 143.27 162.92 142.88 163.15 142.74C163.17 142.73 163.2 142.72 163.22 142.7C163.3 142.61 163.44 142.54 163.42 142.4C163.39 142.24 163.24 142.25 163.11 142.24C163.05 142.23 162.97 142.23 162.98 142.14C163.04 141.75 162.72 141.63 162.49 141.43C162.34 141.3 162.22 141.47 162.06 141.43C161.85 141.38 161.8 141.26 161.81 141.09C161.82 140.94 161.83 140.84 161.63 140.92C161.56 140.95 161.45 140.95 161.41 140.88C161.38 140.82 161.42 140.74 161.48 140.69C161.62 140.56 161.59 140.47 161.43 140.39C161.37 140.36 161.3 140.3 161.34 140.21C161.37 140.16 161.41 140.09 161.48 140.1C161.6 140.11 161.47 140.25 161.56 140.29C161.67 140.26 161.61 140.15 161.65 140.09C161.72 139.98 161.64 139.92 161.55 139.97C161.43 140.03 161.31 139.99 161.18 140.08C161.04 140.17 160.93 139.96 160.85 139.85C160.72 139.67 160.55 139.53 160.37 139.42C160.29 139.37 160.17 139.37 160.12 139.25C160.1 139.2 160.02 139.17 159.98 139.21C159.8 139.4 159.68 139.21 159.56 139.14C159.45 139.09 159.37 138.99 159.24 139.02C159.18 139.04 159.15 139.02 159.18 138.96C159.24 138.83 159.15 138.77 159.06 138.73C158.96 138.68 158.89 138.76 158.83 138.83C158.71 138.97 158.52 139.03 158.37 139.15C158.25 139.24 158.03 139.08 157.89 139.25C157.87 139.23 157.84 139.21 157.83 139.18C157.8 139.13 157.83 139.08 157.87 139.06C157.96 139.02 158.02 138.9 158.15 138.93C158.21 138.95 158.27 138.92 158.26 138.86C158.21 138.61 158.42 138.67 158.53 138.65C158.81 138.6 158.88 138.48 158.76 138.21C158.74 138.18 158.73 138.13 158.69 138.14C158.39 138.22 158.34 137.94 158.17 137.82C157.95 137.68 157.87 137.38 157.56 137.33C157.4 137.3 157.3 137.06 157.12 136.97C156.89 136.85 156.71 136.71 156.73 136.4C156.75 136.21 156.51 136.29 156.42 136.19C156.33 136.09 156.25 136.01 156.17 136.23C156.13 136.34 156.04 136.19 155.96 136.16C155.73 136.08 155.54 135.98 155.55 135.68C155.55 135.59 155.55 135.24 155.26 135.51C155.21 135.56 155.17 135.51 155.14 135.47C155.09 135.41 155.08 135.35 155.14 135.3C155.18 135.27 155.23 135.24 155.27 135.21C155.32 135.16 155.4 135.11 155.34 135.03C155.28 134.94 155.22 135.01 155.17 135.06C155.11 135.12 155.06 135.14 154.99 135.06C154.96 135.01 154.9 135.01 154.85 135.03C154.56 135.15 154.33 134.93 154.07 134.91C153.97 134.9 153.91 134.79 153.85 134.69C153.8 134.58 153.8 134.4 153.57 134.43C153.44 134.45 153.51 134.25 153.45 134.17C153.42 134.13 153.39 134.06 153.4 134.02C153.52 133.62 153.24 133.46 152.96 133.3C152.88 133.24 152.81 133.29 152.73 133.3C152.65 133.31 152.55 133.31 152.53 133.21C152.52 133.13 152.44 133 152.56 132.95C152.61 132.92 152.73 132.81 152.79 132.98C152.81 133.03 152.86 133.02 152.9 132.99C152.94 132.95 152.97 132.9 152.94 132.87C152.65 132.64 152.82 132.39 152.92 132.15C152.92 132.14 152.91 132.12 152.9 132.1C152.81 132.06 152.76 132.17 152.68 132.17C152.39 132.19 152.27 132.02 152.4 131.71C152.49 131.49 152.32 131.41 152.23 131.29C152.15 131.17 152.04 131.3 151.94 131.32C151.86 131.34 151.84 131.43 151.85 131.52C151.87 131.6 151.91 131.65 152 131.65C152.08 131.65 152.19 131.65 152.21 131.73C152.23 131.81 152.3 131.9 152.24 131.98C152.18 132.06 152.08 132.05 152.02 132.03C151.88 131.99 151.67 132.02 151.67 131.78C151.42 131.82 151.32 131.49 151.1 131.53C150.97 131.54 150.95 131.52 150.91 131.42C150.85 131.24 150.79 131.04 150.52 131.07C150.46 131.07 150.37 130.99 150.4 130.89C150.44 130.77 150.53 130.85 150.6 130.86C150.66 130.87 150.71 130.95 150.78 130.86C150.68 130.72 150.5 130.7 150.36 130.61C150.26 130.54 150.19 130.47 150.13 130.36C150.06 130.25 150.09 129.98 149.82 130.15C149.68 129.92 149.39 130 149.21 129.86C149.16 129.83 149.13 129.76 149.05 129.82C149 129.86 148.99 129.92 149 129.99C149.02 130.22 149.17 130.35 149.37 130.49C149.03 130.61 149.07 130.76 149.29 130.94C149.42 131.04 149.26 131.18 149.32 131.32C149.39 131.49 149.22 131.5 149.1 131.53C149.04 131.54 148.98 131.58 148.92 131.6C148.93 131.4 148.87 131.34 148.56 131.25C148.63 131.39 148.74 131.47 148.61 131.64C148.47 131.82 148.35 131.88 148.18 131.71C148.18 131.71 148.17 131.7 148.16 131.7C148.14 131.69 148.11 131.68 148.09 131.69C147.76 131.79 147.41 131.48 147.09 131.75C146.94 131.88 146.91 132.09 147.08 132.21C147.17 132.27 147.22 132.37 147.3 132.43C147.34 132.46 147.41 132.48 147.36 132.55C147.32 132.61 147.24 132.63 147.19 132.58C146.97 132.38 146.6 132.35 146.45 132.04C146.43 131.98 146.38 131.93 146.32 131.91C145.9 131.76 145.65 131.38 145.29 131.13C145.23 131.09 145.19 131.01 145.15 130.94C145.12 130.87 145.1 130.78 145.17 130.75C145.26 130.7 145.28 130.79 145.3 130.86C145.36 131.04 145.51 131.07 145.67 131.07C145.92 131.08 146.02 131.18 146 131.42C145.99 131.51 145.98 131.55 146.08 131.52C146.16 131.5 146.21 131.52 146.19 131.61C146.17 131.73 146.22 131.7 146.31 131.7C146.46 131.69 146.61 131.69 146.76 131.67C146.93 131.65 147.19 131.38 147.2 131.2C147.21 131.11 147.15 130.98 147.38 131.01C147.53 131.03 147.7 130.93 147.89 130.99C148 131.02 148.19 130.88 148.22 130.72C148.25 130.56 148.09 130.49 147.98 130.43C147.87 130.35 147.73 130.36 147.73 130.14C147.74 130.04 147.64 129.87 147.41 129.95C147.18 130.03 147.12 129.76 147.02 129.62C146.98 129.56 146.96 129.51 146.88 129.49C146.65 129.44 146.51 129.19 146.75 128.96C146.85 128.86 146.93 128.8 146.82 128.68C146.74 128.58 146.64 128.47 146.48 128.55C146.42 128.58 146.35 128.62 146.29 128.55C146.22 128.48 146.27 128.4 146.33 128.34C146.42 128.23 146.39 128.05 146.55 127.96C146.6 127.93 146.6 127.75 146.57 127.66C146.48 127.32 145.97 127.1 145.66 127.24C145.6 127.27 145.52 127.38 145.44 127.25C145.35 127.12 145.47 127.11 145.51 127.04C145.57 126.95 145.63 126.9 145.73 126.87C145.81 126.84 145.9 126.76 145.82 126.66C145.75 126.56 145.68 126.61 145.62 126.68C145.5 126.78 145.4 126.79 145.27 126.67C145.13 126.53 145.01 126.63 144.91 126.75C144.8 126.88 144.69 126.99 144.49 126.99C144.4 126.98 144.39 127.04 144.39 126.9C144.39 126.73 144.22 126.82 144.15 126.87C143.89 127.06 143.56 127.1 143.28 127.24C143.12 127.32 143 127.41 142.89 127.54C142.75 127.68 142.64 127.87 142.44 127.84C142.76 127.48 143.1 127.1 143.44 126.73C143.5 126.67 143.57 126.64 143.53 126.54C143.48 126.41 143.53 126.3 143.6 126.19C143.7 126.04 143.74 125.87 143.66 125.71C143.59 125.56 143.54 125.31 143.22 125.52C143.29 125.31 143.38 125.17 143.25 125C143.13 124.85 143.11 124.61 142.89 124.92C142.81 125.04 142.71 124.95 142.66 124.86C142.61 124.77 142.55 124.71 142.45 124.74C142.41 124.75 142.37 124.75 142.35 124.77C142.32 124.82 142.36 124.86 142.4 124.88C142.71 125.05 142.45 125.14 142.35 125.29C142.24 125.07 142.08 124.92 142.24 124.67C142.31 124.56 142.02 124.2 141.86 124.21C141.66 124.23 141.48 124.2 141.31 124.08C141.28 124.06 141.24 124.04 141.23 124.01C141.11 123.42 141 123.98 140.95 124.03C140.77 124.25 140.78 124.26 140.66 124.01C140.62 123.91 140.51 123.87 140.42 123.86C140.28 123.84 140.19 123.77 140.11 123.68C139.98 123.53 139.88 123.43 139.64 123.51C139.49 123.56 139.42 123.31 139.34 123.19C139.27 123.11 139.21 123.04 139.12 123.02C138.91 122.96 138.99 122.83 139.08 122.76C139.19 122.68 139.3 122.57 139.46 122.59C139.51 122.6 139.58 122.59 139.58 122.52C139.58 122.47 139.53 122.44 139.49 122.44C139.33 122.44 139.31 122.35 139.33 122.23C139.35 122.12 139.29 122.01 139.2 122.06C139.03 122.14 138.95 122.04 138.85 121.96C138.66 121.83 138.61 121.83 138.33 121.94C138.32 121.84 138.37 121.73 138.27 121.66C138.16 121.58 138.08 121.64 137.99 121.67C137.95 121.68 137.89 121.73 137.88 121.66C137.85 121.4 137.61 121.3 137.47 121.12C137.67 121.18 137.82 121.18 137.85 120.93C137.86 120.86 137.75 120.73 137.92 120.73C138.1 120.74 137.99 120.89 138.01 121C138.14 120.97 138.27 120.89 138.37 121.08C138.41 121.16 138.7 120.97 138.71 120.85C138.71 120.79 138.79 120.74 138.73 120.66C138.59 120.72 138.51 120.74 138.42 120.53C138.37 120.4 138.29 120.09 137.99 120.12C137.93 120.12 137.85 120.07 137.87 120.01C137.89 119.89 137.86 119.85 137.75 119.82C137.7 119.81 137.62 119.72 137.66 119.65C137.77 119.45 137.61 119.43 137.5 119.41C137.21 119.36 136.92 119.32 136.64 119.28C136.53 119.27 136.19 118.89 136.2 118.79C136.21 118.69 136.29 118.64 136.39 118.64C136.48 118.64 136.53 118.62 136.53 118.52C136.53 118.42 136.48 118.4 136.38 118.38C136.28 118.37 136.17 118.37 136.1 118.26C136.06 118.21 135.99 118.11 135.93 118.17C135.85 118.24 135.93 118.32 135.98 118.38C136 118.39 136.02 118.41 136.03 118.43C135.95 118.58 135.82 118.26 135.76 118.46C135.73 118.56 135.72 118.67 135.71 118.77C135.85 118.8 135.87 118.63 135.98 118.62C136.07 118.92 136.02 119 135.76 119C135.75 119.07 135.8 119.1 135.86 119.1C135.96 119.1 136.01 119.14 135.94 119.23C135.9 119.28 135.96 119.45 135.79 119.37C135.77 119.36 135.74 119.35 135.72 119.35C135.5 119.41 135.31 119.48 135.47 119.11C135.5 119.05 135.23 118.88 135.04 118.88C134.99 118.88 134.89 118.95 134.9 118.85C134.93 118.58 134.71 118.77 134.65 118.66C134.61 118.8 134.73 118.82 134.78 118.91C134.57 118.94 134.36 118.95 134.38 119.22C134.39 119.29 134.39 119.37 134.48 119.39C134.72 119.42 134.92 119.65 134.92 119.88C134.91 119.94 134.9 120 134.83 120.02C134.77 120.04 134.7 120 134.7 119.95C134.63 119.62 134.38 119.74 134.19 119.75C134.11 119.76 134.06 119.82 134.08 119.69C134.08 119.67 134.06 119.66 134.05 119.64C133.92 119.89 133.7 119.53 133.56 119.7C133.5 119.76 133.38 119.78 133.39 119.7C133.41 119.42 133.19 119.28 133.09 119.07C133.05 119 133.03 118.91 133.13 118.86C133.33 118.75 133.19 118.59 133.13 118.52C133.03 118.42 132.88 118.29 132.7 118.41C132.57 118.49 132.54 118.6 132.63 118.75C132.73 118.92 132.65 119.04 132.46 119.04C132.4 119.04 132.39 118.99 132.36 118.96C132.33 118.92 132.31 118.85 132.36 118.84C132.62 118.79 132.43 118.66 132.4 118.58C132.36 118.44 132.3 118.3 132.45 118.19C132.51 118.14 132.63 118.07 132.54 117.98C132.46 117.91 132.32 117.91 132.22 117.98C132.18 118.01 132.17 118.06 132.14 118.1C131.99 117.9 131.99 117.9 131.65 118.13C131.56 118.03 131.7 117.89 131.56 117.8C131.45 117.72 131.35 117.68 131.22 117.72C131.23 117.61 131.25 117.53 131.25 117.44C131.27 117.29 131.21 117.26 131.06 117.3C130.71 117.4 130.57 117.29 130.47 116.92C130.43 116.79 130.32 116.68 130.39 116.51C130.42 116.46 130.31 116.37 130.25 116.46C130.09 116.67 129.85 116.41 129.7 116.58C129.68 116.3 129.4 116.2 129.3 116C129.23 115.89 129.2 115.84 129.08 115.84C129.03 115.84 128.97 115.85 128.92 115.83C128.84 115.81 128.74 115.74 128.68 115.85C128.62 115.95 128.62 116.12 128.71 116.17C128.87 116.28 128.94 116.49 129.22 116.57C128.84 116.64 128.92 116.94 128.76 117.19C129.09 116.94 129.31 117.35 129.59 117.22C129.62 117.36 129.67 117.47 129.84 117.35C129.87 117.48 129.69 117.57 129.77 117.61C129.89 117.67 130 117.77 130.14 117.8C130.21 117.82 130.24 117.75 130.19 117.68C130.17 117.62 130.07 117.64 130.07 117.56C130.11 117.5 130.17 117.52 130.2 117.56C130.36 117.71 130.54 117.83 130.75 117.88C130.8 117.9 130.87 117.93 130.88 117.97C130.93 118.21 131.13 118.28 131.29 118.4C131.35 118.43 131.46 118.45 131.43 118.56C131.41 118.64 131.33 118.65 131.26 118.66C131.19 118.67 131.12 118.7 131.05 118.73C130.75 118.85 130.42 118.64 130.42 118.31C130.42 118.23 130.46 118.16 130.33 118.19C129.9 118.29 129.71 118.01 129.59 117.67C129.54 117.54 129.51 117.48 129.38 117.57C129.23 117.67 129.15 117.63 129.12 117.45C129.11 117.32 129.05 117.22 128.89 117.28C128.81 117.3 128.72 117.29 128.69 117.23C128.55 117.01 128.31 116.97 128.11 116.9C127.87 116.81 127.85 116.59 127.74 116.44C127.68 116.37 127.71 116.29 127.57 116.31C127.36 116.34 127.24 116.11 127.13 116.01C126.82 115.71 126.44 115.48 126.14 115.17C125.97 115 125.83 114.79 125.6 114.72C125.39 114.66 125.2 114.57 125.01 114.48C124.91 114.44 124.84 114.38 124.83 114.27C124.81 114.05 124.67 113.95 124.47 113.94C124.24 113.93 124.18 113.84 124.33 113.61C124.1 113.62 123.86 113.69 123.9 113.35C123.9 113.33 123.86 113.29 123.86 113.29C123.63 113.35 123.56 113.19 123.49 113.04C123.48 113.02 123.43 112.99 123.43 113C123.23 113.17 123.24 112.94 123.15 112.87C123.02 112.77 122.95 112.63 122.79 112.56C122.55 112.46 122.37 112.32 122.45 112.01C122.24 112.1 122 111.99 121.88 111.81C121.68 111.53 121.44 111.23 121.1 111.2C120.91 111.18 120.8 111.07 120.65 111.01C120.55 110.98 120.49 110.73 120.45 110.58C120.4 110.4 120.24 110.32 120.14 110.32C119.75 110.31 119.59 109.96 119.31 109.81C119.27 109.78 119.24 109.74 119.27 109.69C119.3 109.63 119.35 109.63 119.41 109.66C119.45 109.68 119.48 109.74 119.55 109.7C119.54 109.57 119.57 109.36 119.5 109.33C119.34 109.24 119.33 109.47 119.22 109.54C119.03 109.66 118.89 109.51 118.76 109.46C118.51 109.36 118.27 109.24 118.05 109.07C117.93 108.97 117.79 108.92 117.64 108.89C117.52 108.87 117.46 108.77 117.47 108.68C117.49 108.56 117.55 108.43 117.61 108.33C117.63 108.29 117.68 108.43 117.78 108.37C117.73 108.18 117.64 108.02 117.48 107.89C117.39 107.82 117.3 107.76 117.22 107.9C117.19 107.95 117.11 108 117.1 107.94C117.02 107.72 116.89 107.76 116.74 107.84C116.72 107.85 116.66 107.8 116.63 107.77C116.42 107.54 116.17 107.34 115.85 107.33C115.57 107.31 115.54 107.06 115.39 106.93C115.13 106.71 114.88 106.48 114.57 106.32C114.51 106.29 114.45 106.25 114.4 106.2C114.33 106.15 114.28 106.08 114.31 105.99C114.34 105.91 114.41 105.91 114.49 105.9C114.59 105.89 114.71 105.93 114.7 106C114.69 106.18 114.77 106.17 114.9 106.14C114.95 106.12 115.01 106.13 115.05 106.17C115.14 106.24 115.24 106.28 115.27 106.12C115.29 106.01 115.31 105.86 115.12 105.83C115.06 105.83 115 105.8 114.94 105.82C114.84 105.84 114.78 105.86 114.8 105.72C114.82 105.59 114.67 105.57 114.62 105.48C114.61 105.47 114.55 105.47 114.52 105.49C114.48 105.5 114.47 105.55 114.5 105.58C114.68 105.72 114.47 105.77 114.42 105.77C114.28 105.77 114.2 105.83 114.14 105.95C114.1 106.01 114.04 106.06 113.96 106.01C113.89 105.97 113.87 105.9 113.9 105.82C114.01 105.57 114.1 105.3 114.23 105.05C114.3 104.92 114.24 104.85 114.15 104.87C113.92 104.91 113.79 104.7 113.58 104.69C113.46 104.69 113.43 104.55 113.49 104.43C113.53 104.36 113.51 104.3 113.44 104.28C113.32 104.24 113.24 104.33 113.16 104.4C113.12 104.45 113.15 104.53 113.21 104.56C113.47 104.65 113.36 105.01 113.62 105.11C113.64 105.11 113.52 105.32 113.4 105.33C113.36 105.33 113.16 105.46 113.19 105.21C113.2 105.06 113.1 105 112.93 105.03C112.71 105.08 112.19 104.81 112.08 104.61C112 104.46 111.9 104.31 111.73 104.22C111.43 104.07 111.28 103.8 111.28 103.46C111.28 103.31 111.24 103.29 111.11 103.34C110.95 103.4 110.79 103.45 110.63 103.49C110.5 103.53 110.4 103.51 110.45 103.32C110.49 103.18 110.43 103.1 110.26 103.14C110.07 103.18 109.92 103.04 109.91 102.92C109.89 102.75 109.84 102.66 109.7 102.59C109.38 102.42 109.65 102.14 109.59 101.93C109.58 101.89 109.62 101.85 109.61 101.82C109.58 101.73 109.62 101.58 109.49 101.55C109.4 101.52 109.33 101.61 109.26 101.67C109.16 101.77 109.22 101.87 109.27 101.96C109.31 102.04 109.41 102.08 109.42 102.2C109.14 102.2 108.99 102.01 108.82 101.85C108.72 101.76 108.64 101.65 108.48 101.71C108.43 101.72 108.35 101.72 108.33 101.66C108.25 101.41 108.05 101.34 107.82 101.32C107.79 101.32 107.74 101.32 107.74 101.31C107.61 100.9 107.07 101.1 106.9 100.72C106.77 100.43 106.44 100.26 106.46 99.89C106.47 99.85 106.47 99.81 106.43 99.8C106.37 99.78 106.32 99.83 106.33 99.87C106.36 100.09 106.2 100.03 106.08 100.04C105.96 100.06 105.84 100.07 105.71 100.08C105.74 99.88 105.43 99.38 105.22 99.29C105.11 99.24 105 99.23 105.05 99.06C105.09 98.93 105 98.87 104.87 98.96C104.82 98.99 104.74 99.05 104.71 98.99C104.56 98.7 104.1 98.8 104 98.41C103.97 98.27 103.73 98.2 103.59 98.09C103.47 98 103.29 97.96 103.47 97.72C103.56 97.6 103.52 97.37 103.53 97.19C103.53 97.14 103.48 97.11 103.43 97.11C103.37 97.12 103.3 97.13 103.28 97.2C103.25 97.27 103.2 97.36 103.26 97.43C103.42 97.59 103.34 97.66 103.19 97.76C103.07 97.84 103.01 97.87 102.97 97.71C102.95 97.64 102.9 97.6 102.83 97.6C102.65 97.59 102.61 97.45 102.61 97.32C102.6 97.22 102.63 97.08 102.51 97.1C102.36 97.13 102.54 97.26 102.49 97.36C102.39 97.39 102.29 97.28 102.19 97.34C102.12 97.38 102.1 97.33 102.07 97.27C102 97.1 101.95 96.87 101.67 96.98C101.55 96.78 101.27 96.74 101.18 96.52C101.14 96.43 101.11 96.39 101.02 96.38C100.92 96.37 100.88 96.28 100.86 96.18C100.85 96.12 100.89 96.1 100.94 96.09C101.03 96.07 101.12 96.08 101.21 96.15C101.29 96.2 101.26 96.42 101.42 96.31C101.53 96.24 101.47 96.09 101.43 95.97C101.39 95.85 101.25 95.82 101.21 95.69C101.2 95.62 101.01 95.51 100.93 95.74C100.79 96.1 100.59 96.11 100.34 95.81C100.29 95.76 100.23 95.71 100.15 95.74C99.96 95.81 99.8 95.8 99.78 95.54C99.77 95.52 99.75 95.49 99.73 95.48C99.53 95.33 99.5 95.14 99.57 94.88C99.36 95.24 99.19 95.03 99 94.9C98.9 94.84 98.8 94.78 98.69 94.75C98.56 94.72 98.49 94.7 98.51 94.53C98.53 94.37 98.35 94.29 98.21 94.22C97.93 94.07 97.64 93.92 97.44 93.65C97.44 93.65 97.43 93.64 97.42 93.64C97.18 93.73 97.06 93.55 96.91 93.43C96.74 93.29 96.49 93.3 96.41 93.02C96.36 92.86 96.12 92.89 95.98 92.89C95.69 92.87 95.54 92.78 95.42 92.5C95.33 92.3 95.21 92.05 94.9 92.03C94.74 92.02 94.72 91.78 94.54 91.73C94.4 91.69 94.29 91.57 94.11 91.63C94 91.67 93.92 91.59 93.97 91.46C94.02 91.31 93.94 91.25 93.82 91.24C93.71 91.22 93.65 91.15 93.59 91.07C93.54 91.01 93.49 90.94 93.42 91C93.24 91.15 93.2 91.04 93.15 90.89C93.08 90.7 92.93 90.62 92.74 90.54C92.52 90.45 92.29 90.44 92.08 90.34C92.03 90.32 91.99 90.32 91.95 90.36C91.72 90.57 91.65 90.32 91.56 90.2C91.35 89.94 91.47 89.64 91.49 89.35C91.49 89.28 91.56 89.18 91.45 89.14C91.36 89.1 91.34 89.25 91.32 89.25C91.18 89.26 91.09 89.34 90.98 89.43C90.72 89.65 90.71 89.92 91.02 90.05C91.23 90.14 91.33 90.25 91.3 90.48C91.28 90.62 91.34 90.66 91.47 90.59C91.56 90.55 91.66 90.51 91.73 90.63C91.78 90.73 91.83 90.83 91.72 90.94C91.64 91.02 91.61 91.06 91.52 90.95C91.31 90.69 91.01 90.52 90.88 90.16C90.78 89.9 90.42 90.02 90.18 89.99C90.03 89.97 89.92 89.98 89.82 89.84C89.68 89.64 89.5 89.75 89.33 89.81C89.28 89.83 89.25 89.92 89.3 89.94C89.44 89.99 89.27 90.24 89.48 90.22C89.64 90.2 89.74 90.25 89.7 90.41C89.67 90.56 89.69 90.7 89.79 90.88C89.54 90.81 89.46 90.53 89.22 90.64C89.19 90.58 89.23 90.56 89.25 90.54C89.31 90.45 89.31 90.33 89.24 90.3C89.14 90.25 89.09 90.36 89.07 90.45C89.06 90.54 89.05 90.63 88.95 90.62C88.82 90.6 88.95 90.49 88.91 90.45C88.77 90.29 88.91 90.08 88.82 89.91C88.79 89.85 88.77 89.65 88.97 89.65C89.05 89.65 89.08 89.6 89.05 89.54C89 89.43 89.01 89.36 89.12 89.27C89.25 89.18 89.13 89.13 89.03 89.11C88.98 89.1 88.89 89.14 88.89 89.04C88.88 88.99 88.9 88.92 88.94 88.9C89.01 88.86 89.04 88.96 89.09 88.97C89.3 89.03 89.51 89.1 89.66 88.88C89.76 88.71 89.95 88.69 90.09 88.61C90.09 88.55 90.06 88.54 90.02 88.55C89.97 88.57 89.9 88.6 89.89 88.52C89.89 88.45 89.94 88.39 90.01 88.4C90.08 88.4 90.14 88.44 90.21 88.46C90.32 88.5 90.43 88.61 90.55 88.46C90.66 88.31 90.5 88.2 90.49 88.08C90.49 88.03 90.43 88.03 90.38 88.05C90.25 88.08 90.12 88.08 89.99 88.06C89.9 88.04 89.78 88.08 89.81 88.22C89.83 88.35 89.72 88.36 89.69 88.33C89.44 88.12 89.13 88.26 88.87 88.15C88.78 88.12 88.68 88.14 88.68 87.97C88.68 87.81 88.49 87.88 88.39 87.86C88.3 87.85 88.21 87.84 88.19 87.94C88.17 88.03 88.23 88.11 88.3 88.17C88.4 88.25 88.51 88.33 88.62 88.41C88.68 88.45 88.73 88.52 88.69 88.59C88.64 88.69 88.55 88.62 88.5 88.59C88.34 88.48 88.2 88.44 88.03 88.61C87.95 88.7 87.52 88.43 87.48 88.29C87.44 88.16 87.55 88.19 87.6 88.17C87.91 88.05 87.95 87.94 87.75 87.67C87.7 87.6 87.69 87.55 87.78 87.51C87.8 87.49 87.83 87.48 87.85 87.47C87.99 87.42 88.11 87.36 88.05 87.18C87.99 87 87.86 87.17 87.74 87.14C87.79 86.96 87.82 86.78 87.88 86.62C87.94 86.46 87.89 86.4 87.75 86.33C87.55 86.24 87.6 86.41 87.57 86.49C87.48 86.7 87.42 86.91 87.18 87.01C87.11 87.04 87.05 87.1 86.97 87.04C86.92 87.02 86.86 87.03 86.87 87.09C86.89 87.33 86.75 87.27 86.61 87.24C86.57 87.23 86.5 87.24 86.49 87.26C86.38 87.47 86.14 87.57 85.99 87.79C86.3 87.68 86.33 87.87 86.35 88.06C86.37 88.17 86.03 88.44 85.9 88.43C85.81 88.41 85.73 88.36 85.65 88.46C85.53 88.62 85.41 88.57 85.3 88.45C85.25 88.39 85.13 88.34 85.19 88.23C85.25 88.12 85.32 88.22 85.39 88.25C85.44 88.27 85.48 88.26 85.5 88.21C85.53 88.16 85.5 88.13 85.45 88.11C85.34 88.06 85.26 87.99 85.24 87.86C85.21 87.76 85.09 87.72 85.02 87.75C84.81 87.87 84.7 87.72 84.63 87.59C84.55 87.44 84.46 87.25 84.32 87.2C83.95 87.06 83.79 86.69 83.49 86.48C83.43 86.44 83.06 86.64 83.02 86.75C83 86.8 83.01 86.88 82.94 86.85C82.86 86.83 82.87 86.75 82.91 86.69C83.09 86.4 82.83 86.37 82.68 86.37C82.42 86.38 82.44 86.27 82.51 86.07C82.28 86.13 82.09 86.27 81.87 86.21C81.83 86.12 81.9 86.1 81.93 86.07C82.15 85.83 82.15 85.69 81.91 85.47C81.76 85.33 81.65 85.17 81.66 84.95C81.79 85.24 82.34 85.16 82.23 85.67C82.49 85.46 82.64 85.6 82.76 85.77C82.86 85.91 82.99 86 83.16 85.99C83.33 85.98 83.41 86.12 83.53 86.19C83.9 86.37 84.22 86.61 84.5 86.91C84.61 87.03 84.62 87.12 84.54 87.23C84.62 87.3 84.66 87.25 84.68 87.21C84.77 87.07 84.87 87.05 84.97 87.19C85.09 87.37 85.36 87.3 85.48 87.51C85.48 87.52 85.55 87.51 85.57 87.49C85.62 87.46 85.59 87.41 85.57 87.37C85.47 87.11 85.43 86.9 85.82 86.88C85.97 86.88 86.09 86.37 86 86.24C85.88 86.09 85.8 85.93 85.54 85.93C85.4 85.93 85.19 85.86 85.07 85.7C85.05 85.67 85 85.63 84.96 85.63C84.79 85.63 84.67 85.56 84.65 85.37C84.64 85.31 84.01 84.97 83.94 84.98C83.78 84.99 83.66 84.97 83.66 84.77C83.66 84.69 83.6 84.64 83.53 84.64C83.24 84.63 83.25 84.43 83.31 84.24C83.38 84.01 83.26 83.99 83.09 84.01C83 84.02 82.91 84.02 82.83 84.07C82.71 84.14 82.61 84.11 82.52 84C82.39 83.82 82.21 83.74 82 83.69C81.84 83.66 81.76 83.45 81.85 83.32C81.9 83.26 81.89 83.21 81.84 83.16C81.79 83.1 81.74 83.05 81.69 83C81.63 82.95 81.61 82.8 81.49 82.91C81.39 83 81.43 83.08 81.51 83.17C81.55 83.21 81.64 83.27 81.53 83.33C81.44 83.38 81.44 83.31 81.4 83.26C81.27 83.08 81.19 83.32 81.05 83.31C81.1 83.19 81.05 83.08 81.04 82.96C81.02 82.71 81.02 82.57 80.74 82.81C80.61 82.93 80.43 82.81 80.38 82.66C80.31 82.48 80.24 82.42 80.05 82.48C79.86 82.53 79.67 82.56 79.57 82.3C79.53 82.21 79.38 82.18 79.25 82.21C79.13 82.23 78.98 82.18 78.98 82.05C78.96 81.77 78.79 81.58 78.69 81.35C78.78 81.34 78.88 81.33 78.97 81.33ZM127.01 112.79C127.02 112.93 127.21 112.91 127.21 113.06C127.22 113.15 127.31 113.09 127.34 113.03C127.36 112.96 127.32 112.87 127.44 112.89C127.5 112.9 127.56 112.91 127.57 112.97C127.57 113.05 127.56 113.14 127.45 113.15C127.32 113.17 127.38 113.24 127.41 113.31C127.53 113.52 127.62 113.37 127.72 113.29C127.76 113.25 127.81 113.17 127.87 113.27C127.91 113.33 127.9 113.39 127.81 113.4C127.65 113.42 127.7 113.52 127.73 113.62C127.76 113.74 127.8 113.79 127.93 113.73C128 113.7 128.07 113.74 128.13 113.79C128.26 113.94 128.43 113.98 128.61 113.91C128.75 113.86 128.87 113.98 128.86 114.05C128.85 114.26 129.01 114.31 129.13 114.4C129.17 114.43 129.24 114.48 129.23 114.51C129.17 114.81 129.44 114.82 129.59 114.88C129.88 114.98 129.99 115.11 129.93 115.42C129.89 115.56 129.89 115.65 130.1 115.68C130.28 115.71 130.49 115.82 130.6 115.97C130.69 116.09 130.77 116.02 130.85 116.02C130.86 116.12 130.71 116.31 130.89 116.26C131.19 116.18 131.06 116.34 131.04 116.44C131.02 116.53 131.05 116.58 131.12 116.61C131.2 116.65 131.28 116.63 131.3 116.56C131.36 116.37 131.43 116.49 131.51 116.54C131.6 116.61 131.63 116.7 131.66 116.81C131.68 116.87 131.71 116.99 131.8 116.95C131.98 116.86 132.12 116.73 132.2 116.54C132.26 116.39 132.11 116.34 132.02 116.27C131.89 116.15 131.73 116.06 131.56 115.98C131.4 115.89 131.22 115.79 131.08 115.68C130.94 115.57 130.79 115.38 130.74 115.16C130.72 115.1 130.67 115 130.6 115.11C130.56 115.18 130.54 115.2 130.47 115.15C130.42 115.09 130.36 115.03 130.46 114.97C130.53 114.92 130.56 114.84 130.48 114.81C130.21 114.72 130.14 114.4 129.87 114.31C129.82 114.3 129.74 114.27 129.74 114.2C129.74 113.97 129.56 113.93 129.41 113.91C129.16 113.86 129.08 113.61 128.88 113.51C128.78 113.45 128.73 113.32 128.9 113.24C128.94 113.21 128.95 113.17 128.94 113.12C128.92 112.95 128.97 112.88 129.15 112.96C129.3 113.02 129.37 112.96 129.35 112.79C129.34 112.67 129.28 112.52 129.49 112.48C129.57 112.47 129.52 112.37 129.52 112.31C129.52 112.23 129.45 112.25 129.4 112.27C129.32 112.31 129.22 112.28 129.24 112.21C129.29 112 129.31 111.91 129.02 111.9C128.88 111.9 128.71 111.84 128.57 112C128.51 112.06 128.4 112.11 128.44 112.22C128.51 112.39 128.51 112.38 128.35 112.44C128.61 112.45 128.56 112.74 128.72 112.83C128.79 112.87 128.82 112.91 128.8 112.98C128.77 113.07 128.69 113.04 128.64 113.04C128.55 113.06 128.5 113.02 128.5 112.93C128.49 112.69 128.4 112.62 128.21 112.8C128.12 112.88 128.03 112.89 127.94 112.85C127.82 112.8 127.84 112.7 127.85 112.6C127.89 112.3 127.65 112.13 127.4 112.27C127.3 112.33 127.05 112.36 127.15 112.6C127.17 112.66 127.33 112.64 127.26 112.77C127.19 112.89 127.1 112.72 127.01 112.79ZM83.48 62.18C83.32 62.09 83.25 61.99 83.31 61.82C83.33 61.77 83.29 61.69 83.27 61.62C83.08 61.72 83 61.48 82.87 61.49C82.57 61.5 82.7 61.39 82.79 61.28C82.83 61.22 82.87 61.16 82.8 61.11C82.73 61.07 82.69 61.14 82.65 61.18C82.56 61.29 82.41 61.33 82.32 61.47C82.26 61.58 82.09 61.66 81.92 61.56C81.89 61.54 81.73 61.48 81.75 61.58C81.83 61.84 81.55 61.99 81.58 62.23C81.59 62.34 81.52 62.34 81.44 62.35C81.24 62.38 81.19 62.56 81.17 62.7C81.14 62.84 81.31 62.82 81.41 62.84C81.48 62.84 81.48 62.89 81.48 62.95C81.48 63.01 81.8 63.2 81.86 63.2C82.13 63.21 82.32 63.15 82.19 62.82C82.33 62.79 82.4 62.87 82.48 62.93C82.6 63.01 82.73 63.03 82.84 62.91C83 62.74 83.22 62.63 83.2 62.34C83.19 62.17 83.36 62.22 83.48 62.18ZM82.98 63.37C83.1 63.42 83.06 63.48 82.94 63.52C82.88 63.54 82.82 63.55 82.86 63.63C82.89 63.69 82.95 63.72 83.02 63.67C83.1 63.62 83.16 63.54 83.26 63.5C83.32 63.47 83.36 63.47 83.38 63.54C83.41 63.6 83.39 63.65 83.33 63.66C83.23 63.67 83.14 63.7 83.1 63.78C82.97 64.01 82.69 64.21 82.43 64.21C82.32 64.21 82.3 64.23 82.32 64.35C82.37 64.66 82.63 64.87 82.66 65.18C82.67 65.25 82.68 65.33 82.77 65.34C82.86 65.35 82.91 65.28 82.94 65.23C83.07 64.94 83.27 64.68 83.24 64.35C83.24 64.27 83.3 64.24 83.35 64.21C83.54 64.09 83.76 64.04 83.92 63.87C83.93 63.86 84.01 63.88 84.01 63.82C84.01 63.77 83.96 63.74 83.91 63.75C83.77 63.76 83.73 63.72 83.67 63.58C83.56 63.36 83.29 63.29 83.07 63.19C83.01 63.17 82.93 63.22 82.89 63.28C82.85 63.32 82.88 63.36 82.98 63.37ZM105.35 66.89C105.34 66.75 105.46 66.69 105.39 66.61C105.37 66.59 105.32 66.58 105.29 66.59C105.07 66.66 104.86 67.01 104.95 67.25C105.02 67.42 104.95 67.86 105.39 67.64C105.65 67.82 105.62 67.52 105.72 67.44C105.74 67.42 105.68 67.3 105.8 67.3C105.85 67.3 105.9 67.29 105.92 67.34C105.96 67.42 105.89 67.45 105.85 67.5C105.77 67.61 105.75 67.72 105.93 67.75C106.14 67.78 106.21 67.6 106.29 67.48C106.39 67.35 106.25 67.27 106.17 67.23C106.01 67.16 105.96 67.08 106.03 66.92C106.09 66.77 106.04 66.69 105.86 66.67C105.67 66.66 105.51 66.69 105.35 66.89ZM132.29 117.76C132.5 117.55 132.65 117.62 132.78 117.73C133.1 117.97 133.15 117.96 133.3 117.59C133.3 117.58 133.32 117.58 133.35 117.57C133.5 117.7 133.37 117.84 133.35 117.98C133.34 118.04 133.31 118.11 133.39 118.13C133.46 118.15 133.49 118.1 133.52 118.05C133.6 117.91 133.61 117.74 133.61 117.59C133.61 117.46 133.44 117.49 133.35 117.43C133.29 117.39 133.22 117.35 133.19 117.3C133.08 117.13 132.95 117.04 132.74 117.08C132.8 116.8 132.8 116.8 132.53 116.78C132.5 116.78 132.41 116.82 132.43 116.72C132.44 116.67 132.5 116.61 132.41 116.59C132.35 116.57 132.33 116.64 132.3 116.69C132.26 116.75 132.21 116.82 132.17 116.88C132.14 116.93 132.05 116.97 132.11 117.04C132.16 117.11 132.22 116.98 132.28 117.04C132.24 117.14 132.15 117.25 132.26 117.35C132.38 117.45 132.35 117.56 132.29 117.76ZM133.78 87.56C133.79 87.54 133.83 87.5 133.83 87.47C133.79 87.27 133.64 87.13 133.51 86.98C133.43 86.88 133.34 86.99 133.26 87.05C133.19 87.11 133.1 87.07 133.03 87.04C132.81 86.95 132.71 87.02 132.71 87.26C132.71 87.32 132.68 87.38 132.64 87.43C132.54 87.54 132.6 87.62 132.69 87.7C132.92 87.92 133.5 87.86 133.78 87.56ZM68.97 71.51C68.96 71.51 68.92 71.51 68.89 71.5C68.66 71.41 68.65 71.65 68.55 71.74C68.46 71.81 68.39 71.91 68.49 72.02C68.57 72.11 68.67 72.19 68.79 72.11C68.88 72.07 68.97 72.05 68.99 72.15C69.02 72.31 69.09 72.31 69.21 72.26C69.32 72.22 69.43 72.29 69.5 72.36C69.61 72.48 69.76 72.49 69.88 72.55C69.95 72.58 70.01 72.57 70.05 72.51C70.09 72.44 70.02 72.41 69.99 72.36C69.87 72.15 69.55 72.09 69.56 71.78C69.56 71.77 69.51 71.75 69.5 71.76C69.25 71.87 69.11 71.73 68.97 71.51ZM131.79 114.66C131.76 114.77 131.93 114.79 131.84 114.89C131.76 114.98 131.66 114.97 131.6 114.91C131.4 114.7 131.37 115 131.24 115.03C131.19 115.04 131.25 115.17 131.31 115.14C131.55 115.01 131.62 115.19 131.66 115.35C131.69 115.48 131.89 115.27 131.85 115.48C131.81 115.67 131.94 115.68 132.08 115.63C132.17 115.61 132.28 115.54 132.33 115.61C132.49 115.85 132.52 115.59 132.59 115.54C132.7 115.48 132.67 115.37 132.61 115.29C132.47 115.11 132.47 115.42 132.34 115.35C132.33 115.26 132.45 114.98 132.15 115.15C132.14 115.16 132.1 115.13 132.09 115.11C132.08 115.06 132.08 115.02 132.14 115.01C132.29 114.98 132.22 114.86 132.21 114.79C132.2 114.7 132.12 114.67 132.02 114.68C131.95 114.69 131.87 114.67 131.79 114.66ZM132.44 115.98C132.4 116.02 132.32 116.04 132.36 116.12C132.4 116.2 132.47 116.16 132.53 116.17C132.61 116.18 132.75 116.11 132.69 116.33C132.64 116.51 132.82 116.6 132.96 116.55C133.11 116.5 133.25 116.45 133.39 116.4C133.46 116.37 133.54 116.31 133.5 116.24C133.46 116.17 133.54 116.01 133.37 116.03C133.27 116.05 133.31 115.99 133.31 115.94C133.32 115.73 133.25 115.6 133 115.65C132.92 115.67 132.87 115.62 132.81 115.59C132.74 115.55 132.69 115.58 132.64 115.63C132.61 115.67 132.56 115.73 132.63 115.77C132.8 115.89 132.7 115.9 132.58 115.88C132.5 115.87 132.47 115.92 132.44 115.98ZM141.25 123.51C141.27 123.36 141.38 123.39 141.44 123.35C141.55 123.3 141.6 123.37 141.57 123.46C141.52 123.58 141.39 123.7 141.53 123.79C141.64 123.86 141.74 123.95 141.86 124C141.9 124.02 141.96 124.04 142.01 123.99C142.03 123.96 142.04 123.92 142.02 123.89C141.8 123.62 141.88 123.33 141.99 123.05C142.02 122.95 142 122.84 141.93 122.8C141.8 122.74 141.86 122.88 141.83 122.93C141.81 122.95 141.79 122.96 141.76 122.97C141.56 123.05 141.38 123.19 141.14 123.17C141.05 123.16 141.02 123.22 141 123.3C140.97 123.43 141.07 123.48 141.14 123.53C141.2 123.58 141.24 123.55 141.25 123.51ZM123.94 108.91C123.61 109.03 123.56 109.38 123.31 109.54C123.29 109.55 123.29 109.62 123.31 109.64C123.43 109.77 123.68 109.73 123.74 109.95C123.74 109.95 123.8 109.94 123.81 109.93C123.87 109.72 123.99 109.81 124.1 109.87C124.19 109.93 124.26 109.87 124.32 109.83C124.41 109.76 124.31 109.71 124.3 109.65C124.23 109.37 123.83 109.27 123.94 108.91ZM108.73 97.47C108.62 97.36 108.68 97.15 108.5 97.08C108.36 97.03 108.3 96.93 108.33 96.77C108.35 96.68 108.36 96.51 108.17 96.65C108.09 96.7 108.03 96.68 108.04 96.57C108.04 96.5 108.01 96.44 107.94 96.43C107.77 96.41 107.77 96.34 107.86 96.22C107.89 96.17 107.88 96.11 107.82 96.09C107.77 96.07 107.73 96.11 107.72 96.16C107.69 96.31 107.71 96.48 107.51 96.54C107.48 96.56 107.51 96.67 107.56 96.71C107.93 96.99 108.28 97.29 108.73 97.47ZM106.43 95.81C106.5 95.91 106.55 96.09 106.67 96.1C106.86 96.12 106.91 96.2 106.86 96.37C107.03 96.32 107.07 96.18 107.12 96.09C107.25 96.09 107.17 96.31 107.3 96.25C107.44 96.18 107.6 96.12 107.7 95.98C107.74 95.93 107.75 95.88 107.7 95.83C107.67 95.8 107.61 95.78 107.58 95.81C107.36 96.01 107.32 95.82 107.29 95.66C107.26 95.53 107.21 95.49 107.06 95.52C106.97 95.55 106.85 95.48 106.9 95.68C106.92 95.77 106.81 95.86 106.67 95.83C106.6 95.81 106.53 95.73 106.43 95.81ZM76.09 75.31C76.19 75.22 76.21 75.18 76.25 75.16C76.48 75.04 76.39 74.96 76.23 74.85C76.05 74.74 75.91 74.59 75.76 74.44C75.62 74.3 75.46 74.11 75.19 74.16C75.11 74.18 75.06 74.19 75.03 74.27C75 74.36 75.03 74.43 75.11 74.48C75.16 74.51 75.23 74.51 75.28 74.54C75.46 74.67 75.56 74.92 75.84 74.89C75.85 74.89 75.84 75.04 75.95 75.03C76.1 75.02 76.12 75.11 76.09 75.31ZM161.3 139.83C161.3 139.81 161.32 139.76 161.31 139.74C161.18 139.6 161.26 139.48 161.34 139.35C161.49 139.11 161.27 138.9 161.25 138.67C161.25 138.58 161.14 138.64 161.07 138.7C160.91 138.84 160.81 139.05 160.6 139.15C160.55 139.17 160.52 139.26 160.6 139.27C160.73 139.28 160.77 139.47 160.94 139.42C160.99 139.4 161.04 139.52 161.03 139.59C161.01 139.7 161.09 139.76 161.13 139.83C161.17 139.91 161.23 139.89 161.3 139.83ZM80.54 81.78C80.43 81.77 80.25 81.6 80.27 81.84C80.28 81.97 80.17 82.29 80.54 82.23C80.64 82.21 80.71 82.29 80.73 82.41C80.74 82.5 80.81 82.55 80.91 82.53C80.99 82.51 81.05 82.46 81.02 82.38C80.97 82.24 80.97 82.09 80.86 81.98C80.74 81.87 80.63 81.76 80.79 81.58C80.83 81.53 80.79 81.48 80.73 81.46C80.67 81.45 80.62 81.39 80.56 81.45C80.45 81.54 80.56 81.65 80.54 81.78ZM127.96 115.69C128.11 115.91 128.32 115.89 128.45 115.77C128.6 115.61 128.46 115.5 128.32 115.36C128.22 115.26 128 115.23 128 115.01C128 114.93 127.86 114.98 127.79 114.95C127.75 114.93 127.68 115 127.7 115.02C127.9 115.21 127.6 115.6 127.96 115.69ZM134.77 117.01C134.72 116.97 134.34 117.06 134.29 117.14C134.27 117.17 134.28 117.21 134.31 117.23C134.52 117.31 134.41 117.42 134.36 117.55C134.31 117.68 134.27 117.82 134.52 117.82C134.85 117.82 134.93 117.76 134.89 117.45C134.87 117.3 134.9 117.14 134.77 117.01ZM157.19 108.56C157.23 108.47 157.26 108.38 157.31 108.3C157.37 108.21 157.48 108.13 157.37 108.02C157.28 107.92 157.15 107.86 157.02 107.86C156.88 107.87 156.89 108.01 156.86 108.11C156.85 108.15 156.85 108.21 156.82 108.24C156.72 108.37 156.68 108.5 156.84 108.6C157.07 108.75 157.29 108.72 157.42 108.55C157.42 108.54 157.4 108.52 157.39 108.5C157.31 108.47 157.28 108.6 157.19 108.56ZM127.5 114.58C127.22 114.34 127.24 114.86 127.02 114.78C126.99 114.77 126.93 114.92 126.98 114.99C127.01 115.03 127.06 115.07 127.11 115.08C127.17 115.1 127.18 115.13 127.15 115.17C127.09 115.26 127.07 115.35 127.18 115.4C127.3 115.45 127.41 115.4 127.51 115.34C127.56 115.3 127.55 114.63 127.5 114.58ZM140.1 123.19C140.14 123.28 140 123.43 140.12 123.45C140.23 123.48 140.36 123.51 140.47 123.49C140.56 123.48 140.55 123.31 140.53 123.26C140.47 123.11 140.39 122.95 140.18 123.02C140.08 123.05 140.01 123.04 140 122.95C139.97 122.69 139.77 122.79 139.65 122.8C139.53 122.8 139.51 122.94 139.5 123.06C139.6 123.06 139.63 123 139.67 122.97C139.75 122.91 139.82 122.9 139.8 123.02C139.76 123.34 139.93 123.27 140.1 123.19ZM133.49 116.93C133.54 116.98 133.46 117.06 133.54 117.09C133.64 117.14 134.1 117.02 134.17 116.94C134.25 116.85 134.21 116.77 134.17 116.69C134.13 116.61 134.08 116.59 133.99 116.63C133.83 116.71 133.64 116.7 133.47 116.66C133.35 116.63 133.27 116.67 133.24 116.77C133.2 116.89 133.33 116.87 133.39 116.9C133.43 116.92 133.46 116.92 133.49 116.93ZM101.32 91.97C101.2 92.08 101.21 92.32 101.34 92.32C101.48 92.32 101.6 92.38 101.73 92.39C101.92 92.39 102.05 92.19 101.94 92.04C101.83 91.91 101.63 91.89 101.52 91.75C101.5 91.72 101.44 91.78 101.42 91.82C101.4 91.88 101.37 91.94 101.32 91.97ZM196.85 158.98C196.81 158.95 196.75 158.9 196.69 158.87C196.63 158.84 196.56 158.84 196.52 158.9C196.47 158.96 196.48 159.03 196.53 159.07C196.73 159.21 196.8 159.44 196.93 159.63C196.99 159.7 197.05 159.81 197.14 159.72C197.21 159.64 197.33 159.53 197.22 159.39C197.1 159.25 196.98 159.12 196.85 158.98ZM106.05 90.81C106.05 91.1 105.67 91.14 105.66 91.43C105.66 91.5 105.51 91.56 105.59 91.63C105.66 91.7 105.78 91.66 105.87 91.62C106.02 91.56 106.13 91.38 106.33 91.49C106.34 91.49 106.39 91.45 106.39 91.42C106.4 91.4 106.37 91.34 106.35 91.34C106.02 91.29 106.09 91.04 106.05 90.81ZM110 98.51C109.9 98.61 109.83 98.7 109.92 98.84C110.01 98.98 110.11 98.94 110.24 98.89C110.33 98.86 110.41 98.82 110.46 98.75C110.52 98.66 110.71 98.66 110.66 98.54C110.63 98.44 110.49 98.51 110.4 98.49C110.37 98.49 110.34 98.48 110.33 98.46C110.19 98.32 110.09 98.39 110 98.51ZM134.09 118.57C134.15 118.41 134.02 118.25 133.96 118.09C133.93 117.99 133.79 117.95 133.73 118.07C133.64 118.23 133.48 118.39 133.55 118.56C133.62 118.71 133.95 118.71 134.09 118.57ZM88.27 62.69C88.36 62.6 88.4 62.55 88.37 62.49C88.35 62.45 88.31 62.42 88.26 62.43C88.14 62.46 88.07 62.42 88 62.31C87.94 62.21 87.82 62.25 87.73 62.27C87.63 62.3 87.64 62.38 87.64 62.47C87.63 62.55 87.61 62.65 87.72 62.66C87.92 62.68 88.14 62.89 88.27 62.69ZM116.66 101.83C116.57 101.83 116.49 101.83 116.41 101.83C116.36 101.82 116.32 101.84 116.32 101.89C116.33 101.94 116.34 102 116.37 102.01C116.52 102.09 116.67 102.2 116.84 102.06C116.88 102.02 117.03 101.61 116.99 101.6C116.86 101.54 116.69 101.53 116.58 101.59C116.44 101.68 116.67 101.72 116.66 101.83ZM83.45 83.71C83.48 83.76 83.53 83.78 83.55 83.76C83.67 83.61 83.81 83.7 83.94 83.73C84.02 83.74 84.08 83.7 84.11 83.63C84.15 83.54 84.08 83.52 84.02 83.49C83.92 83.44 83.85 83.35 83.73 83.32C83.6 83.28 83.48 83.27 83.39 83.39C83.28 83.52 83.49 83.6 83.45 83.71ZM135 117.86C134.98 117.96 134.88 118.05 134.96 118.1C135.07 118.17 135.14 118.21 135.11 118.35C135.09 118.42 135.18 118.46 135.24 118.42C135.32 118.36 135.47 118.49 135.46 118.36C135.46 118.2 135.48 118 135.34 117.86C135.22 117.74 135.11 117.87 135 117.86ZM199.95 156.24C200.13 156.58 200.21 156.98 200.57 157.28C200.54 157.06 200.55 156.9 200.67 156.72C200.21 156.84 200.23 156.34 199.95 156.24Z" />
		</g>
	</g>
</svg>