{
  "tags": {
    "allowUnknownTags": true,
    "dictionaries": ["jsdoc", "closure"]
  },
  "source": {
    "include": ["force-app/main/default/lwc"],
    "includePattern": ".+\\.js(doc|x)?$",
    "excludePattern": "(^|\\/|\\\\)_"
  },
  "plugins": [],
  "templates": {
    "cleverLinks": false,
    "monospaceLinks": false
  },
  "opts": {
    "destination": "docs",
    "recurse": true,
    "readme": "README.md"
  }
}
