{
    "rules": [
      {
        "rule-type": "selection",
        "rule-id": "1",
        "rule-name": "SelectTables",
        "object-locator": {
          "schema-name": "public",
          "table-name": "%"
        },
        "rule-action": "include"
      },
      {
        "rule-type": "transformation",
        "rule-id": "2",
        "rule-name": "TableMapping",
        "rule-action": "include",
        "rule-target": "schema.table",
        "object-locator": {
          "schema-name": "public",
          "table-name": "customers"
        }
      },
      {
        "rule-type": "transformation",
        "rule-id": "3",
        "rule-name": "TableMapping",
        "rule-action": "include",
        "rule-target": "schema.new_table",
        "object-locator": {
          "schema-name": "public",
          "table-name": "orders"
        }
      }
    ]
  }
  