{
    "$schema": "../../node_modules/ng-packagr/ng-package.schema.json",
    "dest": "../../dist/project-management",
    "lib": {
      "entryFile": "src/public-api.ts",
      "styleIncludePaths": ["styles.scss"]
    },
    "assets" :["styles.scss"]
  }