{
  "name": "",
  "author": "",
  "color": [
    "#222222",
    "#e84f4f",
    "#b7ce42",
    "#fea63c",
    "#66a9b9",
    "#b7416e",
    "#6d878d",
    "#cccccc",
    "#666666",
    "#d23d3d",
    "#bde077",
    "#ffe863",
    "#aaccbb",
    "#e16a98",
    "#42717b",
    "#ffffff"
  ],
  "foreground": "#cccccc",
  "background": "#111111"
}

